Skip to content

Console Output

Started by an SCM change
Started by an SCM change
Building remotely on hudson-slave2
Cleaning the workspace because project is configured to clean the workspace before each build.
Checkout:wtp-javaee-config-0.1.x / /opt/buildhomes/hudsonBuild/workspace/wtp-javaee-config-0.1.x - hudson.remoting.Channel@61305d5b:hudson-slave2
Using strategy: Default
Last Built Revision: Revision 55f13515d06357a999ef1cefb422c16fa523d62e (origin/master)
Checkout:wtp-javaee-config-0.1.x / /opt/buildhomes/hudsonBuild/workspace/wtp-javaee-config-0.1.x - hudson.remoting.LocalChannel@ebf9b8c
Cloning the remote Git repository
Cloning repository origin
Fetching upstream changes from git://git.eclipse.org/gitroot/webtools/org.eclipse.webtools.java-ee-config.git
Commencing build of Revision 55f13515d06357a999ef1cefb422c16fa523d62e (origin/master)
Checking out Revision 55f13515d06357a999ef1cefb422c16fa523d62e (origin/master)
Starting xvnc
[locks-and-latches] Checking to see if we really have the locks
[locks-and-latches] Have all the locks, build can start
[wtp-javaee-config-0.1.x] $ Xvnc :102 -geometry 1024x768 -depth 24 -ac
[wtp-javaee-config-0.1.x] $ ant -file build.xml -Dhttps.proxyPort=9898 -Dftp.proxyHost=proxy.eclipse.org -Dsign=true -DftpnonProxyHosts=*.eclipse.org -Dftp.proxyPort=9898 "-Dhttp.proxyHost=proxy.eclipse.org " -Ddownloads=/shared/technology/sapphire/downloads -DSigning.Library=sign-hudson.xml -Dhttp.proxyPort=9898 -DhttpnonProxyHosts=*.eclipse.org -Denv.JDK_16_HOME=/shared/common/jdk1.6.0_27.x86_64 -Dhttps.proxyHost=proxy.eclipse.org -DhttpsnonProxyHosts=*.eclipse.org -Dignore.checksum.issues=true hudson-build
_XSERVTransmkdir: Owner of /tmp/.X11-unix should be set to root
08/04/2015 11:11:11 Xvnc version X.org/xf4vnc custom version
08/04/2015 11:11:11 Copyright (C) 2001-2004 Alan Hourihane.
08/04/2015 11:11:11 Copyright (C) 2000-2004 Constantin Kaplinsky
08/04/2015 11:11:11 Copyright (C) 1999 AT&T Laboratories Cambridge
08/04/2015 11:11:11 All Rights Reserved.
08/04/2015 11:11:11 See http://www.tightvnc.com/ for information on TightVNC
08/04/2015 11:11:11 See http://xf4vnc.sf.net for xf4vnc-specific information
08/04/2015 11:11:11 Desktop name 'x11' (build:102)
08/04/2015 11:11:11 Protocol versions supported: 3.7, 3.3
08/04/2015 11:11:11 RGB format 8 8 8
08/04/2015 11:11:11 Listening for VNC connections on TCP port 6002
[dix] Could not init font path element /usr/share/fonts/TTF/, removing from list!
[dix] Could not init font path element /usr/share/fonts/OTF, removing from list!
(EE) config/hal: NewInputDeviceRequest failed (2)
(EE) config/hal: NewInputDeviceRequest failed (2)
Buildfile: build.xml

init-library:
     [echo] Building Sapphire releng Ant library...
    [mkdir] Created dir: /opt/buildhomes/hudsonBuild/workspace/wtp-javaee-config-0.1.x/releng/ant-library/bin
    [javac] Compiling 9 source files to /opt/buildhomes/hudsonBuild/workspace/wtp-javaee-config-0.1.x/releng/ant-library/bin
      [jar] Building jar: /opt/buildhomes/hudsonBuild/workspace/wtp-javaee-config-0.1.x/releng/ant-library/sapphire-releng-antlib.jar

init-jdk-16:
     [echo] Java 1.6 Compiler Path : /shared/common/jdk1.6.0_27.x86_64/bin/javac
     [echo] Java 1.6 System Classpath : /shared/common/jdk1.6.0_27.x86_64/jre/lib/alt-rt.jar:/shared/common/jdk1.6.0_27.x86_64/jre/lib/alt-string.jar:/shared/common/jdk1.6.0_27.x86_64/jre/lib/charsets.jar:/shared/common/jdk1.6.0_27.x86_64/jre/lib/deploy.jar:/shared/common/jdk1.6.0_27.x86_64/jre/lib/javaws.jar:/shared/common/jdk1.6.0_27.x86_64/jre/lib/jce.jar:/shared/common/jdk1.6.0_27.x86_64/jre/lib/jsse.jar:/shared/common/jdk1.6.0_27.x86_64/jre/lib/management-agent.jar:/shared/common/jdk1.6.0_27.x86_64/jre/lib/plugin.jar:/shared/common/jdk1.6.0_27.x86_64/jre/lib/resources.jar:/shared/common/jdk1.6.0_27.x86_64/jre/lib/rt.jar:/shared/common/jdk1.6.0_27.x86_64/lib/dt.jar:/shared/common/jdk1.6.0_27.x86_64/lib/htmlconverter.jar:/shared/common/jdk1.6.0_27.x86_64/lib/jconsole.jar:/shared/common/jdk1.6.0_27.x86_64/lib/sa-jdi.jar:/shared/common/jdk1.6.0_27.x86_64/lib/tools.jar

init:

clean-bootstrap:

clean-repository:

clean-target-platforms:

clean:

init-bootstrap-platform:
    [mkdir] Created dir: /opt/buildhomes/hudsonBuild/workspace/wtp-javaee-config-0.1.x/build/bootstrap
     [echo] Loading configuration kepler-sr2...
 [loadfile] Do not set property ignore.checksum.issues.list as its length is 0.
     [echo] Downloading from Eclipse... /eclipse/downloads/drops4/R-4.3.2-201402211700/org.eclipse.platform.source-4.3.2.zip
   [delete] Deleting: /shared/technology/sapphire/downloads/url-checksum.txt
     [echo] URL checksum... cc329359ca185f6421056e1b3ec1a858
      [get] Getting: http://www.eclipse.org/downloads/sums.php?file=/eclipse/downloads/drops4/R-4.3.2-201402211700/org.eclipse.platform.source-4.3.2.zip&type=md5
      [get] To: /shared/technology/sapphire/downloads/content-checksum.txt
   [delete] Deleting: /shared/technology/sapphire/downloads/content-checksum.txt
     [echo] Loading repository jar:file:/shared/technology/sapphire/downloads/cc329359ca185f6421056e1b3ec1a858!/ ...
 [loadfile] Do not set property ignore.checksum.issues.list as its length is 0.
     [echo] Downloading from Eclipse... /eclipse/downloads/drops4/R-4.3.2-201402211700/org.eclipse.jdt.source-4.3.2.zip
   [delete] Deleting: /shared/technology/sapphire/downloads/url-checksum.txt
     [echo] URL checksum... 179453d6170ca552a5634d4bc606aa88
      [get] Getting: http://www.eclipse.org/downloads/sums.php?file=/eclipse/downloads/drops4/R-4.3.2-201402211700/org.eclipse.jdt.source-4.3.2.zip&type=md5
      [get] To: /shared/technology/sapphire/downloads/content-checksum.txt
   [delete] Deleting: /shared/technology/sapphire/downloads/content-checksum.txt
     [echo] Loading repository jar:file:/shared/technology/sapphire/downloads/179453d6170ca552a5634d4bc606aa88!/ ...
 [loadfile] Do not set property ignore.checksum.issues.list as its length is 0.
     [echo] Downloading from Eclipse... /eclipse/downloads/drops4/R-4.3.2-201402211700/org.eclipse.pde.source-4.3.2.zip
   [delete] Deleting: /shared/technology/sapphire/downloads/url-checksum.txt
     [echo] URL checksum... ff632d40967e8e46a08c0eb78ece1720
      [get] Getting: http://www.eclipse.org/downloads/sums.php?file=/eclipse/downloads/drops4/R-4.3.2-201402211700/org.eclipse.pde.source-4.3.2.zip&type=md5
      [get] To: /shared/technology/sapphire/downloads/content-checksum.txt
   [delete] Deleting: /shared/technology/sapphire/downloads/content-checksum.txt
     [echo] Loading repository jar:file:/shared/technology/sapphire/downloads/ff632d40967e8e46a08c0eb78ece1720!/ ...
 [loadfile] Do not set property ignore.checksum.issues.list as its length is 0.
     [echo] Downloading from Eclipse... /tools/gef/downloads/drops/3.9.1/R201308190730/GEF-Update-3.9.1.zip
   [delete] Deleting: /shared/technology/sapphire/downloads/url-checksum.txt
     [echo] URL checksum... ab2bc1574188ffab601ab33aebde22f4
      [get] Getting: http://www.eclipse.org/downloads/sums.php?file=/tools/gef/downloads/drops/3.9.1/R201308190730/GEF-Update-3.9.1.zip&type=md5
      [get] To: /shared/technology/sapphire/downloads/content-checksum.txt
   [delete] Deleting: /shared/technology/sapphire/downloads/content-checksum.txt
     [echo] Loading repository jar:file:/shared/technology/sapphire/downloads/ab2bc1574188ffab601ab33aebde22f4!/ ...
 [loadfile] Do not set property ignore.checksum.issues.list as its length is 0.
     [echo] Downloading from Eclipse... /modeling/emf/emf/downloads/drops/2.9.2/R201402031126/emf-xsd-Update-2.9.2.zip
   [delete] Deleting: /shared/technology/sapphire/downloads/url-checksum.txt
     [echo] URL checksum... d5a9347f6d353cd7d7f4b9d103123ed4
      [get] Getting: http://www.eclipse.org/downloads/sums.php?file=/modeling/emf/emf/downloads/drops/2.9.2/R201402031126/emf-xsd-Update-2.9.2.zip&type=md5
      [get] To: /shared/technology/sapphire/downloads/content-checksum.txt
   [delete] Deleting: /shared/technology/sapphire/downloads/content-checksum.txt
     [echo] Loading repository jar:file:/shared/technology/sapphire/downloads/d5a9347f6d353cd7d7f4b9d103123ed4!/ ...
 [loadfile] Do not set property ignore.checksum.issues.list as its length is 0.
     [echo] Downloading from Eclipse... /webtools/downloads/drops/R3.5.2/R-3.5.2-20140217150812/wtp4x-repo-R-3.5.2-20140217150812.zip
   [delete] Deleting: /shared/technology/sapphire/downloads/url-checksum.txt
     [echo] URL checksum... b0f028b60693a24b9c53cde4312cb41c
      [get] Getting: http://www.eclipse.org/downloads/sums.php?file=/webtools/downloads/drops/R3.5.2/R-3.5.2-20140217150812/wtp4x-repo-R-3.5.2-20140217150812.zip&type=md5
      [get] To: /shared/technology/sapphire/downloads/content-checksum.txt
   [delete] Deleting: /shared/technology/sapphire/downloads/content-checksum.txt
     [echo] Loading repository jar:file:/shared/technology/sapphire/downloads/b0f028b60693a24b9c53cde4312cb41c!/ ...
 [loadfile] Do not set property ignore.checksum.issues.list as its length is 0.
     [echo] Downloading from Eclipse... /datatools/downloads/1.11/dtp-p2repo_1.11.2.zip
   [delete] Deleting: /shared/technology/sapphire/downloads/url-checksum.txt
     [echo] URL checksum... 1611cc458d4b5248a9759ff51f67800a
      [get] Getting: http://www.eclipse.org/downloads/sums.php?file=/datatools/downloads/1.11/dtp-p2repo_1.11.2.zip&type=md5
      [get] To: /shared/technology/sapphire/downloads/content-checksum.txt
   [delete] Deleting: /shared/technology/sapphire/downloads/content-checksum.txt
     [echo] Loading repository jar:file:/shared/technology/sapphire/downloads/1611cc458d4b5248a9759ff51f67800a!/ ...
 [loadfile] Do not set property ignore.checksum.issues.list as its length is 0.
     [echo] Downloading from Eclipse... /mylyn/drops/3.11.0/v20140314-2044/mylyn-3.11.0.v20140314-2044.zip
   [delete] Deleting: /shared/technology/sapphire/downloads/url-checksum.txt
     [echo] URL checksum... 99f1b845b9ebcb7bc32876964f77b420
      [get] Getting: http://www.eclipse.org/downloads/sums.php?file=/mylyn/drops/3.11.0/v20140314-2044/mylyn-3.11.0.v20140314-2044.zip&type=md5
      [get] To: /shared/technology/sapphire/downloads/content-checksum.txt
   [delete] Deleting: /shared/technology/sapphire/downloads/content-checksum.txt
     [echo] Loading repository jar:file:/shared/technology/sapphire/downloads/99f1b845b9ebcb7bc32876964f77b420!/ ...
 [loadfile] Do not set property ignore.checksum.issues.list as its length is 0.
     [echo] Downloading from Eclipse... /egit/updates/org.eclipse.egit.repository-3.3.2.201404171909-r.zip
   [delete] Deleting: /shared/technology/sapphire/downloads/url-checksum.txt
     [echo] URL checksum... b08f9c71bca1fad48e9e6121dc9bde55
      [get] Getting: http://www.eclipse.org/downloads/sums.php?file=/egit/updates/org.eclipse.egit.repository-3.3.2.201404171909-r.zip&type=md5
      [get] To: /shared/technology/sapphire/downloads/content-checksum.txt
   [delete] Deleting: /shared/technology/sapphire/downloads/content-checksum.txt
     [echo] Checksums did not match. Expected Unable. Got a98179c40aabee58028d030deb472566.
     [echo] Loading repository jar:file:/shared/technology/sapphire/downloads/b08f9c71bca1fad48e9e6121dc9bde55!/ ...
 [loadfile] Do not set property ignore.checksum.issues.list as its length is 0.
     [echo] Downloading from Eclipse... /sapphire/8.0.0.201406111147/sapphire-repository-8.0.0.201406111147.zip
   [delete] Deleting: /shared/technology/sapphire/downloads/url-checksum.txt
     [echo] URL checksum... fa243eb58e956042644c4ec586b10f81
      [get] Getting: http://www.eclipse.org/downloads/sums.php?file=/sapphire/8.0.0.201406111147/sapphire-repository-8.0.0.201406111147.zip&type=md5
      [get] To: /shared/technology/sapphire/downloads/content-checksum.txt
   [delete] Deleting: /shared/technology/sapphire/downloads/content-checksum.txt
     [echo] Checksums did not match. Expected Unable. Got b31240478ea495788f243c8d828bb835.
     [echo] Loading repository jar:file:/shared/technology/sapphire/downloads/fa243eb58e956042644c4ec586b10f81!/ ...
 [loadfile] Do not set property ignore.checksum.issues.list as its length is 0.
     [echo] Downloading from Eclipse... /eclipse/downloads/drops4/R-4.3.2-201402211700/eclipse-platform-4.3.2-linux-gtk-x86_64.tar.gz
   [delete] Deleting: /shared/technology/sapphire/downloads/url-checksum.txt
     [echo] URL checksum... 890f9a17dbfcf34232ad67ec03f61ef0
      [get] Getting: http://www.eclipse.org/downloads/sums.php?file=/eclipse/downloads/drops4/R-4.3.2-201402211700/eclipse-platform-4.3.2-linux-gtk-x86_64.tar.gz&type=md5
      [get] To: /shared/technology/sapphire/downloads/content-checksum.txt
   [delete] Deleting: /shared/technology/sapphire/downloads/content-checksum.txt
   [gunzip] Expanding /shared/technology/sapphire/downloads/890f9a17dbfcf34232ad67ec03f61ef0 to /shared/technology/sapphire/downloads/890f9a17dbfcf34232ad67ec03f61ef0.tar
    [untar] Expanding: /shared/technology/sapphire/downloads/890f9a17dbfcf34232ad67ec03f61ef0.tar into /opt/buildhomes/hudsonBuild/workspace/wtp-javaee-config-0.1.x/build/bootstrap
   [delete] Deleting: /shared/technology/sapphire/downloads/890f9a17dbfcf34232ad67ec03f61ef0.tar

build-repository:
    [mkdir] Created dir: /opt/buildhomes/hudsonBuild/workspace/wtp-javaee-config-0.1.x/build/target-kepler-sr2
 [loadfile] Do not set property ignore.checksum.issues.list as its length is 0.
     [echo] Downloading from Eclipse... /eclipse/downloads/drops4/R-4.3.2-201402211700/eclipse-platform-4.3.2-linux-gtk-x86_64.tar.gz
   [delete] Deleting: /shared/technology/sapphire/downloads/url-checksum.txt
     [echo] URL checksum... 890f9a17dbfcf34232ad67ec03f61ef0
      [get] Getting: http://www.eclipse.org/downloads/sums.php?file=/eclipse/downloads/drops4/R-4.3.2-201402211700/eclipse-platform-4.3.2-linux-gtk-x86_64.tar.gz&type=md5
      [get] To: /shared/technology/sapphire/downloads/content-checksum.txt
   [delete] Deleting: /shared/technology/sapphire/downloads/content-checksum.txt
   [gunzip] Expanding /shared/technology/sapphire/downloads/890f9a17dbfcf34232ad67ec03f61ef0 to /shared/technology/sapphire/downloads/890f9a17dbfcf34232ad67ec03f61ef0.tar
    [untar] Expanding: /shared/technology/sapphire/downloads/890f9a17dbfcf34232ad67ec03f61ef0.tar into /opt/buildhomes/hudsonBuild/workspace/wtp-javaee-config-0.1.x/build/target-kepler-sr2
   [delete] Deleting: /shared/technology/sapphire/downloads/890f9a17dbfcf34232ad67ec03f61ef0.tar
     [java] Installation failed.
     [java] The installable unit org.eclipse.sapphire.modeling.feature.group has not been found.
     [java] Application failed, log file location: /opt/buildhomes/hudsonBuild/workspace/wtp-javaee-config-0.1.x/build/bootstrap/configuration/1428505887982.log
     [java] 

BUILD FAILED
/opt/buildhomes/hudsonBuild/workspace/wtp-javaee-config-0.1.x/build.xml:65: The following error occurred while executing this line:
/opt/buildhomes/hudsonBuild/workspace/wtp-javaee-config-0.1.x/build.xml:90: The following error occurred while executing this line:
/opt/buildhomes/hudsonBuild/workspace/wtp-javaee-config-0.1.x/build.xml:611: The following error occurred while executing this line:
/opt/buildhomes/hudsonBuild/workspace/wtp-javaee-config-0.1.x/build.xml:595: The following error occurred while executing this line:
/opt/buildhomes/hudsonBuild/workspace/wtp-javaee-config-0.1.x/build.xml:1020: The following error occurred while executing this line:
/opt/buildhomes/hudsonBuild/workspace/wtp-javaee-config-0.1.x/build.xml:1035: The following error occurred while executing this line:
/opt/buildhomes/hudsonBuild/workspace/wtp-javaee-config-0.1.x/build.xml:1042: Java returned: 13

Total time: 35 seconds
[locks-and-latches] Releasing all the locks
[locks-and-latches] All the locks released
Terminating xvnc.
Archiving artifacts
Sending e-mails to: konstantin.komissarchik@oracle.com
[DEBUG] Skipping watched dependency update for build: wtp-javaee-config-0.1.x #1236 due to result: FAILURE
Finished: FAILURE