Skip to content

Console Output

Skipping 14,155 KB.. Full Log
leContainer$ContainerStartLevel.incStartLevel(ModuleContainer.java:1838)
16:10:02 [2022-03-30T20:10:02.232Z] 	at org.eclipse.osgi.container.ModuleContainer$ContainerStartLevel.incStartLevel(ModuleContainer.java:1779)
16:10:02 [2022-03-30T20:10:02.232Z] 	at org.eclipse.osgi.container.ModuleContainer$ContainerStartLevel.doContainerStartLevel(ModuleContainer.java:1743)
16:10:02 [2022-03-30T20:10:02.232Z] 	at org.eclipse.osgi.container.ModuleContainer$ContainerStartLevel.dispatchEvent(ModuleContainer.java:1665)
16:10:02 [2022-03-30T20:10:02.232Z] 	at org.eclipse.osgi.container.ModuleContainer$ContainerStartLevel.dispatchEvent(ModuleContainer.java:1)
16:10:02 [2022-03-30T20:10:02.232Z] 	at org.eclipse.osgi.framework.eventmgr.EventManager.dispatchEvent(EventManager.java:234)
16:10:02 [2022-03-30T20:10:02.232Z] 	at org.eclipse.osgi.framework.eventmgr.EventManager$EventThread.run(EventManager.java:345)
16:10:02 [2022-03-30T20:10:02.232Z] 
16:10:02 [2022-03-30T20:10:02.232Z] !ENTRY org.eclipse.ecf.provider.filetransfer.httpclient45.win32 4 0 2022-03-30 20:10:02.054
16:10:02 [2022-03-30T20:10:02.232Z] !MESSAGE FrameworkEvent ERROR
16:10:02 [2022-03-30T20:10:02.232Z] !STACK 0
16:10:02 [2022-03-30T20:10:02.232Z] org.osgi.framework.BundleException: Could not resolve module: org.eclipse.ecf.provider.filetransfer.httpclient45.win32 [137]
16:10:02 [2022-03-30T20:10:02.232Z]   Unresolved requirement: Require-Capability: eclipse.platform; filter:="(osgi.os=win32)"
16:10:02 [2022-03-30T20:10:02.232Z]   Unresolved requirement: Import-Package: org.apache.http.impl.auth.win; version="[4.5.0,5.0.0)"
16:10:02 [2022-03-30T20:10:02.232Z]     -> Export-Package: org.apache.http.impl.auth.win; bundle-symbolic-name="org.apache.httpcomponents.httpclient.win"; bundle-version="4.5.10.v20200113-2105"; version="4.5.10"; x-internal:="true"; uses:="org.apache.http,org.apache.http.auth,org.apache.http.client,org.apache.http.impl.auth,org.apache.http.protocol,org.apache.http.util"
16:10:02 [2022-03-30T20:10:02.232Z]        org.apache.httpcomponents.httpclient.win [36]
16:10:02 [2022-03-30T20:10:02.232Z]          Unresolved requirement: Require-Capability: eclipse.platform; filter:="(osgi.os=win32)"
16:10:02 [2022-03-30T20:10:02.232Z] 
16:10:02 [2022-03-30T20:10:02.232Z] 	at org.eclipse.osgi.container.Module.start(Module.java:463)
16:10:02 [2022-03-30T20:10:02.232Z] 	at org.eclipse.osgi.container.ModuleContainer$ContainerStartLevel$2.run(ModuleContainer.java:1845)
16:10:02 [2022-03-30T20:10:02.232Z] 	at org.eclipse.osgi.internal.framework.EquinoxContainerAdaptor$1$1.execute(EquinoxContainerAdaptor.java:136)
16:10:02 [2022-03-30T20:10:02.232Z] 	at org.eclipse.osgi.container.ModuleContainer$ContainerStartLevel.incStartLevel(ModuleContainer.java:1838)
16:10:02 [2022-03-30T20:10:02.232Z] 	at org.eclipse.osgi.container.ModuleContainer$ContainerStartLevel.incStartLevel(ModuleContainer.java:1779)
16:10:02 [2022-03-30T20:10:02.232Z] 	at org.eclipse.osgi.container.ModuleContainer$ContainerStartLevel.doContainerStartLevel(ModuleContainer.java:1743)
16:10:02 [2022-03-30T20:10:02.232Z] 	at org.eclipse.osgi.container.ModuleContainer$ContainerStartLevel.dispatchEvent(ModuleContainer.java:1665)
16:10:02 [2022-03-30T20:10:02.232Z] 	at org.eclipse.osgi.container.ModuleContainer$ContainerStartLevel.dispatchEvent(ModuleContainer.java:1)
16:10:02 [2022-03-30T20:10:02.232Z] 	at org.eclipse.osgi.framework.eventmgr.EventManager.dispatchEvent(EventManager.java:234)
16:10:02 [2022-03-30T20:10:02.233Z] 	at org.eclipse.osgi.framework.eventmgr.EventManager$EventThread.run(EventManager.java:345)
16:10:04 [2022-03-30T20:10:04.132Z] SWT SessionManagerDBus: Failed to connect to org.gnome.SessionManager: Failed to execute child process “dbus-launch” (No such file or directory)
16:10:04 [2022-03-30T20:10:04.132Z] SWT SessionManagerDBus: Failed to connect to org.xfce.SessionManager: Failed to execute child process “dbus-launch” (No such file or directory)
16:10:09 [2022-03-30T20:10:09.404Z] 
16:10:09 [2022-03-30T20:10:09.404Z] !ENTRY org.eclipse.urischeme 4 0 2022-03-30 20:10:09.150
16:10:09 [2022-03-30T20:10:09.405Z] !MESSAGE Cannot run program "xdg-mime": error=2, No such file or directory
16:10:09 [2022-03-30T20:10:09.405Z] !STACK 0
16:10:09 [2022-03-30T20:10:09.405Z] java.io.IOException: Cannot run program "xdg-mime": error=2, No such file or directory
16:10:09 [2022-03-30T20:10:09.405Z] 	at java.base/java.lang.ProcessBuilder.start(ProcessBuilder.java:1128)
16:10:09 [2022-03-30T20:10:09.405Z] 	at java.base/java.lang.ProcessBuilder.start(ProcessBuilder.java:1071)
16:10:09 [2022-03-30T20:10:09.405Z] 	at org.eclipse.urischeme.internal.registration.ProcessExecutor.execute(ProcessExecutor.java:36)
16:10:09 [2022-03-30T20:10:09.405Z] 	at org.eclipse.urischeme.internal.registration.RegistrationLinux.getRegisteredDesktopFileForScheme(RegistrationLinux.java:136)
16:10:09 [2022-03-30T20:10:09.405Z] 	at org.eclipse.urischeme.internal.registration.RegistrationLinux.determineHandlerLocation(RegistrationLinux.java:80)
16:10:09 [2022-03-30T20:10:09.405Z] 	at org.eclipse.urischeme.internal.registration.RegistrationLinux.getSchemesInformation(RegistrationLinux.java:69)
16:10:09 [2022-03-30T20:10:09.405Z] 	at org.eclipse.urischeme.AutoRegisterSchemeHandlersJob.run(AutoRegisterSchemeHandlersJob.java:63)
16:10:09 [2022-03-30T20:10:09.405Z] 	at org.eclipse.core.internal.jobs.Worker.run(Worker.java:63)
16:10:09 [2022-03-30T20:10:09.405Z] Caused by: java.io.IOException: error=2, No such file or directory
16:10:09 [2022-03-30T20:10:09.405Z] 	at java.base/java.lang.ProcessImpl.forkAndExec(Native Method)
16:10:09 [2022-03-30T20:10:09.405Z] 	at java.base/java.lang.ProcessImpl.<init>(ProcessImpl.java:340)
16:10:09 [2022-03-30T20:10:09.406Z] 	at java.base/java.lang.ProcessImpl.start(ProcessImpl.java:271)
16:10:09 [2022-03-30T20:10:09.406Z] 	at java.base/java.lang.ProcessBuilder.start(ProcessBuilder.java:1107)
16:10:09 [2022-03-30T20:10:09.406Z] 	... 7 more
16:10:09 [2022-03-30T20:10:09.406Z] 
16:10:09 [2022-03-30T20:10:09.406Z] (WebKitWebProcess:21080): GLib-WARNING **: 20:10:09.310: getpwuid_r(): failed due to unknown user id (1001250000)
16:10:09 [2022-03-30T20:10:09.980Z] Running org.eclipse.tracecompass.tmf.analysis.xml.ui.tests.XmlAnalysisUiPluginTest
16:10:09 [2022-03-30T20:10:09.980Z] Tests run: 2, Failures: 0, Errors: 0, Skipped: 0, Time elapsed: 0.098 s - in org.eclipse.tracecompass.tmf.analysis.xml.ui.tests.XmlAnalysisUiPluginTest
16:10:09 [2022-03-30T20:10:09.980Z] testTmfCorePluginId(org.eclipse.tracecompass.tmf.analysis.xml.ui.tests.XmlAnalysisUiPluginTest)  Time elapsed: 0.002 s
16:10:09 [2022-03-30T20:10:09.980Z] testGetDefault(org.eclipse.tracecompass.tmf.analysis.xml.ui.tests.XmlAnalysisUiPluginTest)  Time elapsed: 0.001 s
16:10:09 [2022-03-30T20:10:09.980Z] Running org.eclipse.tracecompass.tmf.analysis.xml.ui.tests.module.XmlAnalysisOutputSourceTest
16:10:10 [2022-03-30T20:10:10.238Z] Tests run: 1, Failures: 0, Errors: 0, Skipped: 0, Time elapsed: 0.209 s - in org.eclipse.tracecompass.tmf.analysis.xml.ui.tests.module.XmlAnalysisOutputSourceTest
16:10:10 [2022-03-30T20:10:10.238Z] testBuiltinOutput(org.eclipse.tracecompass.tmf.analysis.xml.ui.tests.module.XmlAnalysisOutputSourceTest)  Time elapsed: 0.208 s
16:10:10 [2022-03-30T20:10:10.238Z] 
16:10:10 [2022-03-30T20:10:10.238Z] Results:
16:10:10 [2022-03-30T20:10:10.238Z] 
16:10:10 [2022-03-30T20:10:10.496Z] Tests run: 3, Failures: 0, Errors: 0, Skipped: 0
16:10:10 [2022-03-30T20:10:10.496Z] 
16:10:10 [2022-03-30T20:10:10.496Z] 
16:10:10 [2022-03-30T20:10:10.496Z] !ENTRY org.eclipse.tracecompass.tmf.core 4 0 2022-03-30 20:10:10.258
16:10:10 [2022-03-30T20:10:10.496Z] !MESSAGE Unexpected error executing analysis with trace 
16:10:10 [2022-03-30T20:10:10.496Z] !STACK 0
16:10:10 [2022-03-30T20:10:10.496Z] java.lang.NullPointerException
16:10:10 [2022-03-30T20:10:10.496Z] 	at java.base/java.io.File.<init>(File.java:276)
16:10:10 [2022-03-30T20:10:10.496Z] 	at org.eclipse.tracecompass.tmf.core.statesystem.TmfStateSystemAnalysisModule.loadInitialState(TmfStateSystemAnalysisModule.java:625)
16:10:10 [2022-03-30T20:10:10.496Z] 	at org.eclipse.tracecompass.tmf.core.statesystem.TmfStateSystemAnalysisModule.build(TmfStateSystemAnalysisModule.java:573)
16:10:10 [2022-03-30T20:10:10.496Z] 	at org.eclipse.tracecompass.tmf.core.statesystem.TmfStateSystemAnalysisModule.createFullHistory(TmfStateSystemAnalysisModule.java:386)
16:10:10 [2022-03-30T20:10:10.496Z] 	at org.eclipse.tracecompass.tmf.core.statesystem.TmfStateSystemAnalysisModule.executeAnalysis(TmfStateSystemAnalysisModule.java:289)
16:10:10 [2022-03-30T20:10:10.496Z] 	at org.eclipse.tracecompass.tmf.core.analysis.TmfAbstractAnalysisModule$1.run(TmfAbstractAnalysisModule.java:394)
16:10:10 [2022-03-30T20:10:10.496Z] 	at org.eclipse.core.internal.jobs.Worker.run(Worker.java:63)
16:10:10 [2022-03-30T20:10:10.496Z] 
16:10:10 [2022-03-30T20:10:10.496Z] !ENTRY org.eclipse.tracecompass.tmf.core 4 0 2022-03-30 20:10:10.259
16:10:10 [2022-03-30T20:10:10.496Z] !MESSAGE Unexpected error executing analysis with trace 
16:10:10 [2022-03-30T20:10:10.496Z] !STACK 0
16:10:10 [2022-03-30T20:10:10.496Z] java.lang.NullPointerException
16:10:10 [2022-03-30T20:10:10.496Z] 	at java.base/java.io.File.<init>(File.java:276)
16:10:10 [2022-03-30T20:10:10.496Z] 	at org.eclipse.tracecompass.tmf.core.statesystem.TmfStateSystemAnalysisModule.loadInitialState(TmfStateSystemAnalysisModule.java:625)
16:10:10 [2022-03-30T20:10:10.496Z] 	at org.eclipse.tracecompass.tmf.core.statesystem.TmfStateSystemAnalysisModule.build(TmfStateSystemAnalysisModule.java:573)
16:10:10 [2022-03-30T20:10:10.496Z] 	at org.eclipse.tracecompass.tmf.core.statesystem.TmfStateSystemAnalysisModule.createFullHistory(TmfStateSystemAnalysisModule.java:386)
16:10:10 [2022-03-30T20:10:10.496Z] 	at org.eclipse.tracecompass.tmf.core.statesystem.TmfStateSystemAnalysisModule.executeAnalysis(TmfStateSystemAnalysisModule.java:289)
16:10:10 [2022-03-30T20:10:10.496Z] 	at org.eclipse.tracecompass.tmf.core.analysis.TmfAbstractAnalysisModule$1.run(TmfAbstractAnalysisModule.java:394)
16:10:10 [2022-03-30T20:10:10.496Z] 	at org.eclipse.core.internal.jobs.Worker.run(Worker.java:63)
16:10:10 [2022-03-30T20:10:10.496Z] 
16:10:10 [2022-03-30T20:10:10.496Z] !ENTRY org.eclipse.tracecompass.tmf.core 4 0 2022-03-30 20:10:10.263
16:10:10 [2022-03-30T20:10:10.496Z] !MESSAGE Exception executing analysis
16:10:10 [2022-03-30T20:10:10.496Z] !STACK 0
16:10:10 [2022-03-30T20:10:10.496Z] java.lang.NullPointerException
16:10:10 [2022-03-30T20:10:10.496Z] 	at java.base/java.io.File.<init>(File.java:276)
16:10:10 [2022-03-30T20:10:10.496Z] 	at org.eclipse.tracecompass.tmf.core.statesystem.TmfStateSystemAnalysisModule.loadInitialState(TmfStateSystemAnalysisModule.java:625)
16:10:10 [2022-03-30T20:10:10.496Z] 	at org.eclipse.tracecompass.tmf.core.statesystem.TmfStateSystemAnalysisModule.build(TmfStateSystemAnalysisModule.java:573)
16:10:10 [2022-03-30T20:10:10.496Z] 	at org.eclipse.tracecompass.tmf.core.statesystem.TmfStateSystemAnalysisModule.createFullHistory(TmfStateSystemAnalysisModule.java:386)
16:10:10 [2022-03-30T20:10:10.496Z] 	at org.eclipse.tracecompass.tmf.core.statesystem.TmfStateSystemAnalysisModule.executeAnalysis(TmfStateSystemAnalysisModule.java:289)
16:10:10 [2022-03-30T20:10:10.496Z] 	at org.eclipse.tracecompass.tmf.core.analysis.TmfAbstractAnalysisModule$1.run(TmfAbstractAnalysisModule.java:394)
16:10:10 [2022-03-30T20:10:10.496Z] 	at org.eclipse.core.internal.jobs.Worker.run(Worker.java:63)
16:10:10 [2022-03-30T20:10:10.496Z] 
16:10:10 [2022-03-30T20:10:10.496Z] !ENTRY org.eclipse.tracecompass.tmf.core 4 0 2022-03-30 20:10:10.263
16:10:10 [2022-03-30T20:10:10.496Z] !MESSAGE Exception executing analysis
16:10:10 [2022-03-30T20:10:10.496Z] !STACK 0
16:10:10 [2022-03-30T20:10:10.496Z] java.lang.NullPointerException
16:10:10 [2022-03-30T20:10:10.496Z] 	at java.base/java.io.File.<init>(File.java:276)
16:10:10 [2022-03-30T20:10:10.496Z] 	at org.eclipse.tracecompass.tmf.core.statesystem.TmfStateSystemAnalysisModule.loadInitialState(TmfStateSystemAnalysisModule.java:625)
16:10:10 [2022-03-30T20:10:10.497Z] 	at org.eclipse.tracecompass.tmf.core.statesystem.TmfStateSystemAnalysisModule.build(TmfStateSystemAnalysisModule.java:573)
16:10:10 [2022-03-30T20:10:10.497Z] 	at org.eclipse.tracecompass.tmf.core.statesystem.TmfStateSystemAnalysisModule.createFullHistory(TmfStateSystemAnalysisModule.java:386)
16:10:10 [2022-03-30T20:10:10.497Z] 	at org.eclipse.tracecompass.tmf.core.statesystem.TmfStateSystemAnalysisModule.executeAnalysis(TmfStateSystemAnalysisModule.java:289)
16:10:10 [2022-03-30T20:10:10.497Z] 	at org.eclipse.tracecompass.tmf.core.analysis.TmfAbstractAnalysisModule$1.run(TmfAbstractAnalysisModule.java:394)
16:10:10 [2022-03-30T20:10:10.497Z] 	at org.eclipse.core.internal.jobs.Worker.run(Worker.java:63)
16:10:11 [2022-03-30T20:10:11.063Z] 
16:10:11 [2022-03-30T20:10:11.063Z] !ENTRY org.eclipse.e4.ui.workbench 4 0 2022-03-30 20:10:10.774
16:10:11 [2022-03-30T20:10:11.063Z] !MESSAGE Failed to evaluate: ReferenceExpression [definitionId=org.eclipse.ui.ide.showInDefinition]
16:10:11 [2022-03-30T20:10:11.063Z] !STACK 0
16:10:11 [2022-03-30T20:10:11.063Z] org.eclipse.core.runtime.CoreException: Error evaluating Property [org.eclipse.ui.ide.page.activePreferencePage, type=class org.eclipse.swt.widgets.Shell, tester=org.eclipse.ui.internal.ide.handlers.PagePropertyTester@6dcc0619]
16:10:11 [2022-03-30T20:10:11.063Z] 	at org.eclipse.core.internal.expressions.Property.test(Property.java:68)
16:10:11 [2022-03-30T20:10:11.063Z] 	at org.eclipse.core.internal.expressions.TestExpression.evaluate(TestExpression.java:103)
16:10:11 [2022-03-30T20:10:11.063Z] 	at org.eclipse.core.internal.expressions.CompositeExpression.evaluateAnd(CompositeExpression.java:55)
16:10:11 [2022-03-30T20:10:11.063Z] 	at org.eclipse.core.internal.expressions.WithExpression.evaluate(WithExpression.java:81)
16:10:11 [2022-03-30T20:10:11.063Z] 	at org.eclipse.core.internal.expressions.CompositeExpression.evaluateOr(CompositeExpression.java:69)
16:10:11 [2022-03-30T20:10:11.063Z] 	at org.eclipse.core.internal.expressions.OrExpression.evaluate(OrExpression.java:25)
16:10:11 [2022-03-30T20:10:11.063Z] 	at org.eclipse.core.internal.expressions.ReferenceExpression.evaluate(ReferenceExpression.java:74)
16:10:11 [2022-03-30T20:10:11.063Z] 	at org.eclipse.ui.internal.services.EvaluationReference.evaluate(EvaluationReference.java:74)
16:10:11 [2022-03-30T20:10:11.063Z] 	at org.eclipse.ui.internal.services.EvaluationReference.evaluate(EvaluationReference.java:100)
16:10:11 [2022-03-30T20:10:11.063Z] 	at org.eclipse.ui.internal.services.EvaluationReference.changed(EvaluationReference.java:94)
16:10:11 [2022-03-30T20:10:11.063Z] 	at org.eclipse.e4.core.internal.contexts.TrackableComputationExt.update(TrackableComputationExt.java:108)
16:10:11 [2022-03-30T20:10:11.063Z] 	at org.eclipse.e4.core.internal.contexts.EclipseContext.processScheduled(EclipseContext.java:364)
16:10:11 [2022-03-30T20:10:11.063Z] 	at org.eclipse.e4.core.internal.contexts.EclipseContext.set(EclipseContext.java:379)
16:10:11 [2022-03-30T20:10:11.063Z] 	at org.eclipse.e4.core.internal.contexts.EclipseContext.dispose(EclipseContext.java:208)
16:10:11 [2022-03-30T20:10:11.063Z] 	at org.eclipse.e4.core.internal.contexts.EclipseContext.dispose(EclipseContext.java:171)
16:10:11 [2022-03-30T20:10:11.063Z] 	at org.eclipse.e4.core.internal.contexts.osgi.EclipseContextOSGi.dispose(EclipseContextOSGi.java:102)
16:10:11 [2022-03-30T20:10:11.063Z] 	at org.eclipse.e4.core.internal.contexts.osgi.EclipseContextOSGi.bundleChanged(EclipseContextOSGi.java:144)
16:10:11 [2022-03-30T20:10:11.063Z] 	at org.eclipse.osgi.internal.framework.BundleContextImpl.dispatchEvent(BundleContextImpl.java:974)
16:10:11 [2022-03-30T20:10:11.063Z] 	at org.eclipse.osgi.framework.eventmgr.EventManager.dispatchEvent(EventManager.java:234)
16:10:11 [2022-03-30T20:10:11.063Z] 	at org.eclipse.osgi.framework.eventmgr.ListenerQueue.dispatchEventSynchronous(ListenerQueue.java:151)
16:10:11 [2022-03-30T20:10:11.063Z] 	at org.eclipse.osgi.internal.framework.EquinoxEventPublisher.publishBundleEventPrivileged(EquinoxEventPublisher.java:236)
16:10:11 [2022-03-30T20:10:11.063Z] 	at org.eclipse.osgi.internal.framework.EquinoxEventPublisher.publishBundleEvent(EquinoxEventPublisher.java:142)
16:10:11 [2022-03-30T20:10:11.063Z] 	at org.eclipse.osgi.internal.framework.EquinoxEventPublisher.publishBundleEvent(EquinoxEventPublisher.java:134)
16:10:11 [2022-03-30T20:10:11.063Z] 	at org.eclipse.osgi.internal.framework.EquinoxContainerAdaptor.publishModuleEvent(EquinoxContainerAdaptor.java:217)
16:10:11 [2022-03-30T20:10:11.063Z] 	at org.eclipse.osgi.container.Module.publishEvent(Module.java:499)
16:10:11 [2022-03-30T20:10:11.063Z] 	at org.eclipse.osgi.container.Module.doStop(Module.java:658)
16:10:11 [2022-03-30T20:10:11.063Z] 	at org.eclipse.osgi.container.Module.stop(Module.java:521)
16:10:11 [2022-03-30T20:10:11.063Z] 	at org.eclipse.osgi.container.SystemModule.stop(SystemModule.java:207)
16:10:11 [2022-03-30T20:10:11.063Z] 	at org.eclipse.osgi.internal.framework.EquinoxBundle$SystemBundle$EquinoxSystemModule$1.run(EquinoxBundle.java:220)
16:10:11 [2022-03-30T20:10:11.063Z] 	at java.base/java.lang.Thread.run(Thread.java:834)
16:10:11 [2022-03-30T20:10:11.063Z] Caused by: org.eclipse.swt.SWTException: Invalid thread access
16:10:11 [2022-03-30T20:10:11.063Z] 	at org.eclipse.swt.SWT.error(SWT.java:4723)
16:10:11 [2022-03-30T20:10:11.063Z] 	at org.eclipse.swt.SWT.error(SWT.java:4638)
16:10:11 [2022-03-30T20:10:11.063Z] 	at org.eclipse.swt.SWT.error(SWT.java:4609)
16:10:11 [2022-03-30T20:10:11.063Z] 	at org.eclipse.swt.widgets.Widget.error(Widget.java:550)
16:10:11 [2022-03-30T20:10:11.063Z] 	at org.eclipse.swt.widgets.Widget.checkWidget(Widget.java:471)
16:10:11 [2022-03-30T20:10:11.063Z] 	at org.eclipse.swt.widgets.Widget.getData(Widget.java:576)
16:10:11 [2022-03-30T20:10:11.063Z] 	at org.eclipse.ui.internal.ide.handlers.PagePropertyTester.test(PagePropertyTester.java:39)
16:10:11 [2022-03-30T20:10:11.063Z] 	at org.eclipse.core.internal.expressions.Property.test(Property.java:65)
16:10:11 [2022-03-30T20:10:11.063Z] 	... 29 more
16:10:11 [2022-03-30T20:10:11.630Z] [INFO] All tests passed!
16:10:11 [2022-03-30T20:10:11.630Z] [INFO] 
16:10:11 [2022-03-30T20:10:11.630Z] [INFO] --- maven-install-plugin:2.5.2:install (default-install) @ org.eclipse.tracecompass.tmf.analysis.xml.ui.tests ---
16:10:11 [2022-03-30T20:10:11.630Z] [INFO] Installing /home/jenkins/agent/workspace/tracecompass-master-2020-06/tmf/org.eclipse.tracecompass.tmf.analysis.xml.ui.tests/target/org.eclipse.tracecompass.tmf.analysis.xml.ui.tests-1.0.4-SNAPSHOT.jar to /home/jenkins/.m2/repository/org/eclipse/tracecompass/org.eclipse.tracecompass.tmf.analysis.xml.ui.tests/1.0.4-SNAPSHOT/org.eclipse.tracecompass.tmf.analysis.xml.ui.tests-1.0.4-SNAPSHOT.jar
16:10:11 [2022-03-30T20:10:11.630Z] [INFO] Installing /home/jenkins/agent/workspace/tracecompass-master-2020-06/tmf/org.eclipse.tracecompass.tmf.analysis.xml.ui.tests/pom.xml to /home/jenkins/.m2/repository/org/eclipse/tracecompass/org.eclipse.tracecompass.tmf.analysis.xml.ui.tests/1.0.4-SNAPSHOT/org.eclipse.tracecompass.tmf.analysis.xml.ui.tests-1.0.4-SNAPSHOT.pom
16:10:11 [2022-03-30T20:10:11.630Z] [INFO] Installing /home/jenkins/agent/workspace/tracecompass-master-2020-06/tmf/org.eclipse.tracecompass.tmf.analysis.xml.ui.tests/target/org.eclipse.tracecompass.tmf.analysis.xml.ui.tests-1.0.4-SNAPSHOT-sources.jar to /home/jenkins/.m2/repository/org/eclipse/tracecompass/org.eclipse.tracecompass.tmf.analysis.xml.ui.tests/1.0.4-SNAPSHOT/org.eclipse.tracecompass.tmf.analysis.xml.ui.tests-1.0.4-SNAPSHOT-sources.jar
16:10:11 [2022-03-30T20:10:11.630Z] [INFO] Installing /home/jenkins/agent/workspace/tracecompass-master-2020-06/tmf/org.eclipse.tracecompass.tmf.analysis.xml.ui.tests/target/org.eclipse.tracecompass.tmf.analysis.xml.ui.tests-1.0.4-SNAPSHOT.jar.pack.gz to /home/jenkins/.m2/repository/org/eclipse/tracecompass/org.eclipse.tracecompass.tmf.analysis.xml.ui.tests/1.0.4-SNAPSHOT/org.eclipse.tracecompass.tmf.analysis.xml.ui.tests-1.0.4-SNAPSHOT-pack200.jar.pack.gz
16:10:11 [2022-03-30T20:10:11.631Z] [INFO] Installing /home/jenkins/agent/workspace/tracecompass-master-2020-06/tmf/org.eclipse.tracecompass.tmf.analysis.xml.ui.tests/target/p2content.xml to /home/jenkins/.m2/repository/org/eclipse/tracecompass/org.eclipse.tracecompass.tmf.analysis.xml.ui.tests/1.0.4-SNAPSHOT/org.eclipse.tracecompass.tmf.analysis.xml.ui.tests-1.0.4-SNAPSHOT-p2metadata.xml
16:10:11 [2022-03-30T20:10:11.631Z] [INFO] Installing /home/jenkins/agent/workspace/tracecompass-master-2020-06/tmf/org.eclipse.tracecompass.tmf.analysis.xml.ui.tests/target/p2artifacts.xml to /home/jenkins/.m2/repository/org/eclipse/tracecompass/org.eclipse.tracecompass.tmf.analysis.xml.ui.tests/1.0.4-SNAPSHOT/org.eclipse.tracecompass.tmf.analysis.xml.ui.tests-1.0.4-SNAPSHOT-p2artifacts.xml
16:10:11 [2022-03-30T20:10:11.631Z] [INFO] 
16:10:11 [2022-03-30T20:10:11.631Z] [INFO] --- tycho-p2-plugin:2.3.0:update-local-index (default-update-local-index) @ org.eclipse.tracecompass.tmf.analysis.xml.ui.tests ---
16:10:11 [2022-03-30T20:10:11.631Z] [INFO] 
16:10:11 [2022-03-30T20:10:11.631Z] [INFO] --< org.eclipse.tracecompass:org.eclipse.tracecompass.tmf.chart.ui.tests >--
16:10:11 [2022-03-30T20:10:11.631Z] [INFO] Building org.eclipse.tracecompass.tmf.chart.ui.tests 1.0.2-SNAPSHOT [131/139]
16:10:11 [2022-03-30T20:10:11.631Z] [INFO] ------------------------[ eclipse-test-plugin ]-------------------------
16:10:11 [2022-03-30T20:10:11.631Z] [INFO] 
16:10:11 [2022-03-30T20:10:11.631Z] [INFO] --- maven-clean-plugin:3.0.0:clean (default-clean) @ org.eclipse.tracecompass.tmf.chart.ui.tests ---
16:10:11 [2022-03-30T20:10:11.631Z] [INFO] 
16:10:11 [2022-03-30T20:10:11.631Z] [INFO] --- tycho-packaging-plugin:2.3.0:build-qualifier (default-build-qualifier) @ org.eclipse.tracecompass.tmf.chart.ui.tests ---
16:10:11 [2022-03-30T20:10:11.631Z] [INFO] The project's OSGi version is 1.0.2.202203301911
16:10:11 [2022-03-30T20:10:11.631Z] [INFO] 
16:10:11 [2022-03-30T20:10:11.631Z] [INFO] --- tycho-packaging-plugin:2.3.0:validate-id (default-validate-id) @ org.eclipse.tracecompass.tmf.chart.ui.tests ---
16:10:11 [2022-03-30T20:10:11.631Z] [INFO] 
16:10:11 [2022-03-30T20:10:11.631Z] [INFO] --- tycho-packaging-plugin:2.3.0:validate-version (default-validate-version) @ org.eclipse.tracecompass.tmf.chart.ui.tests ---
16:10:11 [2022-03-30T20:10:11.631Z] [INFO] 
16:10:11 [2022-03-30T20:10:11.631Z] [INFO] --- maven-enforcer-plugin:3.0.0-M3:enforce (enforce-maven-version) @ org.eclipse.tracecompass.tmf.chart.ui.tests ---
16:10:11 [2022-03-30T20:10:11.631Z] [INFO] 
16:10:11 [2022-03-30T20:10:11.631Z] [INFO] --- maven-resources-plugin:3.0.2:resources (default-resources) @ org.eclipse.tracecompass.tmf.chart.ui.tests ---
16:10:11 [2022-03-30T20:10:11.631Z] [INFO] Using 'UTF-8' encoding to copy filtered resources.
16:10:11 [2022-03-30T20:10:11.631Z] [INFO] skip non existing resourceDirectory /home/jenkins/agent/workspace/tracecompass-master-2020-06/tmf/org.eclipse.tracecompass.tmf.chart.ui.tests/src/main/resources
16:10:11 [2022-03-30T20:10:11.631Z] [INFO] 
16:10:11 [2022-03-30T20:10:11.631Z] [INFO] --- tycho-compiler-plugin:2.3.0:compile (default-compile) @ org.eclipse.tracecompass.tmf.chart.ui.tests ---
16:10:11 [2022-03-30T20:10:11.631Z] [INFO] Compiling 2 source files to /home/jenkins/agent/workspace/tracecompass-master-2020-06/tmf/org.eclipse.tracecompass.tmf.chart.ui.tests/target/classes
16:10:11 [2022-03-30T20:10:11.888Z] [INFO] 
16:10:11 [2022-03-30T20:10:11.888Z] [INFO] --- maven-resources-plugin:3.0.2:testResources (default-testResources) @ org.eclipse.tracecompass.tmf.chart.ui.tests ---
16:10:11 [2022-03-30T20:10:11.888Z] [INFO] Using 'UTF-8' encoding to copy filtered resources.
16:10:11 [2022-03-30T20:10:11.888Z] [INFO] skip non existing resourceDirectory /home/jenkins/agent/workspace/tracecompass-master-2020-06/tmf/org.eclipse.tracecompass.tmf.chart.ui.tests/src/test/resources
16:10:11 [2022-03-30T20:10:11.888Z] [INFO] 
16:10:11 [2022-03-30T20:10:11.888Z] [INFO] --- tycho-source-plugin:2.3.0:plugin-source (plugin-source) @ org.eclipse.tracecompass.tmf.chart.ui.tests ---
16:10:11 [2022-03-30T20:10:11.888Z] [INFO] Building jar: /home/jenkins/agent/workspace/tracecompass-master-2020-06/tmf/org.eclipse.tracecompass.tmf.chart.ui.tests/target/org.eclipse.tracecompass.tmf.chart.ui.tests-1.0.2-SNAPSHOT-sources.jar
16:10:11 [2022-03-30T20:10:11.888Z] [INFO] 
16:10:11 [2022-03-30T20:10:11.888Z] [INFO] --- target-platform-configuration:2.3.0:target-platform (default-target-platform) @ org.eclipse.tracecompass.tmf.chart.ui.tests ---
16:10:11 [2022-03-30T20:10:11.888Z] [INFO] 
16:10:11 [2022-03-30T20:10:11.888Z] [INFO] --- tycho-packaging-plugin:2.3.0:package-plugin (default-package-plugin) @ org.eclipse.tracecompass.tmf.chart.ui.tests ---
16:10:11 [2022-03-30T20:10:11.888Z] [INFO] Building jar: /home/jenkins/agent/workspace/tracecompass-master-2020-06/tmf/org.eclipse.tracecompass.tmf.chart.ui.tests/target/org.eclipse.tracecompass.tmf.chart.ui.tests-1.0.2-SNAPSHOT.jar
16:10:11 [2022-03-30T20:10:11.888Z] [INFO] 
16:10:11 [2022-03-30T20:10:11.888Z] [INFO] --- tycho-p2-plugin:2.3.0:p2-metadata-default (default-p2-metadata-default) @ org.eclipse.tracecompass.tmf.chart.ui.tests ---
16:10:11 [2022-03-30T20:10:11.888Z] [INFO] 
16:10:11 [2022-03-30T20:10:11.888Z] [INFO] --- tycho-source-feature-plugin:2.3.0:source-feature (source-feature) @ org.eclipse.tracecompass.tmf.chart.ui.tests ---
16:10:11 [2022-03-30T20:10:11.888Z] [WARNING] Mojo tycho-source-feature-plugin:source-feature is replaced by the tycho-source-plugin:feature-source which offers equivalent and even enhanced functionality
16:10:11 [2022-03-30T20:10:11.888Z] [INFO] 
16:10:11 [2022-03-30T20:10:11.888Z] [INFO] --- tycho-pack200b-plugin:2.3.0:pack (pack200-pack) @ org.eclipse.tracecompass.tmf.chart.ui.tests ---
16:10:11 [2022-03-30T20:10:11.888Z] [WARNING] Pack200 actions are deprecated and scheduled for removal.
16:10:11 [2022-03-30T20:10:11.888Z] [INFO] Pack200 packing jar /home/jenkins/agent/workspace/tracecompass-master-2020-06/tmf/org.eclipse.tracecompass.tmf.chart.ui.tests/target/org.eclipse.tracecompass.tmf.chart.ui.tests-1.0.2-SNAPSHOT.jar
16:10:11 [2022-03-30T20:10:11.888Z] [INFO] 
16:10:11 [2022-03-30T20:10:11.888Z] [INFO] --- tycho-p2-plugin:2.3.0:p2-metadata (p2-metadata) @ org.eclipse.tracecompass.tmf.chart.ui.tests ---
16:10:11 [2022-03-30T20:10:11.889Z] [INFO] 
16:10:11 [2022-03-30T20:10:11.889Z] [INFO] --- tycho-surefire-plugin:2.3.0:test (default-test) @ org.eclipse.tracecompass.tmf.chart.ui.tests ---
16:10:12 [2022-03-30T20:10:12.456Z] [INFO] Executing Test Runtime with timeout 0, logs (if any) will be placed at: /home/jenkins/agent/workspace/tracecompass-master-2020-06/tmf/org.eclipse.tracecompass.tmf.chart.ui.tests/target/work/data/.metadata/.log
16:10:12 [2022-03-30T20:10:12.456Z] [INFO] Command line:
16:10:12 [2022-03-30T20:10:12.456Z] 	[/opt/tools/java/openjdk/jdk-11/11.0.2+9/bin/java, -Dosgi.noShutdown=false, -Dosgi.os=linux, -Dosgi.ws=gtk, -Dosgi.arch=x86_64, -Dorg.eclipse.swt.browser.DefaultType=mozilla, -Xms512m, -Xmx1024m, -Dosgi.clean=true, -jar, /home/jenkins/.m2/repository/p2/osgi/bundle/org.eclipse.equinox.launcher/1.5.700.v20200207-2156/org.eclipse.equinox.launcher-1.5.700.v20200207-2156.jar, -data, /home/jenkins/agent/workspace/tracecompass-master-2020-06/tmf/org.eclipse.tracecompass.tmf.chart.ui.tests/target/work/data, -install, /home/jenkins/agent/workspace/tracecompass-master-2020-06/tmf/org.eclipse.tracecompass.tmf.chart.ui.tests/target/work, -configuration, /home/jenkins/agent/workspace/tracecompass-master-2020-06/tmf/org.eclipse.tracecompass.tmf.chart.ui.tests/target/work/configuration, -application, org.eclipse.tycho.surefire.osgibooter.uitest, -testproperties, /home/jenkins/agent/workspace/tracecompass-master-2020-06/tmf/org.eclipse.tracecompass.tmf.chart.ui.tests/target/surefire.properties, -product, org.eclipse.platform.ide, -consoleLog]
16:10:12 [2022-03-30T20:10:12.456Z] Picked up _JAVA_OPTIONS: -Duser.home=/home/tracecompass
16:10:15 [2022-03-30T20:10:15.244Z] !SESSION 2022-03-30 20:10:12.373 -----------------------------------------------
16:10:15 [2022-03-30T20:10:15.244Z] eclipse.buildId=unknown
16:10:15 [2022-03-30T20:10:15.244Z] java.version=11.0.2
16:10:15 [2022-03-30T20:10:15.244Z] java.vendor=Oracle Corporation
16:10:15 [2022-03-30T20:10:15.244Z] BootLoader constants: OS=linux, ARCH=x86_64, WS=gtk, NL=en_US
16:10:15 [2022-03-30T20:10:15.244Z] Framework arguments:  -application org.eclipse.tycho.surefire.osgibooter.uitest -testproperties /home/jenkins/agent/workspace/tracecompass-master-2020-06/tmf/org.eclipse.tracecompass.tmf.chart.ui.tests/target/surefire.properties -product org.eclipse.platform.ide
16:10:15 [2022-03-30T20:10:15.244Z] Command-line arguments:  -data /home/jenkins/agent/workspace/tracecompass-master-2020-06/tmf/org.eclipse.tracecompass.tmf.chart.ui.tests/target/work/data -application org.eclipse.tycho.surefire.osgibooter.uitest -testproperties /home/jenkins/agent/workspace/tracecompass-master-2020-06/tmf/org.eclipse.tracecompass.tmf.chart.ui.tests/target/surefire.properties -product org.eclipse.platform.ide -consoleLog
16:10:15 [2022-03-30T20:10:15.244Z] 
16:10:15 [2022-03-30T20:10:15.244Z] !ENTRY org.eclipse.compare.win32 4 0 2022-03-30 20:10:14.974
16:10:15 [2022-03-30T20:10:15.244Z] !MESSAGE FrameworkEvent ERROR
16:10:15 [2022-03-30T20:10:15.244Z] !STACK 0
16:10:15 [2022-03-30T20:10:15.244Z] org.osgi.framework.BundleException: Could not resolve module: org.eclipse.compare.win32 [65]
16:10:15 [2022-03-30T20:10:15.244Z]   Unresolved requirement: Require-Capability: eclipse.platform; filter:="(osgi.os=win32)"
16:10:15 [2022-03-30T20:10:15.244Z] 
16:10:15 [2022-03-30T20:10:15.244Z] 	at org.eclipse.osgi.container.Module.start(Module.java:463)
16:10:15 [2022-03-30T20:10:15.244Z] 	at org.eclipse.osgi.container.ModuleContainer$ContainerStartLevel$2.run(ModuleContainer.java:1845)
16:10:15 [2022-03-30T20:10:15.244Z] 	at org.eclipse.osgi.internal.framework.EquinoxContainerAdaptor$1$1.execute(EquinoxContainerAdaptor.java:136)
16:10:15 [2022-03-30T20:10:15.244Z] 	at org.eclipse.osgi.container.ModuleContainer$ContainerStartLevel.incStartLevel(ModuleContainer.java:1838)
16:10:15 [2022-03-30T20:10:15.244Z] 	at org.eclipse.osgi.container.ModuleContainer$ContainerStartLevel.incStartLevel(ModuleContainer.java:1779)
16:10:15 [2022-03-30T20:10:15.244Z] 	at org.eclipse.osgi.container.ModuleContainer$ContainerStartLevel.doContainerStartLevel(ModuleContainer.java:1743)
16:10:15 [2022-03-30T20:10:15.244Z] 	at org.eclipse.osgi.container.ModuleContainer$ContainerStartLevel.dispatchEvent(ModuleContainer.java:1665)
16:10:15 [2022-03-30T20:10:15.244Z] 	at org.eclipse.osgi.container.ModuleContainer$ContainerStartLevel.dispatchEvent(ModuleContainer.java:1)
16:10:15 [2022-03-30T20:10:15.244Z] 	at org.eclipse.osgi.framework.eventmgr.EventManager.dispatchEvent(EventManager.java:234)
16:10:15 [2022-03-30T20:10:15.244Z] 	at org.eclipse.osgi.framework.eventmgr.EventManager$EventThread.run(EventManager.java:345)
16:10:15 [2022-03-30T20:10:15.244Z] 
16:10:15 [2022-03-30T20:10:15.244Z] !ENTRY org.eclipse.ecf.provider.filetransfer.httpclient45.win32 4 0 2022-03-30 20:10:15.070
16:10:15 [2022-03-30T20:10:15.244Z] !MESSAGE FrameworkEvent ERROR
16:10:15 [2022-03-30T20:10:15.244Z] !STACK 0
16:10:15 [2022-03-30T20:10:15.244Z] org.osgi.framework.BundleException: Could not resolve module: org.eclipse.ecf.provider.filetransfer.httpclient45.win32 [137]
16:10:15 [2022-03-30T20:10:15.244Z]   Unresolved requirement: Require-Capability: eclipse.platform; filter:="(osgi.os=win32)"
16:10:15 [2022-03-30T20:10:15.244Z]   Unresolved requirement: Import-Package: org.apache.http.impl.auth.win; version="[4.5.0,5.0.0)"
16:10:15 [2022-03-30T20:10:15.244Z]     -> Export-Package: org.apache.http.impl.auth.win; bundle-symbolic-name="org.apache.httpcomponents.httpclient.win"; bundle-version="4.5.10.v20200113-2105"; version="4.5.10"; x-internal:="true"; uses:="org.apache.http,org.apache.http.auth,org.apache.http.client,org.apache.http.impl.auth,org.apache.http.protocol,org.apache.http.util"
16:10:15 [2022-03-30T20:10:15.244Z]        org.apache.httpcomponents.httpclient.win [36]
16:10:15 [2022-03-30T20:10:15.244Z]          Unresolved requirement: Require-Capability: eclipse.platform; filter:="(osgi.os=win32)"
16:10:15 [2022-03-30T20:10:15.244Z] 
16:10:15 [2022-03-30T20:10:15.244Z] 	at org.eclipse.osgi.container.Module.start(Module.java:463)
16:10:15 [2022-03-30T20:10:15.244Z] 	at org.eclipse.osgi.container.ModuleContainer$ContainerStartLevel$2.run(ModuleContainer.java:1845)
16:10:15 [2022-03-30T20:10:15.244Z] 	at org.eclipse.osgi.internal.framework.EquinoxContainerAdaptor$1$1.execute(EquinoxContainerAdaptor.java:136)
16:10:15 [2022-03-30T20:10:15.244Z] 	at org.eclipse.osgi.container.ModuleContainer$ContainerStartLevel.incStartLevel(ModuleContainer.java:1838)
16:10:15 [2022-03-30T20:10:15.244Z] 	at org.eclipse.osgi.container.ModuleContainer$ContainerStartLevel.incStartLevel(ModuleContainer.java:1779)
16:10:15 [2022-03-30T20:10:15.244Z] 	at org.eclipse.osgi.container.ModuleContainer$ContainerStartLevel.doContainerStartLevel(ModuleContainer.java:1743)
16:10:15 [2022-03-30T20:10:15.244Z] 	at org.eclipse.osgi.container.ModuleContainer$ContainerStartLevel.dispatchEvent(ModuleContainer.java:1665)
16:10:15 [2022-03-30T20:10:15.244Z] 	at org.eclipse.osgi.container.ModuleContainer$ContainerStartLevel.dispatchEvent(ModuleContainer.java:1)
16:10:15 [2022-03-30T20:10:15.244Z] 	at org.eclipse.osgi.framework.eventmgr.EventManager.dispatchEvent(EventManager.java:234)
16:10:15 [2022-03-30T20:10:15.244Z] 	at org.eclipse.osgi.framework.eventmgr.EventManager$EventThread.run(EventManager.java:345)
16:10:16 [2022-03-30T20:10:16.618Z] SWT SessionManagerDBus: Failed to connect to org.gnome.SessionManager: Failed to execute child process “dbus-launch” (No such file or directory)
16:10:16 [2022-03-30T20:10:16.618Z] SWT SessionManagerDBus: Failed to connect to org.xfce.SessionManager: Failed to execute child process “dbus-launch” (No such file or directory)
16:10:21 [2022-03-30T20:10:21.884Z] 
16:10:21 [2022-03-30T20:10:21.884Z] !ENTRY org.eclipse.urischeme 4 0 2022-03-30 20:10:21.846
16:10:21 [2022-03-30T20:10:21.884Z] !MESSAGE Cannot run program "xdg-mime": error=2, No such file or directory
16:10:21 [2022-03-30T20:10:21.884Z] !STACK 0
16:10:21 [2022-03-30T20:10:21.884Z] java.io.IOException: Cannot run program "xdg-mime": error=2, No such file or directory
16:10:21 [2022-03-30T20:10:21.884Z] 	at java.base/java.lang.ProcessBuilder.start(ProcessBuilder.java:1128)
16:10:21 [2022-03-30T20:10:21.884Z] 	at java.base/java.lang.ProcessBuilder.start(ProcessBuilder.java:1071)
16:10:21 [2022-03-30T20:10:21.884Z] 	at org.eclipse.urischeme.internal.registration.ProcessExecutor.execute(ProcessExecutor.java:36)
16:10:21 [2022-03-30T20:10:21.884Z] 	at org.eclipse.urischeme.internal.registration.RegistrationLinux.getRegisteredDesktopFileForScheme(RegistrationLinux.java:136)
16:10:21 [2022-03-30T20:10:21.884Z] 	at org.eclipse.urischeme.internal.registration.RegistrationLinux.determineHandlerLocation(RegistrationLinux.java:80)
16:10:21 [2022-03-30T20:10:21.884Z] 	at org.eclipse.urischeme.internal.registration.RegistrationLinux.getSchemesInformation(RegistrationLinux.java:69)
16:10:21 [2022-03-30T20:10:21.884Z] 	at org.eclipse.urischeme.AutoRegisterSchemeHandlersJob.run(AutoRegisterSchemeHandlersJob.java:63)
16:10:21 [2022-03-30T20:10:21.884Z] 	at org.eclipse.core.internal.jobs.Worker.run(Worker.java:63)
16:10:21 [2022-03-30T20:10:21.884Z] Caused by: java.io.IOException: error=2, No such file or directory
16:10:21 [2022-03-30T20:10:21.884Z] 	at java.base/java.lang.ProcessImpl.forkAndExec(Native Method)
16:10:21 [2022-03-30T20:10:21.884Z] 	at java.base/java.lang.ProcessImpl.<init>(ProcessImpl.java:340)
16:10:21 [2022-03-30T20:10:21.884Z] 	at java.base/java.lang.ProcessImpl.start(ProcessImpl.java:271)
16:10:21 [2022-03-30T20:10:21.884Z] 	at java.base/java.lang.ProcessBuilder.start(ProcessBuilder.java:1107)
16:10:21 [2022-03-30T20:10:21.884Z] 	... 7 more
16:10:22 [2022-03-30T20:10:22.142Z] 
16:10:22 [2022-03-30T20:10:22.142Z] (WebKitWebProcess:21194): GLib-WARNING **: 20:10:22.007: getpwuid_r(): failed due to unknown user id (1001250000)
16:10:22 [2022-03-30T20:10:22.400Z] Running org.eclipse.tracecompass.tmf.chart.ui.tests.data.ChartRangeTest
16:10:22 [2022-03-30T20:10:22.659Z] Tests run: 4, Failures: 0, Errors: 0, Skipped: 0, Time elapsed: 0.07 s - in org.eclipse.tracecompass.tmf.chart.ui.tests.data.ChartRangeTest
16:10:22 [2022-03-30T20:10:22.659Z] testClamp(org.eclipse.tracecompass.tmf.chart.ui.tests.data.ChartRangeTest)  Time elapsed: 0.005 s
16:10:22 [2022-03-30T20:10:22.659Z] testInvalidConstructor(org.eclipse.tracecompass.tmf.chart.ui.tests.data.ChartRangeTest)  Time elapsed: 0.001 s
16:10:22 [2022-03-30T20:10:22.659Z] testConstructor(org.eclipse.tracecompass.tmf.chart.ui.tests.data.ChartRangeTest)  Time elapsed: 0 s
16:10:22 [2022-03-30T20:10:22.659Z] testDefaultConstructor(org.eclipse.tracecompass.tmf.chart.ui.tests.data.ChartRangeTest)  Time elapsed: 0 s
16:10:22 [2022-03-30T20:10:22.659Z] 
16:10:22 [2022-03-30T20:10:22.659Z] Results:
16:10:22 [2022-03-30T20:10:22.659Z] 
16:10:22 [2022-03-30T20:10:22.659Z] Tests run: 4, Failures: 0, Errors: 0, Skipped: 0
16:10:22 [2022-03-30T20:10:22.659Z] 
16:10:24 [2022-03-30T20:10:24.031Z] [INFO] All tests passed!
16:10:24 [2022-03-30T20:10:24.031Z] [INFO] 
16:10:24 [2022-03-30T20:10:24.031Z] [INFO] --- maven-install-plugin:2.5.2:install (default-install) @ org.eclipse.tracecompass.tmf.chart.ui.tests ---
16:10:24 [2022-03-30T20:10:24.031Z] [INFO] Installing /home/jenkins/agent/workspace/tracecompass-master-2020-06/tmf/org.eclipse.tracecompass.tmf.chart.ui.tests/target/org.eclipse.tracecompass.tmf.chart.ui.tests-1.0.2-SNAPSHOT.jar to /home/jenkins/.m2/repository/org/eclipse/tracecompass/org.eclipse.tracecompass.tmf.chart.ui.tests/1.0.2-SNAPSHOT/org.eclipse.tracecompass.tmf.chart.ui.tests-1.0.2-SNAPSHOT.jar
16:10:24 [2022-03-30T20:10:24.031Z] [INFO] Installing /home/jenkins/agent/workspace/tracecompass-master-2020-06/tmf/org.eclipse.tracecompass.tmf.chart.ui.tests/pom.xml to /home/jenkins/.m2/repository/org/eclipse/tracecompass/org.eclipse.tracecompass.tmf.chart.ui.tests/1.0.2-SNAPSHOT/org.eclipse.tracecompass.tmf.chart.ui.tests-1.0.2-SNAPSHOT.pom
16:10:24 [2022-03-30T20:10:24.031Z] [INFO] Installing /home/jenkins/agent/workspace/tracecompass-master-2020-06/tmf/org.eclipse.tracecompass.tmf.chart.ui.tests/target/org.eclipse.tracecompass.tmf.chart.ui.tests-1.0.2-SNAPSHOT-sources.jar to /home/jenkins/.m2/repository/org/eclipse/tracecompass/org.eclipse.tracecompass.tmf.chart.ui.tests/1.0.2-SNAPSHOT/org.eclipse.tracecompass.tmf.chart.ui.tests-1.0.2-SNAPSHOT-sources.jar
16:10:24 [2022-03-30T20:10:24.031Z] [INFO] Installing /home/jenkins/agent/workspace/tracecompass-master-2020-06/tmf/org.eclipse.tracecompass.tmf.chart.ui.tests/target/org.eclipse.tracecompass.tmf.chart.ui.tests-1.0.2-SNAPSHOT.jar.pack.gz to /home/jenkins/.m2/repository/org/eclipse/tracecompass/org.eclipse.tracecompass.tmf.chart.ui.tests/1.0.2-SNAPSHOT/org.eclipse.tracecompass.tmf.chart.ui.tests-1.0.2-SNAPSHOT-pack200.jar.pack.gz
16:10:24 [2022-03-30T20:10:24.031Z] [INFO] Installing /home/jenkins/agent/workspace/tracecompass-master-2020-06/tmf/org.eclipse.tracecompass.tmf.chart.ui.tests/target/p2content.xml to /home/jenkins/.m2/repository/org/eclipse/tracecompass/org.eclipse.tracecompass.tmf.chart.ui.tests/1.0.2-SNAPSHOT/org.eclipse.tracecompass.tmf.chart.ui.tests-1.0.2-SNAPSHOT-p2metadata.xml
16:10:24 [2022-03-30T20:10:24.031Z] [INFO] Installing /home/jenkins/agent/workspace/tracecompass-master-2020-06/tmf/org.eclipse.tracecompass.tmf.chart.ui.tests/target/p2artifacts.xml to /home/jenkins/.m2/repository/org/eclipse/tracecompass/org.eclipse.tracecompass.tmf.chart.ui.tests/1.0.2-SNAPSHOT/org.eclipse.tracecompass.tmf.chart.ui.tests-1.0.2-SNAPSHOT-p2artifacts.xml
16:10:24 [2022-03-30T20:10:24.031Z] [INFO] 
16:10:24 [2022-03-30T20:10:24.031Z] [INFO] --- tycho-p2-plugin:2.3.0:update-local-index (default-update-local-index) @ org.eclipse.tracecompass.tmf.chart.ui.tests ---
16:10:24 [2022-03-30T20:10:24.031Z] [INFO] 
16:10:24 [2022-03-30T20:10:24.031Z] [INFO] --< org.eclipse.tracecompass:org.eclipse.tracecompass.tmf.remote.ui.swtbot.tests >--
16:10:24 [2022-03-30T20:10:24.031Z] [INFO] Building org.eclipse.tracecompass.tmf.remote.ui.swtbot.tests 1.0.9-SNAPSHOT [132/139]
16:10:24 [2022-03-30T20:10:24.031Z] [INFO] ------------------------[ eclipse-test-plugin ]-------------------------
16:10:24 [2022-03-30T20:10:24.032Z] [INFO] 
16:10:24 [2022-03-30T20:10:24.032Z] [INFO] --- maven-clean-plugin:3.0.0:clean (default-clean) @ org.eclipse.tracecompass.tmf.remote.ui.swtbot.tests ---
16:10:24 [2022-03-30T20:10:24.032Z] [INFO] 
16:10:24 [2022-03-30T20:10:24.032Z] [INFO] --- tycho-packaging-plugin:2.3.0:build-qualifier (default-build-qualifier) @ org.eclipse.tracecompass.tmf.remote.ui.swtbot.tests ---
16:10:24 [2022-03-30T20:10:24.032Z] [INFO] The project's OSGi version is 1.0.9.202203301911
16:10:24 [2022-03-30T20:10:24.032Z] [INFO] 
16:10:24 [2022-03-30T20:10:24.032Z] [INFO] --- tycho-packaging-plugin:2.3.0:validate-id (default-validate-id) @ org.eclipse.tracecompass.tmf.remote.ui.swtbot.tests ---
16:10:24 [2022-03-30T20:10:24.032Z] [INFO] 
16:10:24 [2022-03-30T20:10:24.032Z] [INFO] --- tycho-packaging-plugin:2.3.0:validate-version (default-validate-version) @ org.eclipse.tracecompass.tmf.remote.ui.swtbot.tests ---
16:10:24 [2022-03-30T20:10:24.032Z] [INFO] 
16:10:24 [2022-03-30T20:10:24.032Z] [INFO] --- maven-enforcer-plugin:3.0.0-M3:enforce (enforce-maven-version) @ org.eclipse.tracecompass.tmf.remote.ui.swtbot.tests ---
16:10:24 [2022-03-30T20:10:24.032Z] [INFO] 
16:10:24 [2022-03-30T20:10:24.032Z] [INFO] --- maven-resources-plugin:3.0.2:resources (default-resources) @ org.eclipse.tracecompass.tmf.remote.ui.swtbot.tests ---
16:10:24 [2022-03-30T20:10:24.032Z] [INFO] Using 'UTF-8' encoding to copy filtered resources.
16:10:24 [2022-03-30T20:10:24.032Z] [INFO] skip non existing resourceDirectory /home/jenkins/agent/workspace/tracecompass-master-2020-06/tmf/org.eclipse.tracecompass.tmf.remote.ui.swtbot.tests/src/main/resources
16:10:24 [2022-03-30T20:10:24.032Z] [INFO] 
16:10:24 [2022-03-30T20:10:24.032Z] [INFO] --- tycho-compiler-plugin:2.3.0:compile (default-compile) @ org.eclipse.tracecompass.tmf.remote.ui.swtbot.tests ---
16:10:24 [2022-03-30T20:10:24.032Z] [INFO] Compiling 2 source files to /home/jenkins/agent/workspace/tracecompass-master-2020-06/tmf/org.eclipse.tracecompass.tmf.remote.ui.swtbot.tests/target/classes
16:10:24 [2022-03-30T20:10:24.289Z] [INFO] 
16:10:24 [2022-03-30T20:10:24.289Z] [INFO] --- maven-resources-plugin:3.0.2:testResources (default-testResources) @ org.eclipse.tracecompass.tmf.remote.ui.swtbot.tests ---
16:10:24 [2022-03-30T20:10:24.289Z] [INFO] Using 'UTF-8' encoding to copy filtered resources.
16:10:24 [2022-03-30T20:10:24.289Z] [INFO] skip non existing resourceDirectory /home/jenkins/agent/workspace/tracecompass-master-2020-06/tmf/org.eclipse.tracecompass.tmf.remote.ui.swtbot.tests/src/test/resources
16:10:24 [2022-03-30T20:10:24.289Z] [INFO] 
16:10:24 [2022-03-30T20:10:24.289Z] [INFO] --- tycho-source-plugin:2.3.0:plugin-source (plugin-source) @ org.eclipse.tracecompass.tmf.remote.ui.swtbot.tests ---
16:10:24 [2022-03-30T20:10:24.289Z] [INFO] Building jar: /home/jenkins/agent/workspace/tracecompass-master-2020-06/tmf/org.eclipse.tracecompass.tmf.remote.ui.swtbot.tests/target/org.eclipse.tracecompass.tmf.remote.ui.swtbot.tests-1.0.9-SNAPSHOT-sources.jar
16:10:24 [2022-03-30T20:10:24.290Z] [INFO] 
16:10:24 [2022-03-30T20:10:24.290Z] [INFO] --- target-platform-configuration:2.3.0:target-platform (default-target-platform) @ org.eclipse.tracecompass.tmf.remote.ui.swtbot.tests ---
16:10:24 [2022-03-30T20:10:24.290Z] [INFO] 
16:10:24 [2022-03-30T20:10:24.290Z] [INFO] --- tycho-packaging-plugin:2.3.0:package-plugin (default-package-plugin) @ org.eclipse.tracecompass.tmf.remote.ui.swtbot.tests ---
16:10:24 [2022-03-30T20:10:24.290Z] [INFO] Building jar: /home/jenkins/agent/workspace/tracecompass-master-2020-06/tmf/org.eclipse.tracecompass.tmf.remote.ui.swtbot.tests/target/org.eclipse.tracecompass.tmf.remote.ui.swtbot.tests-1.0.9-SNAPSHOT.jar
16:10:24 [2022-03-30T20:10:24.290Z] [INFO] 
16:10:24 [2022-03-30T20:10:24.290Z] [INFO] --- tycho-p2-plugin:2.3.0:p2-metadata-default (default-p2-metadata-default) @ org.eclipse.tracecompass.tmf.remote.ui.swtbot.tests ---
16:10:24 [2022-03-30T20:10:24.290Z] [INFO] 
16:10:24 [2022-03-30T20:10:24.290Z] [INFO] --- tycho-source-feature-plugin:2.3.0:source-feature (source-feature) @ org.eclipse.tracecompass.tmf.remote.ui.swtbot.tests ---
16:10:24 [2022-03-30T20:10:24.290Z] [WARNING] Mojo tycho-source-feature-plugin:source-feature is replaced by the tycho-source-plugin:feature-source which offers equivalent and even enhanced functionality
16:10:24 [2022-03-30T20:10:24.290Z] [INFO] 
16:10:24 [2022-03-30T20:10:24.290Z] [INFO] --- tycho-pack200b-plugin:2.3.0:pack (pack200-pack) @ org.eclipse.tracecompass.tmf.remote.ui.swtbot.tests ---
16:10:24 [2022-03-30T20:10:24.290Z] [WARNING] Pack200 actions are deprecated and scheduled for removal.
16:10:24 [2022-03-30T20:10:24.290Z] [INFO] Pack200 packing jar /home/jenkins/agent/workspace/tracecompass-master-2020-06/tmf/org.eclipse.tracecompass.tmf.remote.ui.swtbot.tests/target/org.eclipse.tracecompass.tmf.remote.ui.swtbot.tests-1.0.9-SNAPSHOT.jar
16:10:24 [2022-03-30T20:10:24.290Z] [INFO] 
16:10:24 [2022-03-30T20:10:24.290Z] [INFO] --- tycho-p2-plugin:2.3.0:p2-metadata (p2-metadata) @ org.eclipse.tracecompass.tmf.remote.ui.swtbot.tests ---
16:10:24 [2022-03-30T20:10:24.290Z] [INFO] 
16:10:24 [2022-03-30T20:10:24.290Z] [INFO] --- tycho-surefire-plugin:2.3.0:test (default-test) @ org.eclipse.tracecompass.tmf.remote.ui.swtbot.tests ---
16:10:24 [2022-03-30T20:10:24.855Z] [INFO] Executing Test Runtime with timeout 0, logs (if any) will be placed at: /home/jenkins/agent/workspace/tracecompass-master-2020-06/tmf/org.eclipse.tracecompass.tmf.remote.ui.swtbot.tests/target/work/data/.metadata/.log
16:10:24 [2022-03-30T20:10:24.855Z] [INFO] Command line:
16:10:24 [2022-03-30T20:10:24.855Z] 	[/opt/tools/java/openjdk/jdk-11/11.0.2+9/bin/java, -Dosgi.noShutdown=false, -Dosgi.os=linux, -Dosgi.ws=gtk, -Dosgi.arch=x86_64, -Dorg.eclipse.swt.browser.DefaultType=mozilla, -Xms512m, -Xmx1024m, -Dosgi.clean=true, -jar, /home/jenkins/.m2/repository/p2/osgi/bundle/org.eclipse.equinox.launcher/1.5.700.v20200207-2156/org.eclipse.equinox.launcher-1.5.700.v20200207-2156.jar, -data, /home/jenkins/agent/workspace/tracecompass-master-2020-06/tmf/org.eclipse.tracecompass.tmf.remote.ui.swtbot.tests/target/work/data, -install, /home/jenkins/agent/workspace/tracecompass-master-2020-06/tmf/org.eclipse.tracecompass.tmf.remote.ui.swtbot.tests/target/work, -configuration, /home/jenkins/agent/workspace/tracecompass-master-2020-06/tmf/org.eclipse.tracecompass.tmf.remote.ui.swtbot.tests/target/work/configuration, -application, org.eclipse.tycho.surefire.osgibooter.uitest, -testproperties, /home/jenkins/agent/workspace/tracecompass-master-2020-06/tmf/org.eclipse.tracecompass.tmf.remote.ui.swtbot.tests/target/surefire.properties, -product, org.eclipse.platform.ide, -nouithread, -consoleLog]
16:10:24 [2022-03-30T20:10:24.856Z] Picked up _JAVA_OPTIONS: -Duser.home=/home/tracecompass
16:10:28 [2022-03-30T20:10:28.137Z] !SESSION 2022-03-30 20:10:24.807 -----------------------------------------------
16:10:28 [2022-03-30T20:10:28.137Z] eclipse.buildId=unknown
16:10:28 [2022-03-30T20:10:28.137Z] java.version=11.0.2
16:10:28 [2022-03-30T20:10:28.137Z] java.vendor=Oracle Corporation
16:10:28 [2022-03-30T20:10:28.137Z] BootLoader constants: OS=linux, ARCH=x86_64, WS=gtk, NL=en_US
16:10:28 [2022-03-30T20:10:28.137Z] Framework arguments:  -application org.eclipse.tycho.surefire.osgibooter.uitest -testproperties /home/jenkins/agent/workspace/tracecompass-master-2020-06/tmf/org.eclipse.tracecompass.tmf.remote.ui.swtbot.tests/target/surefire.properties -product org.eclipse.platform.ide -nouithread
16:10:28 [2022-03-30T20:10:28.137Z] Command-line arguments:  -data /home/jenkins/agent/workspace/tracecompass-master-2020-06/tmf/org.eclipse.tracecompass.tmf.remote.ui.swtbot.tests/target/work/data -application org.eclipse.tycho.surefire.osgibooter.uitest -testproperties /home/jenkins/agent/workspace/tracecompass-master-2020-06/tmf/org.eclipse.tracecompass.tmf.remote.ui.swtbot.tests/target/surefire.properties -product org.eclipse.platform.ide -nouithread -consoleLog
16:10:28 [2022-03-30T20:10:28.137Z] 
16:10:28 [2022-03-30T20:10:28.137Z] !ENTRY org.eclipse.compare.win32 4 0 2022-03-30 20:10:27.643
16:10:28 [2022-03-30T20:10:28.137Z] !MESSAGE FrameworkEvent ERROR
16:10:28 [2022-03-30T20:10:28.137Z] !STACK 0
16:10:28 [2022-03-30T20:10:28.137Z] org.osgi.framework.BundleException: Could not resolve module: org.eclipse.compare.win32 [65]
16:10:28 [2022-03-30T20:10:28.137Z]   Unresolved requirement: Require-Capability: eclipse.platform; filter:="(osgi.os=win32)"
16:10:28 [2022-03-30T20:10:28.137Z] 
16:10:28 [2022-03-30T20:10:28.137Z] 	at org.eclipse.osgi.container.Module.start(Module.java:463)
16:10:28 [2022-03-30T20:10:28.137Z] 	at org.eclipse.osgi.container.ModuleContainer$ContainerStartLevel$2.run(ModuleContainer.java:1845)
16:10:28 [2022-03-30T20:10:28.137Z] 	at org.eclipse.osgi.internal.framework.EquinoxContainerAdaptor$1$1.execute(EquinoxContainerAdaptor.java:136)
16:10:28 [2022-03-30T20:10:28.137Z] 	at org.eclipse.osgi.container.ModuleContainer$ContainerStartLevel.incStartLevel(ModuleContainer.java:1838)
16:10:28 [2022-03-30T20:10:28.137Z] 	at org.eclipse.osgi.container.ModuleContainer$ContainerStartLevel.incStartLevel(ModuleContainer.java:1779)
16:10:28 [2022-03-30T20:10:28.137Z] 	at org.eclipse.osgi.container.ModuleContainer$ContainerStartLevel.doContainerStartLevel(ModuleContainer.java:1743)
16:10:28 [2022-03-30T20:10:28.137Z] 	at org.eclipse.osgi.container.ModuleContainer$ContainerStartLevel.dispatchEvent(ModuleContainer.java:1665)
16:10:28 [2022-03-30T20:10:28.137Z] 	at org.eclipse.osgi.container.ModuleContainer$ContainerStartLevel.dispatchEvent(ModuleContainer.java:1)
16:10:28 [2022-03-30T20:10:28.137Z] 	at org.eclipse.osgi.framework.eventmgr.EventManager.dispatchEvent(EventManager.java:234)
16:10:28 [2022-03-30T20:10:28.137Z] 	at org.eclipse.osgi.framework.eventmgr.EventManager$EventThread.run(EventManager.java:345)
16:10:28 [2022-03-30T20:10:28.137Z] 
16:10:28 [2022-03-30T20:10:28.137Z] !ENTRY org.eclipse.ecf.provider.filetransfer.httpclient45.win32 4 0 2022-03-30 20:10:27.674
16:10:28 [2022-03-30T20:10:28.137Z] !MESSAGE FrameworkEvent ERROR
16:10:28 [2022-03-30T20:10:28.137Z] !STACK 0
16:10:28 [2022-03-30T20:10:28.137Z] org.osgi.framework.BundleException: Could not resolve module: org.eclipse.ecf.provider.filetransfer.httpclient45.win32 [137]
16:10:28 [2022-03-30T20:10:28.137Z]   Unresolved requirement: Require-Capability: eclipse.platform; filter:="(osgi.os=win32)"
16:10:28 [2022-03-30T20:10:28.137Z]   Unresolved requirement: Import-Package: org.apache.http.impl.auth.win; version="[4.5.0,5.0.0)"
16:10:28 [2022-03-30T20:10:28.137Z]     -> Export-Package: org.apache.http.impl.auth.win; bundle-symbolic-name="org.apache.httpcomponents.httpclient.win"; bundle-version="4.5.10.v20200113-2105"; version="4.5.10"; x-internal:="true"; uses:="org.apache.http,org.apache.http.auth,org.apache.http.client,org.apache.http.impl.auth,org.apache.http.protocol,org.apache.http.util"
16:10:28 [2022-03-30T20:10:28.137Z]        org.apache.httpcomponents.httpclient.win [36]
16:10:28 [2022-03-30T20:10:28.137Z]          Unresolved requirement: Require-Capability: eclipse.platform; filter:="(osgi.os=win32)"
16:10:28 [2022-03-30T20:10:28.137Z] 
16:10:28 [2022-03-30T20:10:28.137Z] 	at org.eclipse.osgi.container.Module.start(Module.java:463)
16:10:28 [2022-03-30T20:10:28.137Z] 	at org.eclipse.osgi.container.ModuleContainer$ContainerStartLevel$2.run(ModuleContainer.java:1845)
16:10:28 [2022-03-30T20:10:28.137Z] 	at org.eclipse.osgi.internal.framework.EquinoxContainerAdaptor$1$1.execute(EquinoxContainerAdaptor.java:136)
16:10:28 [2022-03-30T20:10:28.137Z] 	at org.eclipse.osgi.container.ModuleContainer$ContainerStartLevel.incStartLevel(ModuleContainer.java:1838)
16:10:28 [2022-03-30T20:10:28.137Z] 	at org.eclipse.osgi.container.ModuleContainer$ContainerStartLevel.incStartLevel(ModuleContainer.java:1779)
16:10:28 [2022-03-30T20:10:28.138Z] 	at org.eclipse.osgi.container.ModuleContainer$ContainerStartLevel.doContainerStartLevel(ModuleContainer.java:1743)
16:10:28 [2022-03-30T20:10:28.138Z] 	at org.eclipse.osgi.container.ModuleContainer$ContainerStartLevel.dispatchEvent(ModuleContainer.java:1665)
16:10:28 [2022-03-30T20:10:28.138Z] 	at org.eclipse.osgi.container.ModuleContainer$ContainerStartLevel.dispatchEvent(ModuleContainer.java:1)
16:10:28 [2022-03-30T20:10:28.138Z] 	at org.eclipse.osgi.framework.eventmgr.EventManager.dispatchEvent(EventManager.java:234)
16:10:28 [2022-03-30T20:10:28.138Z] 	at org.eclipse.osgi.framework.eventmgr.EventManager$EventThread.run(EventManager.java:345)
16:10:29 [2022-03-30T20:10:29.513Z] SWT SessionManagerDBus: Failed to connect to org.gnome.SessionManager: Failed to execute child process “dbus-launch” (No such file or directory)
16:10:29 [2022-03-30T20:10:29.513Z] SWT SessionManagerDBus: Failed to connect to org.xfce.SessionManager: Failed to execute child process “dbus-launch” (No such file or directory)
16:10:36 [2022-03-30T20:10:36.070Z] 
16:10:36 [2022-03-30T20:10:36.070Z] !ENTRY org.eclipse.urischeme 4 0 2022-03-30 20:10:35.585
16:10:36 [2022-03-30T20:10:36.070Z] !MESSAGE Cannot run program "xdg-mime": error=2, No such file or directory
16:10:36 [2022-03-30T20:10:36.070Z] !STACK 0
16:10:36 [2022-03-30T20:10:36.070Z] java.io.IOException: Cannot run program "xdg-mime": error=2, No such file or directory
16:10:36 [2022-03-30T20:10:36.070Z] 	at java.base/java.lang.ProcessBuilder.start(ProcessBuilder.java:1128)
16:10:36 [2022-03-30T20:10:36.070Z] 	at java.base/java.lang.ProcessBuilder.start(ProcessBuilder.java:1071)
16:10:36 [2022-03-30T20:10:36.070Z] 	at org.eclipse.urischeme.internal.registration.ProcessExecutor.execute(ProcessExecutor.java:36)
16:10:36 [2022-03-30T20:10:36.070Z] 	at org.eclipse.urischeme.internal.registration.RegistrationLinux.getRegisteredDesktopFileForScheme(RegistrationLinux.java:136)
16:10:36 [2022-03-30T20:10:36.070Z] 	at org.eclipse.urischeme.internal.registration.RegistrationLinux.determineHandlerLocation(RegistrationLinux.java:80)
16:10:36 [2022-03-30T20:10:36.070Z] 	at org.eclipse.urischeme.internal.registration.RegistrationLinux.getSchemesInformation(RegistrationLinux.java:69)
16:10:36 [2022-03-30T20:10:36.070Z] 	at org.eclipse.urischeme.AutoRegisterSchemeHandlersJob.run(AutoRegisterSchemeHandlersJob.java:63)
16:10:36 [2022-03-30T20:10:36.070Z] 	at org.eclipse.core.internal.jobs.Worker.run(Worker.java:63)
16:10:36 [2022-03-30T20:10:36.070Z] Caused by: java.io.IOException: error=2, No such file or directory
16:10:36 [2022-03-30T20:10:36.070Z] 	at java.base/java.lang.ProcessImpl.forkAndExec(Native Method)
16:10:36 [2022-03-30T20:10:36.070Z] 	at java.base/java.lang.ProcessImpl.<init>(ProcessImpl.java:340)
16:10:36 [2022-03-30T20:10:36.070Z] 	at java.base/java.lang.ProcessImpl.start(ProcessImpl.java:271)
16:10:36 [2022-03-30T20:10:36.070Z] 	at java.base/java.lang.ProcessBuilder.start(ProcessBuilder.java:1107)
16:10:36 [2022-03-30T20:10:36.070Z] 	... 7 more
16:10:36 [2022-03-30T20:10:36.070Z] 
16:10:36 [2022-03-30T20:10:36.070Z] (WebKitWebProcess:21301): GLib-WARNING **: 20:10:35.860: getpwuid_r(): failed due to unknown user id (1001250000)
16:10:36 [2022-03-30T20:10:36.070Z] Running org.eclipse.tracecompass.tmf.remote.ui.swtbot.tests.fetch.FetchRemoteTracesTest
16:10:36 [2022-03-30T20:10:36.070Z] 
16:10:36 [2022-03-30T20:10:36.070Z] !ENTRY org.eclipse.e4.ui.workbench 2 0 2022-03-30 20:10:35.962
16:10:36 [2022-03-30T20:10:36.070Z] !MESSAGE Removing PartDescriptorImpl with the "org.eclipse.tracecompass.tmf.ui.swtbot.tests.views.xychart.stub" id and the "XY Chart View Stub" label.It points to the non available "bundleclass://org.eclipse.ui.workbench/org.eclipse.ui.internal.e4.compatibility.CompatibilityView" class. Bundle might have been uninstalled
16:10:36 [2022-03-30T20:10:36.636Z] Display size: 1440x900
16:10:36 [2022-03-30T20:10:36.636Z] OS version=5.14.14-200.fc34.x86_64
16:10:36 [2022-03-30T20:10:36.636Z] GTK version=3.22.30
16:10:36 [2022-03-30T20:10:36.636Z] GTK theme=Ambiance
16:10:36 [2022-03-30T20:10:36.636Z] LIBOVERLAY_SCROLLBAR=0
16:10:36 [2022-03-30T20:10:36.636Z] Time zone: Greenwich Mean Time
16:10:36 [2022-03-30T20:10:36.636Z] log4j:WARN No appenders could be found for logger (org.eclipse.swtbot.swt.finder.widgets.SWTBotShell).
16:10:36 [2022-03-30T20:10:36.636Z] log4j:WARN Please initialize the log4j system properly.
16:11:58 [2022-03-30T20:11:58.278Z] 
16:11:58 [2022-03-30T20:11:58.278Z] !ENTRY org.eclipse.tracecompass.tmf.ui 4 0 2022-03-30 20:11:48.867
16:11:58 [2022-03-30T20:11:58.278Z] !MESSAGE Error connection to node 'ssh://anonymous@unknown.unknown.unknown'
16:11:58 [2022-03-30T20:11:58.278Z] !STACK 0
16:11:58 [2022-03-30T20:11:58.278Z] org.eclipse.core.commands.ExecutionException: Cannot connect Unknown
16:11:58 [2022-03-30T20:11:58.278Z] 	at org.eclipse.tracecompass.tmf.remote.core.proxy.RemoteSystemProxy.connect(RemoteSystemProxy.java:90)
16:11:58 [2022-03-30T20:11:58.278Z] 	at org.eclipse.tracecompass.internal.tmf.remote.ui.wizards.fetch.model.RemoteImportConnectionNodeElement.connect(RemoteImportConnectionNodeElement.java:143)
16:11:58 [2022-03-30T20:11:58.278Z] 	at org.eclipse.tracecompass.internal.tmf.remote.ui.wizards.fetch.RemoteFetchLogWizardRemotePage$6.run(RemoteFetchLogWizardRemotePage.java:392)
16:11:58 [2022-03-30T20:11:58.278Z] 	at org.eclipse.jface.operation.ModalContext$ModalContextThread.run(ModalContext.java:122)
16:11:58 [2022-03-30T20:11:58.278Z] Caused by: org.eclipse.remote.core.exception.RemoteConnectionException: Session.connect: java.net.UnknownHostException: unknown.unknown.unknown
16:11:58 [2022-03-30T20:11:58.278Z] 	at org.eclipse.remote.internal.jsch.core.JSchConnection.newSession(JSchConnection.java:803)
16:11:58 [2022-03-30T20:11:58.278Z] 	at org.eclipse.remote.internal.jsch.core.JSchConnection.open(JSchConnection.java:841)
16:11:58 [2022-03-30T20:11:58.278Z] 	at org.eclipse.remote.internal.jsch.core.JSchConnection.open(JSchConnection.java:814)
16:11:58 [2022-03-30T20:11:58.278Z] 	at org.eclipse.remote.internal.core.RemoteConnection.open(RemoteConnection.java:208)
16:11:58 [2022-03-30T20:11:58.278Z] 	at org.eclipse.tracecompass.tmf.remote.core.proxy.RemoteSystemProxy.connect(RemoteSystemProxy.java:86)
16:11:58 [2022-03-30T20:11:58.278Z] 	... 3 more
16:12:08 [2022-03-30T20:12:08.250Z] Tests run: 20, Failures: 0, Errors: 0, Skipped: 1, Time elapsed: 91.644 s - in org.eclipse.tracecompass.tmf.remote.ui.swtbot.tests.fetch.FetchRemoteTracesTest
16:12:08 [2022-03-30T20:12:08.250Z] testImportNothing(org.eclipse.tracecompass.tmf.remote.ui.swtbot.tests.fetch.FetchRemoteTracesTest)  Time elapsed: 5.725 s
16:12:08 [2022-03-30T20:12:08.250Z] test_7_03(org.eclipse.tracecompass.tmf.remote.ui.swtbot.tests.fetch.FetchRemoteTracesTest)  Time elapsed: 2.372 s
16:12:08 [2022-03-30T20:12:08.250Z] test_8_04(org.eclipse.tracecompass.tmf.remote.ui.swtbot.tests.fetch.FetchRemoteTracesTest)  Time elapsed: 7.105 s
16:12:08 [2022-03-30T20:12:08.250Z] test_8_05(org.eclipse.tracecompass.tmf.remote.ui.swtbot.tests.fetch.FetchRemoteTracesTest)  Time elapsed: 12.185 s
16:12:08 [2022-03-30T20:12:08.250Z] test_8_06(org.eclipse.tracecompass.tmf.remote.ui.swtbot.tests.fetch.FetchRemoteTracesTest)  Time elapsed: 5.489 s
16:12:08 [2022-03-30T20:12:08.250Z] test_8_07(org.eclipse.tracecompass.tmf.remote.ui.swtbot.tests.fetch.FetchRemoteTracesTest)  Time elapsed: 6.01 s
16:12:08 [2022-03-30T20:12:08.250Z] test_8_08(org.eclipse.tracecompass.tmf.remote.ui.swtbot.tests.fetch.FetchRemoteTracesTest)  Time elapsed: 5.299 s
16:12:08 [2022-03-30T20:12:08.250Z] test_8_09(org.eclipse.tracecompass.tmf.remote.ui.swtbot.tests.fetch.FetchRemoteTracesTest)  Time elapsed: 4.339 s
16:12:08 [2022-03-30T20:12:08.250Z] test_8_10(org.eclipse.tracecompass.tmf.remote.ui.swtbot.tests.fetch.FetchRemoteTracesTest)  Time elapsed: 3.391 s
16:12:08 [2022-03-30T20:12:08.250Z] test_8_11(org.eclipse.tracecompass.tmf.remote.ui.swtbot.tests.fetch.FetchRemoteTracesTest)  Time elapsed: 3.881 s
16:12:08 [2022-03-30T20:12:08.250Z] test_8_12(org.eclipse.tracecompass.tmf.remote.ui.swtbot.tests.fetch.FetchRemoteTracesTest)  Time elapsed: 2.724 s
16:12:08 [2022-03-30T20:12:08.250Z] test_8_13(org.eclipse.tracecompass.tmf.remote.ui.swtbot.tests.fetch.FetchRemoteTracesTest)  Time elapsed: 3.572 s
16:12:08 [2022-03-30T20:12:08.250Z] test_8_14(org.eclipse.tracecompass.tmf.remote.ui.swtbot.tests.fetch.FetchRemoteTracesTest)  Time elapsed: 2.898 s
16:12:08 [2022-03-30T20:12:08.250Z] test_8_15(org.eclipse.tracecompass.tmf.remote.ui.swtbot.tests.fetch.FetchRemoteTracesTest)  Time elapsed: 3.601 s
16:12:08 [2022-03-30T20:12:08.250Z] test_9_01(org.eclipse.tracecompass.tmf.remote.ui.swtbot.tests.fetch.FetchRemoteTracesTest)  Time elapsed: 2.804 s
16:12:08 [2022-03-30T20:12:08.250Z] test_9_02(org.eclipse.tracecompass.tmf.remote.ui.swtbot.tests.fetch.FetchRemoteTracesTest) skipped
16:12:08 [2022-03-30T20:12:08.250Z] testImportOnlyOne(org.eclipse.tracecompass.tmf.remote.ui.swtbot.tests.fetch.FetchRemoteTracesTest)  Time elapsed: 3.781 s
16:12:08 [2022-03-30T20:12:08.250Z] testEmptyFile(org.eclipse.tracecompass.tmf.remote.ui.swtbot.tests.fetch.FetchRemoteTracesTest)  Time elapsed: 3.303 s
16:12:08 [2022-03-30T20:12:08.250Z] testImportAll(org.eclipse.tracecompass.tmf.remote.ui.swtbot.tests.fetch.FetchRemoteTracesTest)  Time elapsed: 6.461 s
16:12:08 [2022-03-30T20:12:08.250Z] testEditProfile(org.eclipse.tracecompass.tmf.remote.ui.swtbot.tests.fetch.FetchRemoteTracesTest)  Time elapsed: 2.951 s
16:12:08 [2022-03-30T20:12:08.250Z] 
16:12:08 [2022-03-30T20:12:08.250Z] Results:
16:12:08 [2022-03-30T20:12:08.250Z] 
16:12:08 [2022-03-30T20:12:08.250Z] Tests run: 20, Failures: 0, Errors: 0, Skipped: 1
16:12:08 [2022-03-30T20:12:08.250Z] 
16:12:08 [2022-03-30T20:12:08.250Z] 
16:12:08 [2022-03-30T20:12:08.250Z] !ENTRY org.eclipse.core.resources 2 10035 2022-03-30 20:12:07.893
16:12:08 [2022-03-30T20:12:08.250Z] !MESSAGE The workspace will exit with unsaved changes in this session.
16:12:08 [2022-03-30T20:12:08.509Z] [INFO] All tests passed!
16:12:08 [2022-03-30T20:12:08.509Z] [INFO] 
16:12:08 [2022-03-30T20:12:08.509Z] [INFO] --- maven-install-plugin:2.5.2:install (default-install) @ org.eclipse.tracecompass.tmf.remote.ui.swtbot.tests ---
16:12:08 [2022-03-30T20:12:08.509Z] [INFO] Installing /home/jenkins/agent/workspace/tracecompass-master-2020-06/tmf/org.eclipse.tracecompass.tmf.remote.ui.swtbot.tests/target/org.eclipse.tracecompass.tmf.remote.ui.swtbot.tests-1.0.9-SNAPSHOT.jar to /home/jenkins/.m2/repository/org/eclipse/tracecompass/org.eclipse.tracecompass.tmf.remote.ui.swtbot.tests/1.0.9-SNAPSHOT/org.eclipse.tracecompass.tmf.remote.ui.swtbot.tests-1.0.9-SNAPSHOT.jar
16:12:08 [2022-03-30T20:12:08.509Z] [INFO] Installing /home/jenkins/agent/workspace/tracecompass-master-2020-06/tmf/org.eclipse.tracecompass.tmf.remote.ui.swtbot.tests/pom.xml to /home/jenkins/.m2/repository/org/eclipse/tracecompass/org.eclipse.tracecompass.tmf.remote.ui.swtbot.tests/1.0.9-SNAPSHOT/org.eclipse.tracecompass.tmf.remote.ui.swtbot.tests-1.0.9-SNAPSHOT.pom
16:12:08 [2022-03-30T20:12:08.509Z] [INFO] Installing /home/jenkins/agent/workspace/tracecompass-master-2020-06/tmf/org.eclipse.tracecompass.tmf.remote.ui.swtbot.tests/target/org.eclipse.tracecompass.tmf.remote.ui.swtbot.tests-1.0.9-SNAPSHOT-sources.jar to /home/jenkins/.m2/repository/org/eclipse/tracecompass/org.eclipse.tracecompass.tmf.remote.ui.swtbot.tests/1.0.9-SNAPSHOT/org.eclipse.tracecompass.tmf.remote.ui.swtbot.tests-1.0.9-SNAPSHOT-sources.jar
16:12:08 [2022-03-30T20:12:08.509Z] [INFO] Installing /home/jenkins/agent/workspace/tracecompass-master-2020-06/tmf/org.eclipse.tracecompass.tmf.remote.ui.swtbot.tests/target/org.eclipse.tracecompass.tmf.remote.ui.swtbot.tests-1.0.9-SNAPSHOT.jar.pack.gz to /home/jenkins/.m2/repository/org/eclipse/tracecompass/org.eclipse.tracecompass.tmf.remote.ui.swtbot.tests/1.0.9-SNAPSHOT/org.eclipse.tracecompass.tmf.remote.ui.swtbot.tests-1.0.9-SNAPSHOT-pack200.jar.pack.gz
16:12:08 [2022-03-30T20:12:08.509Z] [INFO] Installing /home/jenkins/agent/workspace/tracecompass-master-2020-06/tmf/org.eclipse.tracecompass.tmf.remote.ui.swtbot.tests/target/p2content.xml to /home/jenkins/.m2/repository/org/eclipse/tracecompass/org.eclipse.tracecompass.tmf.remote.ui.swtbot.tests/1.0.9-SNAPSHOT/org.eclipse.tracecompass.tmf.remote.ui.swtbot.tests-1.0.9-SNAPSHOT-p2metadata.xml
16:12:08 [2022-03-30T20:12:08.509Z] [INFO] Installing /home/jenkins/agent/workspace/tracecompass-master-2020-06/tmf/org.eclipse.tracecompass.tmf.remote.ui.swtbot.tests/target/p2artifacts.xml to /home/jenkins/.m2/repository/org/eclipse/tracecompass/org.eclipse.tracecompass.tmf.remote.ui.swtbot.tests/1.0.9-SNAPSHOT/org.eclipse.tracecompass.tmf.remote.ui.swtbot.tests-1.0.9-SNAPSHOT-p2artifacts.xml
16:12:08 [2022-03-30T20:12:08.509Z] [INFO] 
16:12:08 [2022-03-30T20:12:08.509Z] [INFO] --- tycho-p2-plugin:2.3.0:update-local-index (default-update-local-index) @ org.eclipse.tracecompass.tmf.remote.ui.swtbot.tests ---
16:12:08 [2022-03-30T20:12:08.509Z] [INFO] 
16:12:08 [2022-03-30T20:12:08.509Z] [INFO] --< org.eclipse.tracecompass:org.eclipse.tracecompass.tmf.remote.ui.tests >--
16:12:08 [2022-03-30T20:12:08.509Z] [INFO] Building org.eclipse.tracecompass.tmf.remote.ui.tests 1.0.2-SNAPSHOT [133/139]
16:12:08 [2022-03-30T20:12:08.509Z] [INFO] ------------------------[ eclipse-test-plugin ]-------------------------
16:12:08 [2022-03-30T20:12:08.509Z] [INFO] 
16:12:08 [2022-03-30T20:12:08.509Z] [INFO] --- maven-clean-plugin:3.0.0:clean (default-clean) @ org.eclipse.tracecompass.tmf.remote.ui.tests ---
16:12:08 [2022-03-30T20:12:08.509Z] [INFO] 
16:12:08 [2022-03-30T20:12:08.509Z] [INFO] --- tycho-packaging-plugin:2.3.0:build-qualifier (default-build-qualifier) @ org.eclipse.tracecompass.tmf.remote.ui.tests ---
16:12:08 [2022-03-30T20:12:08.509Z] [INFO] The project's OSGi version is 1.0.2.202203301911
16:12:08 [2022-03-30T20:12:08.509Z] [INFO] 
16:12:08 [2022-03-30T20:12:08.509Z] [INFO] --- tycho-packaging-plugin:2.3.0:validate-id (default-validate-id) @ org.eclipse.tracecompass.tmf.remote.ui.tests ---
16:12:08 [2022-03-30T20:12:08.509Z] [INFO] 
16:12:08 [2022-03-30T20:12:08.509Z] [INFO] --- tycho-packaging-plugin:2.3.0:validate-version (default-validate-version) @ org.eclipse.tracecompass.tmf.remote.ui.tests ---
16:12:08 [2022-03-30T20:12:08.509Z] [INFO] 
16:12:08 [2022-03-30T20:12:08.509Z] [INFO] --- maven-enforcer-plugin:3.0.0-M3:enforce (enforce-maven-version) @ org.eclipse.tracecompass.tmf.remote.ui.tests ---
16:12:08 [2022-03-30T20:12:08.509Z] [INFO] 
16:12:08 [2022-03-30T20:12:08.509Z] [INFO] --- maven-resources-plugin:3.0.2:resources (default-resources) @ org.eclipse.tracecompass.tmf.remote.ui.tests ---
16:12:08 [2022-03-30T20:12:08.509Z] [INFO] Using 'UTF-8' encoding to copy filtered resources.
16:12:08 [2022-03-30T20:12:08.509Z] [INFO] skip non existing resourceDirectory /home/jenkins/agent/workspace/tracecompass-master-2020-06/tmf/org.eclipse.tracecompass.tmf.remote.ui.tests/src/main/resources
16:12:08 [2022-03-30T20:12:08.509Z] [INFO] 
16:12:08 [2022-03-30T20:12:08.509Z] [INFO] --- tycho-compiler-plugin:2.3.0:compile (default-compile) @ org.eclipse.tracecompass.tmf.remote.ui.tests ---
16:12:08 [2022-03-30T20:12:08.509Z] [INFO] Compiling 4 source files to /home/jenkins/agent/workspace/tracecompass-master-2020-06/tmf/org.eclipse.tracecompass.tmf.remote.ui.tests/target/classes
16:12:08 [2022-03-30T20:12:08.768Z] [INFO] 
16:12:08 [2022-03-30T20:12:08.768Z] [INFO] --- maven-resources-plugin:3.0.2:testResources (default-testResources) @ org.eclipse.tracecompass.tmf.remote.ui.tests ---
16:12:08 [2022-03-30T20:12:08.768Z] [INFO] Using 'UTF-8' encoding to copy filtered resources.
16:12:08 [2022-03-30T20:12:08.768Z] [INFO] skip non existing resourceDirectory /home/jenkins/agent/workspace/tracecompass-master-2020-06/tmf/org.eclipse.tracecompass.tmf.remote.ui.tests/src/test/resources
16:12:08 [2022-03-30T20:12:08.768Z] [INFO] 
16:12:08 [2022-03-30T20:12:08.768Z] [INFO] --- tycho-source-plugin:2.3.0:plugin-source (plugin-source) @ org.eclipse.tracecompass.tmf.remote.ui.tests ---
16:12:08 [2022-03-30T20:12:08.768Z] [INFO] Building jar: /home/jenkins/agent/workspace/tracecompass-master-2020-06/tmf/org.eclipse.tracecompass.tmf.remote.ui.tests/target/org.eclipse.tracecompass.tmf.remote.ui.tests-1.0.2-SNAPSHOT-sources.jar
16:12:08 [2022-03-30T20:12:08.768Z] [INFO] 
16:12:08 [2022-03-30T20:12:08.768Z] [INFO] --- target-platform-configuration:2.3.0:target-platform (default-target-platform) @ org.eclipse.tracecompass.tmf.remote.ui.tests ---
16:12:08 [2022-03-30T20:12:08.768Z] [INFO] 
16:12:08 [2022-03-30T20:12:08.768Z] [INFO] --- tycho-packaging-plugin:2.3.0:package-plugin (default-package-plugin) @ org.eclipse.tracecompass.tmf.remote.ui.tests ---
16:12:08 [2022-03-30T20:12:08.768Z] [INFO] Building jar: /home/jenkins/agent/workspace/tracecompass-master-2020-06/tmf/org.eclipse.tracecompass.tmf.remote.ui.tests/target/org.eclipse.tracecompass.tmf.remote.ui.tests-1.0.2-SNAPSHOT.jar
16:12:08 [2022-03-30T20:12:08.768Z] [INFO] 
16:12:08 [2022-03-30T20:12:08.768Z] [INFO] --- tycho-p2-plugin:2.3.0:p2-metadata-default (default-p2-metadata-default) @ org.eclipse.tracecompass.tmf.remote.ui.tests ---
16:12:08 [2022-03-30T20:12:08.768Z] [INFO] 
16:12:08 [2022-03-30T20:12:08.768Z] [INFO] --- tycho-source-feature-plugin:2.3.0:source-feature (source-feature) @ org.eclipse.tracecompass.tmf.remote.ui.tests ---
16:12:08 [2022-03-30T20:12:08.768Z] [WARNING] Mojo tycho-source-feature-plugin:source-feature is replaced by the tycho-source-plugin:feature-source which offers equivalent and even enhanced functionality
16:12:08 [2022-03-30T20:12:08.768Z] [INFO] 
16:12:08 [2022-03-30T20:12:08.768Z] [INFO] --- tycho-pack200b-plugin:2.3.0:pack (pack200-pack) @ org.eclipse.tracecompass.tmf.remote.ui.tests ---
16:12:08 [2022-03-30T20:12:08.768Z] [WARNING] Pack200 actions are deprecated and scheduled for removal.
16:12:08 [2022-03-30T20:12:08.768Z] [INFO] Pack200 packing jar /home/jenkins/agent/workspace/tracecompass-master-2020-06/tmf/org.eclipse.tracecompass.tmf.remote.ui.tests/target/org.eclipse.tracecompass.tmf.remote.ui.tests-1.0.2-SNAPSHOT.jar
16:12:08 [2022-03-30T20:12:08.768Z] [INFO] 
16:12:08 [2022-03-30T20:12:08.768Z] [INFO] --- tycho-p2-plugin:2.3.0:p2-metadata (p2-metadata) @ org.eclipse.tracecompass.tmf.remote.ui.tests ---
16:12:08 [2022-03-30T20:12:08.768Z] [INFO] 
16:12:08 [2022-03-30T20:12:08.768Z] [INFO] --- tycho-surefire-plugin:2.3.0:test (default-test) @ org.eclipse.tracecompass.tmf.remote.ui.tests ---
16:12:09 [2022-03-30T20:12:09.029Z] [INFO] Executing Test Runtime with timeout 0, logs (if any) will be placed at: /home/jenkins/agent/workspace/tracecompass-master-2020-06/tmf/org.eclipse.tracecompass.tmf.remote.ui.tests/target/work/data/.metadata/.log
16:12:09 [2022-03-30T20:12:09.029Z] [INFO] Command line:
16:12:09 [2022-03-30T20:12:09.029Z] 	[/opt/tools/java/openjdk/jdk-11/11.0.2+9/bin/java, -Dosgi.noShutdown=false, -Dosgi.os=linux, -Dosgi.ws=gtk, -Dosgi.arch=x86_64, -Dorg.eclipse.swt.browser.DefaultType=mozilla, -Xms512m, -Xmx1024m, -Dosgi.clean=true, -jar, /home/jenkins/.m2/repository/p2/osgi/bundle/org.eclipse.equinox.launcher/1.5.700.v20200207-2156/org.eclipse.equinox.launcher-1.5.700.v20200207-2156.jar, -data, /home/jenkins/agent/workspace/tracecompass-master-2020-06/tmf/org.eclipse.tracecompass.tmf.remote.ui.tests/target/work/data, -install, /home/jenkins/agent/workspace/tracecompass-master-2020-06/tmf/org.eclipse.tracecompass.tmf.remote.ui.tests/target/work, -configuration, /home/jenkins/agent/workspace/tracecompass-master-2020-06/tmf/org.eclipse.tracecompass.tmf.remote.ui.tests/target/work/configuration, -application, org.eclipse.tycho.surefire.osgibooter.uitest, -testproperties, /home/jenkins/agent/workspace/tracecompass-master-2020-06/tmf/org.eclipse.tracecompass.tmf.remote.ui.tests/target/surefire.properties, -product, org.eclipse.platform.ide, -consoleLog]
16:12:09 [2022-03-30T20:12:09.029Z] Picked up _JAVA_OPTIONS: -Duser.home=/home/tracecompass
16:12:12 [2022-03-30T20:12:12.324Z] !SESSION 2022-03-30 20:12:09.193 -----------------------------------------------
16:12:12 [2022-03-30T20:12:12.324Z] eclipse.buildId=unknown
16:12:12 [2022-03-30T20:12:12.324Z] java.version=11.0.2
16:12:12 [2022-03-30T20:12:12.324Z] java.vendor=Oracle Corporation
16:12:12 [2022-03-30T20:12:12.324Z] BootLoader constants: OS=linux, ARCH=x86_64, WS=gtk, NL=en_US
16:12:12 [2022-03-30T20:12:12.324Z] Framework arguments:  -application org.eclipse.tycho.surefire.osgibooter.uitest -testproperties /home/jenkins/agent/workspace/tracecompass-master-2020-06/tmf/org.eclipse.tracecompass.tmf.remote.ui.tests/target/surefire.properties -product org.eclipse.platform.ide
16:12:12 [2022-03-30T20:12:12.324Z] Command-line arguments:  -data /home/jenkins/agent/workspace/tracecompass-master-2020-06/tmf/org.eclipse.tracecompass.tmf.remote.ui.tests/target/work/data -application org.eclipse.tycho.surefire.osgibooter.uitest -testproperties /home/jenkins/agent/workspace/tracecompass-master-2020-06/tmf/org.eclipse.tracecompass.tmf.remote.ui.tests/target/surefire.properties -product org.eclipse.platform.ide -consoleLog
16:12:12 [2022-03-30T20:12:12.324Z] 
16:12:12 [2022-03-30T20:12:12.324Z] !ENTRY org.eclipse.compare.win32 4 0 2022-03-30 20:12:11.762
16:12:12 [2022-03-30T20:12:12.324Z] !MESSAGE FrameworkEvent ERROR
16:12:12 [2022-03-30T20:12:12.324Z] !STACK 0
16:12:12 [2022-03-30T20:12:12.324Z] org.osgi.framework.BundleException: Could not resolve module: org.eclipse.compare.win32 [65]
16:12:12 [2022-03-30T20:12:12.324Z]   Unresolved requirement: Require-Capability: eclipse.platform; filter:="(osgi.os=win32)"
16:12:12 [2022-03-30T20:12:12.324Z] 
16:12:12 [2022-03-30T20:12:12.325Z] 	at org.eclipse.osgi.container.Module.start(Module.java:463)
16:12:12 [2022-03-30T20:12:12.325Z] 	at org.eclipse.osgi.container.ModuleContainer$ContainerStartLevel$2.run(ModuleContainer.java:1845)
16:12:12 [2022-03-30T20:12:12.325Z] 	at org.eclipse.osgi.internal.framework.EquinoxContainerAdaptor$1$1.execute(EquinoxContainerAdaptor.java:136)
16:12:12 [2022-03-30T20:12:12.325Z] 	at org.eclipse.osgi.container.ModuleContainer$ContainerStartLevel.incStartLevel(ModuleContainer.java:1838)
16:12:12 [2022-03-30T20:12:12.325Z] 	at org.eclipse.osgi.container.ModuleContainer$ContainerStartLevel.incStartLevel(ModuleContainer.java:1779)
16:12:12 [2022-03-30T20:12:12.325Z] 	at org.eclipse.osgi.container.ModuleContainer$ContainerStartLevel.doContainerStartLevel(ModuleContainer.java:1743)
16:12:12 [2022-03-30T20:12:12.325Z] 	at org.eclipse.osgi.container.ModuleContainer$ContainerStartLevel.dispatchEvent(ModuleContainer.java:1665)
16:12:12 [2022-03-30T20:12:12.325Z] 	at org.eclipse.osgi.container.ModuleContainer$ContainerStartLevel.dispatchEvent(ModuleContainer.java:1)
16:12:12 [2022-03-30T20:12:12.325Z] 	at org.eclipse.osgi.framework.eventmgr.EventManager.dispatchEvent(EventManager.java:234)
16:12:12 [2022-03-30T20:12:12.325Z] 	at org.eclipse.osgi.framework.eventmgr.EventManager$EventThread.run(EventManager.java:345)
16:12:12 [2022-03-30T20:12:12.325Z] 
16:12:12 [2022-03-30T20:12:12.325Z] !ENTRY org.eclipse.ecf.provider.filetransfer.httpclient45.win32 4 0 2022-03-30 20:12:11.848
16:12:12 [2022-03-30T20:12:12.325Z] !MESSAGE FrameworkEvent ERROR
16:12:12 [2022-03-30T20:12:12.325Z] !STACK 0
16:12:12 [2022-03-30T20:12:12.325Z] org.osgi.framework.BundleException: Could not resolve module: org.eclipse.ecf.provider.filetransfer.httpclient45.win32 [137]
16:12:12 [2022-03-30T20:12:12.325Z]   Unresolved requirement: Require-Capability: eclipse.platform; filter:="(osgi.os=win32)"
16:12:12 [2022-03-30T20:12:12.325Z]   Unresolved requirement: Import-Package: org.apache.http.impl.auth.win; version="[4.5.0,5.0.0)"
16:12:12 [2022-03-30T20:12:12.325Z]     -> Export-Package: org.apache.http.impl.auth.win; bundle-symbolic-name="org.apache.httpcomponents.httpclient.win"; bundle-version="4.5.10.v20200113-2105"; version="4.5.10"; x-internal:="true"; uses:="org.apache.http,org.apache.http.auth,org.apache.http.client,org.apache.http.impl.auth,org.apache.http.protocol,org.apache.http.util"
16:12:12 [2022-03-30T20:12:12.325Z]        org.apache.httpcomponents.httpclient.win [36]
16:12:12 [2022-03-30T20:12:12.325Z]          Unresolved requirement: Require-Capability: eclipse.platform; filter:="(osgi.os=win32)"
16:12:12 [2022-03-30T20:12:12.325Z] 
16:12:12 [2022-03-30T20:12:12.325Z] 	at org.eclipse.osgi.container.Module.start(Module.java:463)
16:12:12 [2022-03-30T20:12:12.325Z] 	at org.eclipse.osgi.container.ModuleContainer$ContainerStartLevel$2.run(ModuleContainer.java:1845)
16:12:12 [2022-03-30T20:12:12.325Z] 	at org.eclipse.osgi.internal.framework.EquinoxContainerAdaptor$1$1.execute(EquinoxContainerAdaptor.java:136)
16:12:12 [2022-03-30T20:12:12.325Z] 	at org.eclipse.osgi.container.ModuleContainer$ContainerStartLevel.incStartLevel(ModuleContainer.java:1838)
16:12:12 [2022-03-30T20:12:12.325Z] 	at org.eclipse.osgi.container.ModuleContainer$ContainerStartLevel.incStartLevel(ModuleContainer.java:1779)
16:12:12 [2022-03-30T20:12:12.325Z] 	at org.eclipse.osgi.container.ModuleContainer$ContainerStartLevel.doContainerStartLevel(ModuleContainer.java:1743)
16:12:12 [2022-03-30T20:12:12.325Z] 	at org.eclipse.osgi.container.ModuleContainer$ContainerStartLevel.dispatchEvent(ModuleContainer.java:1665)
16:12:12 [2022-03-30T20:12:12.325Z] 	at org.eclipse.osgi.container.ModuleContainer$ContainerStartLevel.dispatchEvent(ModuleContainer.java:1)
16:12:12 [2022-03-30T20:12:12.325Z] 	at org.eclipse.osgi.framework.eventmgr.EventManager.dispatchEvent(EventManager.java:234)
16:12:12 [2022-03-30T20:12:12.325Z] 	at org.eclipse.osgi.framework.eventmgr.EventManager$EventThread.run(EventManager.java:345)
16:12:13 [2022-03-30T20:12:13.702Z] SWT SessionManagerDBus: Failed to connect to org.gnome.SessionManager: Failed to execute child process “dbus-launch” (No such file or directory)
16:12:13 [2022-03-30T20:12:13.702Z] SWT SessionManagerDBus: Failed to connect to org.xfce.SessionManager: Failed to execute child process “dbus-launch” (No such file or directory)
16:12:18 [2022-03-30T20:12:18.965Z] 
16:12:18 [2022-03-30T20:12:18.965Z] !ENTRY org.eclipse.urischeme 4 0 2022-03-30 20:12:18.853
16:12:18 [2022-03-30T20:12:18.965Z] !MESSAGE Cannot run program "xdg-mime": error=2, No such file or directory
16:12:18 [2022-03-30T20:12:18.965Z] !STACK 0
16:12:18 [2022-03-30T20:12:18.965Z] java.io.IOException: Cannot run program "xdg-mime": error=2, No such file or directory
16:12:18 [2022-03-30T20:12:18.965Z] 	at java.base/java.lang.ProcessBuilder.start(ProcessBuilder.java:1128)
16:12:18 [2022-03-30T20:12:18.965Z] 	at java.base/java.lang.ProcessBuilder.start(ProcessBuilder.java:1071)
16:12:18 [2022-03-30T20:12:18.965Z] 	at org.eclipse.urischeme.internal.registration.ProcessExecutor.execute(ProcessExecutor.java:36)
16:12:18 [2022-03-30T20:12:18.965Z] 	at org.eclipse.urischeme.internal.registration.RegistrationLinux.getRegisteredDesktopFileForScheme(RegistrationLinux.java:136)
16:12:18 [2022-03-30T20:12:18.965Z] 	at org.eclipse.urischeme.internal.registration.RegistrationLinux.determineHandlerLocation(RegistrationLinux.java:80)
16:12:18 [2022-03-30T20:12:18.965Z] 	at org.eclipse.urischeme.internal.registration.RegistrationLinux.getSchemesInformation(RegistrationLinux.java:69)
16:12:18 [2022-03-30T20:12:18.965Z] 	at org.eclipse.urischeme.AutoRegisterSchemeHandlersJob.run(AutoRegisterSchemeHandlersJob.java:63)
16:12:18 [2022-03-30T20:12:18.965Z] 	at org.eclipse.core.internal.jobs.Worker.run(Worker.java:63)
16:12:18 [2022-03-30T20:12:18.965Z] Caused by: java.io.IOException: error=2, No such file or directory
16:12:18 [2022-03-30T20:12:18.965Z] 	at java.base/java.lang.ProcessImpl.forkAndExec(Native Method)
16:12:18 [2022-03-30T20:12:18.965Z] 	at java.base/java.lang.ProcessImpl.<init>(ProcessImpl.java:340)
16:12:18 [2022-03-30T20:12:18.965Z] 	at java.base/java.lang.ProcessImpl.start(ProcessImpl.java:271)
16:12:18 [2022-03-30T20:12:18.965Z] 	at java.base/java.lang.ProcessBuilder.start(ProcessBuilder.java:1107)
16:12:18 [2022-03-30T20:12:18.965Z] 	... 7 more
16:12:19 [2022-03-30T20:12:19.223Z] 
16:12:19 [2022-03-30T20:12:19.223Z] (WebKitWebProcess:21934): GLib-WARNING **: 20:12:19.013: getpwuid_r(): failed due to unknown user id (1001250000)
16:12:19 [2022-03-30T20:12:19.480Z] Running org.eclipse.tracecompass.tmf.remote.ui.tests.fetch.RemoteImportProfilesReaderTest
16:12:20 [2022-03-30T20:12:20.046Z] Tests run: 5, Failures: 0, Errors: 0, Skipped: 0, Time elapsed: 0.312 s - in org.eclipse.tracecompass.tmf.remote.ui.tests.fetch.RemoteImportProfilesReaderTest
16:12:20 [2022-03-30T20:12:20.046Z] testLoadElements(org.eclipse.tracecompass.tmf.remote.ui.tests.fetch.RemoteImportProfilesReaderTest)  Time elapsed: 0.023 s
16:12:20 [2022-03-30T20:12:20.046Z] testValidateInvalidMissingFiles(org.eclipse.tracecompass.tmf.remote.ui.tests.fetch.RemoteImportProfilesReaderTest)  Time elapsed: 0.177 s
16:12:20 [2022-03-30T20:12:20.046Z] testValidateInvalidEmptyProfile(org.eclipse.tracecompass.tmf.remote.ui.tests.fetch.RemoteImportProfilesReaderTest)  Time elapsed: 0.004 s
16:12:20 [2022-03-30T20:12:20.046Z] testValidateInvalidMissingRoot(org.eclipse.tracecompass.tmf.remote.ui.tests.fetch.RemoteImportProfilesReaderTest)  Time elapsed: 0.067 s
16:12:20 [2022-03-30T20:12:20.046Z] testValidateValid(org.eclipse.tracecompass.tmf.remote.ui.tests.fetch.RemoteImportProfilesReaderTest)  Time elapsed: 0.016 s
16:12:20 [2022-03-30T20:12:20.046Z] Running org.eclipse.tracecompass.tmf.remote.ui.tests.fetch.RemoteImportProfilesWriterTest
16:12:20 [2022-03-30T20:12:20.046Z] Tests run: 1, Failures: 0, Errors: 0, Skipped: 0, Time elapsed: 0.125 s - in org.eclipse.tracecompass.tmf.remote.ui.tests.fetch.RemoteImportProfilesWriterTest
16:12:20 [2022-03-30T20:12:20.046Z] testValidateValid(org.eclipse.tracecompass.tmf.remote.ui.tests.fetch.RemoteImportProfilesWriterTest)  Time elapsed: 0.125 s
16:12:20 [2022-03-30T20:12:20.046Z] 
16:12:20 [2022-03-30T20:12:20.046Z] Results:
16:12:20 [2022-03-30T20:12:20.046Z] 
16:12:20 [2022-03-30T20:12:20.046Z] Tests run: 6, Failures: 0, Errors: 0, Skipped: 0
16:12:20 [2022-03-30T20:12:20.046Z] 
16:12:21 [2022-03-30T20:12:21.420Z] [INFO] All tests passed!
16:12:21 [2022-03-30T20:12:21.420Z] [INFO] 
16:12:21 [2022-03-30T20:12:21.420Z] [INFO] --- maven-install-plugin:2.5.2:install (default-install) @ org.eclipse.tracecompass.tmf.remote.ui.tests ---
16:12:21 [2022-03-30T20:12:21.420Z] [INFO] Installing /home/jenkins/agent/workspace/tracecompass-master-2020-06/tmf/org.eclipse.tracecompass.tmf.remote.ui.tests/target/org.eclipse.tracecompass.tmf.remote.ui.tests-1.0.2-SNAPSHOT.jar to /home/jenkins/.m2/repository/org/eclipse/tracecompass/org.eclipse.tracecompass.tmf.remote.ui.tests/1.0.2-SNAPSHOT/org.eclipse.tracecompass.tmf.remote.ui.tests-1.0.2-SNAPSHOT.jar
16:12:21 [2022-03-30T20:12:21.420Z] [INFO] Installing /home/jenkins/agent/workspace/tracecompass-master-2020-06/tmf/org.eclipse.tracecompass.tmf.remote.ui.tests/pom.xml to /home/jenkins/.m2/repository/org/eclipse/tracecompass/org.eclipse.tracecompass.tmf.remote.ui.tests/1.0.2-SNAPSHOT/org.eclipse.tracecompass.tmf.remote.ui.tests-1.0.2-SNAPSHOT.pom
16:12:21 [2022-03-30T20:12:21.420Z] [INFO] Installing /home/jenkins/agent/workspace/tracecompass-master-2020-06/tmf/org.eclipse.tracecompass.tmf.remote.ui.tests/target/org.eclipse.tracecompass.tmf.remote.ui.tests-1.0.2-SNAPSHOT-sources.jar to /home/jenkins/.m2/repository/org/eclipse/tracecompass/org.eclipse.tracecompass.tmf.remote.ui.tests/1.0.2-SNAPSHOT/org.eclipse.tracecompass.tmf.remote.ui.tests-1.0.2-SNAPSHOT-sources.jar
16:12:21 [2022-03-30T20:12:21.420Z] [INFO] Installing /home/jenkins/agent/workspace/tracecompass-master-2020-06/tmf/org.eclipse.tracecompass.tmf.remote.ui.tests/target/org.eclipse.tracecompass.tmf.remote.ui.tests-1.0.2-SNAPSHOT.jar.pack.gz to /home/jenkins/.m2/repository/org/eclipse/tracecompass/org.eclipse.tracecompass.tmf.remote.ui.tests/1.0.2-SNAPSHOT/org.eclipse.tracecompass.tmf.remote.ui.tests-1.0.2-SNAPSHOT-pack200.jar.pack.gz
16:12:21 [2022-03-30T20:12:21.420Z] [INFO] Installing /home/jenkins/agent/workspace/tracecompass-master-2020-06/tmf/org.eclipse.tracecompass.tmf.remote.ui.tests/target/p2content.xml to /home/jenkins/.m2/repository/org/eclipse/tracecompass/org.eclipse.tracecompass.tmf.remote.ui.tests/1.0.2-SNAPSHOT/org.eclipse.tracecompass.tmf.remote.ui.tests-1.0.2-SNAPSHOT-p2metadata.xml
16:12:21 [2022-03-30T20:12:21.420Z] [INFO] Installing /home/jenkins/agent/workspace/tracecompass-master-2020-06/tmf/org.eclipse.tracecompass.tmf.remote.ui.tests/target/p2artifacts.xml to /home/jenkins/.m2/repository/org/eclipse/tracecompass/org.eclipse.tracecompass.tmf.remote.ui.tests/1.0.2-SNAPSHOT/org.eclipse.tracecompass.tmf.remote.ui.tests-1.0.2-SNAPSHOT-p2artifacts.xml
16:12:21 [2022-03-30T20:12:21.420Z] [INFO] 
16:12:21 [2022-03-30T20:12:21.420Z] [INFO] --- tycho-p2-plugin:2.3.0:update-local-index (default-update-local-index) @ org.eclipse.tracecompass.tmf.remote.ui.tests ---
16:12:21 [2022-03-30T20:12:21.420Z] [INFO] 
16:12:21 [2022-03-30T20:12:21.420Z] [INFO] -----< org.eclipse.tracecompass:org.eclipse.tracecompass.alltests >-----
16:12:21 [2022-03-30T20:12:21.420Z] [INFO] Building Trace Compass All Tests 1.0.11-SNAPSHOT               [134/139]
16:12:21 [2022-03-30T20:12:21.420Z] [INFO] ------------------------[ eclipse-test-plugin ]-------------------------
16:12:21 [2022-03-30T20:12:21.420Z] [INFO] 
16:12:21 [2022-03-30T20:12:21.420Z] [INFO] --- maven-clean-plugin:3.0.0:clean (default-clean) @ org.eclipse.tracecompass.alltests ---
16:12:21 [2022-03-30T20:12:21.420Z] [INFO] 
16:12:21 [2022-03-30T20:12:21.420Z] [INFO] --- tycho-packaging-plugin:2.3.0:build-qualifier (default-build-qualifier) @ org.eclipse.tracecompass.alltests ---
16:12:21 [2022-03-30T20:12:21.420Z] [INFO] The project's OSGi version is 1.0.11.202203301911
16:12:21 [2022-03-30T20:12:21.420Z] [INFO] 
16:12:21 [2022-03-30T20:12:21.420Z] [INFO] --- tycho-packaging-plugin:2.3.0:validate-id (default-validate-id) @ org.eclipse.tracecompass.alltests ---
16:12:21 [2022-03-30T20:12:21.420Z] [INFO] 
16:12:21 [2022-03-30T20:12:21.420Z] [INFO] --- tycho-packaging-plugin:2.3.0:validate-version (default-validate-version) @ org.eclipse.tracecompass.alltests ---
16:12:21 [2022-03-30T20:12:21.420Z] [INFO] 
16:12:21 [2022-03-30T20:12:21.420Z] [INFO] --- maven-enforcer-plugin:3.0.0-M3:enforce (enforce-maven-version) @ org.eclipse.tracecompass.alltests ---
16:12:21 [2022-03-30T20:12:21.420Z] [INFO] 
16:12:21 [2022-03-30T20:12:21.420Z] [INFO] --- maven-resources-plugin:3.0.2:resources (default-resources) @ org.eclipse.tracecompass.alltests ---
16:12:21 [2022-03-30T20:12:21.420Z] [INFO] Using 'UTF-8' encoding to copy filtered resources.
16:12:21 [2022-03-30T20:12:21.420Z] [INFO] skip non existing resourceDirectory /home/jenkins/agent/workspace/tracecompass-master-2020-06/releng/org.eclipse.tracecompass.alltests/src/main/resources
16:12:21 [2022-03-30T20:12:21.420Z] [INFO] 
16:12:21 [2022-03-30T20:12:21.420Z] [INFO] --- tycho-compiler-plugin:2.3.0:compile (default-compile) @ org.eclipse.tracecompass.alltests ---
16:12:21 [2022-03-30T20:12:21.420Z] [INFO] Compiling 8 source files to /home/jenkins/agent/workspace/tracecompass-master-2020-06/releng/org.eclipse.tracecompass.alltests/target/classes
16:12:21 [2022-03-30T20:12:21.680Z] [INFO] 
16:12:21 [2022-03-30T20:12:21.680Z] [INFO] --- maven-resources-plugin:3.0.2:testResources (default-testResources) @ org.eclipse.tracecompass.alltests ---
16:12:21 [2022-03-30T20:12:21.680Z] [INFO] Using 'UTF-8' encoding to copy filtered resources.
16:12:21 [2022-03-30T20:12:21.680Z] [INFO] skip non existing resourceDirectory /home/jenkins/agent/workspace/tracecompass-master-2020-06/releng/org.eclipse.tracecompass.alltests/src/test/resources
16:12:21 [2022-03-30T20:12:21.680Z] [INFO] 
16:12:21 [2022-03-30T20:12:21.680Z] [INFO] --- tycho-source-plugin:2.3.0:plugin-source (plugin-source) @ org.eclipse.tracecompass.alltests ---
16:12:21 [2022-03-30T20:12:21.680Z] [INFO] Building jar: /home/jenkins/agent/workspace/tracecompass-master-2020-06/releng/org.eclipse.tracecompass.alltests/target/org.eclipse.tracecompass.alltests-1.0.11-SNAPSHOT-sources.jar
16:12:21 [2022-03-30T20:12:21.680Z] [INFO] 
16:12:21 [2022-03-30T20:12:21.680Z] [INFO] --- target-platform-configuration:2.3.0:target-platform (default-target-platform) @ org.eclipse.tracecompass.alltests ---
16:12:21 [2022-03-30T20:12:21.680Z] [INFO] 
16:12:21 [2022-03-30T20:12:21.680Z] [INFO] --- tycho-packaging-plugin:2.3.0:package-plugin (default-package-plugin) @ org.eclipse.tracecompass.alltests ---
16:12:21 [2022-03-30T20:12:21.680Z] [INFO] Building jar: /home/jenkins/agent/workspace/tracecompass-master-2020-06/releng/org.eclipse.tracecompass.alltests/target/org.eclipse.tracecompass.alltests-1.0.11-SNAPSHOT.jar
16:12:21 [2022-03-30T20:12:21.680Z] [INFO] 
16:12:21 [2022-03-30T20:12:21.680Z] [INFO] --- tycho-p2-plugin:2.3.0:p2-metadata-default (default-p2-metadata-default) @ org.eclipse.tracecompass.alltests ---
16:12:21 [2022-03-30T20:12:21.680Z] [INFO] 
16:12:21 [2022-03-30T20:12:21.680Z] [INFO] --- tycho-source-feature-plugin:2.3.0:source-feature (source-feature) @ org.eclipse.tracecompass.alltests ---
16:12:21 [2022-03-30T20:12:21.680Z] [WARNING] Mojo tycho-source-feature-plugin:source-feature is replaced by the tycho-source-plugin:feature-source which offers equivalent and even enhanced functionality
16:12:21 [2022-03-30T20:12:21.680Z] [INFO] 
16:12:21 [2022-03-30T20:12:21.680Z] [INFO] --- tycho-pack200b-plugin:2.3.0:pack (pack200-pack) @ org.eclipse.tracecompass.alltests ---
16:12:21 [2022-03-30T20:12:21.680Z] [WARNING] Pack200 actions are deprecated and scheduled for removal.
16:12:21 [2022-03-30T20:12:21.680Z] [INFO] Pack200 packing jar /home/jenkins/agent/workspace/tracecompass-master-2020-06/releng/org.eclipse.tracecompass.alltests/target/org.eclipse.tracecompass.alltests-1.0.11-SNAPSHOT.jar
16:12:21 [2022-03-30T20:12:21.680Z] [INFO] 
16:12:21 [2022-03-30T20:12:21.680Z] [INFO] --- tycho-p2-plugin:2.3.0:p2-metadata (p2-metadata) @ org.eclipse.tracecompass.alltests ---
16:12:21 [2022-03-30T20:12:21.680Z] [INFO] 
16:12:21 [2022-03-30T20:12:21.680Z] [INFO] --- tycho-surefire-plugin:2.3.0:test (default-test) @ org.eclipse.tracecompass.alltests ---
16:12:22 [2022-03-30T20:12:22.246Z] [INFO] Executing Test Runtime with timeout 0, logs (if any) will be placed at: /home/jenkins/agent/workspace/tracecompass-master-2020-06/releng/org.eclipse.tracecompass.alltests/target/work/data/.metadata/.log
16:12:22 [2022-03-30T20:12:22.246Z] [INFO] Command line:
16:12:22 [2022-03-30T20:12:22.246Z] 	[/opt/tools/java/openjdk/jdk-11/11.0.2+9/bin/java, -Dosgi.noShutdown=false, -Dosgi.os=linux, -Dosgi.ws=gtk, -Dosgi.arch=x86_64, -Dorg.eclipse.swt.browser.DefaultType=mozilla, -Xms512m, -Xmx1024m, -Dosgi.clean=true, -jar, /home/jenkins/.m2/repository/p2/osgi/bundle/org.eclipse.equinox.launcher/1.5.700.v20200207-2156/org.eclipse.equinox.launcher-1.5.700.v20200207-2156.jar, -data, /home/jenkins/agent/workspace/tracecompass-master-2020-06/releng/org.eclipse.tracecompass.alltests/target/work/data, -install, /home/jenkins/agent/workspace/tracecompass-master-2020-06/releng/org.eclipse.tracecompass.alltests/target/work, -configuration, /home/jenkins/agent/workspace/tracecompass-master-2020-06/releng/org.eclipse.tracecompass.alltests/target/work/configuration, -application, org.eclipse.tycho.surefire.osgibooter.headlesstest, -testproperties, /home/jenkins/agent/workspace/tracecompass-master-2020-06/releng/org.eclipse.tracecompass.alltests/target/surefire.properties, -product, org.eclipse.platform.ide, -consoleLog]
16:12:22 [2022-03-30T20:12:22.246Z] Picked up _JAVA_OPTIONS: -Duser.home=/home/tracecompass
16:12:25 [2022-03-30T20:12:25.527Z] !SESSION 2022-03-30 20:12:22.201 -----------------------------------------------
16:12:25 [2022-03-30T20:12:25.527Z] eclipse.buildId=unknown
16:12:25 [2022-03-30T20:12:25.527Z] java.version=11.0.2
16:12:25 [2022-03-30T20:12:25.527Z] java.vendor=Oracle Corporation
16:12:25 [2022-03-30T20:12:25.527Z] BootLoader constants: OS=linux, ARCH=x86_64, WS=gtk, NL=en_US
16:12:25 [2022-03-30T20:12:25.527Z] Framework arguments:  -application org.eclipse.tycho.surefire.osgibooter.headlesstest -testproperties /home/jenkins/agent/workspace/tracecompass-master-2020-06/releng/org.eclipse.tracecompass.alltests/target/surefire.properties -product org.eclipse.platform.ide
16:12:25 [2022-03-30T20:12:25.528Z] Command-line arguments:  -data /home/jenkins/agent/workspace/tracecompass-master-2020-06/releng/org.eclipse.tracecompass.alltests/target/work/data -application org.eclipse.tycho.surefire.osgibooter.headlesstest -testproperties /home/jenkins/agent/workspace/tracecompass-master-2020-06/releng/org.eclipse.tracecompass.alltests/target/surefire.properties -product org.eclipse.platform.ide -consoleLog
16:12:25 [2022-03-30T20:12:25.528Z] 
16:12:25 [2022-03-30T20:12:25.528Z] !ENTRY org.eclipse.compare.win32 4 0 2022-03-30 20:12:25.073
16:12:25 [2022-03-30T20:12:25.528Z] !MESSAGE FrameworkEvent ERROR
16:12:25 [2022-03-30T20:12:25.528Z] !STACK 0
16:12:25 [2022-03-30T20:12:25.528Z] org.osgi.framework.BundleException: Could not resolve module: org.eclipse.compare.win32 [86]
16:12:25 [2022-03-30T20:12:25.528Z]   Unresolved requirement: Require-Capability: eclipse.platform; filter:="(osgi.os=win32)"
16:12:25 [2022-03-30T20:12:25.528Z] 
16:12:25 [2022-03-30T20:12:25.528Z] 	at org.eclipse.osgi.container.Module.start(Module.java:463)
16:12:25 [2022-03-30T20:12:25.528Z] 	at org.eclipse.osgi.container.ModuleContainer$ContainerStartLevel$2.run(ModuleContainer.java:1845)
16:12:25 [2022-03-30T20:12:25.528Z] 	at org.eclipse.osgi.internal.framework.EquinoxContainerAdaptor$1$1.execute(EquinoxContainerAdaptor.java:136)
16:12:25 [2022-03-30T20:12:25.528Z] 	at org.eclipse.osgi.container.ModuleContainer$ContainerStartLevel.incStartLevel(ModuleContainer.java:1838)
16:12:25 [2022-03-30T20:12:25.528Z] 	at org.eclipse.osgi.container.ModuleContainer$ContainerStartLevel.incStartLevel(ModuleContainer.java:1779)
16:12:25 [2022-03-30T20:12:25.528Z] 	at org.eclipse.osgi.container.ModuleContainer$ContainerStartLevel.doContainerStartLevel(ModuleContainer.java:1743)
16:12:25 [2022-03-30T20:12:25.528Z] 	at org.eclipse.osgi.container.ModuleContainer$ContainerStartLevel.dispatchEvent(ModuleContainer.java:1665)
16:12:25 [2022-03-30T20:12:25.528Z] 	at org.eclipse.osgi.container.ModuleContainer$ContainerStartLevel.dispatchEvent(ModuleContainer.java:1)
16:12:25 [2022-03-30T20:12:25.528Z] 	at org.eclipse.osgi.framework.eventmgr.EventManager.dispatchEvent(EventManager.java:234)
16:12:25 [2022-03-30T20:12:25.528Z] 	at org.eclipse.osgi.framework.eventmgr.EventManager$EventThread.run(EventManager.java:345)
16:12:25 [2022-03-30T20:12:25.528Z] 
16:12:25 [2022-03-30T20:12:25.528Z] !ENTRY org.eclipse.ecf.provider.filetransfer.httpclient45.win32 4 0 2022-03-30 20:12:25.162
16:12:25 [2022-03-30T20:12:25.528Z] !MESSAGE FrameworkEvent ERROR
16:12:25 [2022-03-30T20:12:25.528Z] !STACK 0
16:12:25 [2022-03-30T20:12:25.528Z] org.osgi.framework.BundleException: Could not resolve module: org.eclipse.ecf.provider.filetransfer.httpclient45.win32 [152]
16:12:25 [2022-03-30T20:12:25.528Z]   Unresolved requirement: Require-Capability: eclipse.platform; filter:="(osgi.os=win32)"
16:12:25 [2022-03-30T20:12:25.528Z]   Unresolved requirement: Import-Package: org.apache.http.impl.auth.win; version="[4.5.0,5.0.0)"
16:12:25 [2022-03-30T20:12:25.528Z]     -> Export-Package: org.apache.http.impl.auth.win; bundle-symbolic-name="org.apache.httpcomponents.httpclient.win"; bundle-version="4.5.10.v20200113-2105"; version="4.5.10"; x-internal:="true"; uses:="org.apache.http,org.apache.http.auth,org.apache.http.client,org.apache.http.impl.auth,org.apache.http.protocol,org.apache.http.util"
16:12:25 [2022-03-30T20:12:25.528Z]        org.apache.httpcomponents.httpclient.win [36]
16:12:25 [2022-03-30T20:12:25.528Z]          Unresolved requirement: Require-Capability: eclipse.platform; filter:="(osgi.os=win32)"
16:12:25 [2022-03-30T20:12:25.528Z] 
16:12:25 [2022-03-30T20:12:25.528Z] 	at org.eclipse.osgi.container.Module.start(Module.java:463)
16:12:25 [2022-03-30T20:12:25.528Z] 	at org.eclipse.osgi.container.ModuleContainer$ContainerStartLevel$2.run(ModuleContainer.java:1845)
16:12:25 [2022-03-30T20:12:25.528Z] 	at org.eclipse.osgi.internal.framework.EquinoxContainerAdaptor$1$1.execute(EquinoxContainerAdaptor.java:136)
16:12:25 [2022-03-30T20:12:25.528Z] 	at org.eclipse.osgi.container.ModuleContainer$ContainerStartLevel.incStartLevel(ModuleContainer.java:1838)
16:12:25 [2022-03-30T20:12:25.528Z] 	at org.eclipse.osgi.container.ModuleContainer$ContainerStartLevel.incStartLevel(ModuleContainer.java:1779)
16:12:25 [2022-03-30T20:12:25.528Z] 	at org.eclipse.osgi.container.ModuleContainer$ContainerStartLevel.doContainerStartLevel(ModuleContainer.java:1743)
16:12:25 [2022-03-30T20:12:25.528Z] 	at org.eclipse.osgi.container.ModuleContainer$ContainerStartLevel.dispatchEvent(ModuleContainer.java:1665)
16:12:25 [2022-03-30T20:12:25.528Z] 	at org.eclipse.osgi.container.ModuleContainer$ContainerStartLevel.dispatchEvent(ModuleContainer.java:1)
16:12:25 [2022-03-30T20:12:25.528Z] 	at org.eclipse.osgi.framework.eventmgr.EventManager.dispatchEvent(EventManager.java:234)
16:12:25 [2022-03-30T20:12:25.528Z] 	at org.eclipse.osgi.framework.eventmgr.EventManager$EventThread.run(EventManager.java:345)
16:12:26 [2022-03-30T20:12:26.902Z] 
16:12:26 [2022-03-30T20:12:26.902Z] Results:
16:12:26 [2022-03-30T20:12:26.902Z] 
16:12:26 [2022-03-30T20:12:26.902Z] Tests run: 0, Failures: 0, Errors: 0, Skipped: 0
16:12:26 [2022-03-30T20:12:26.902Z] 
16:12:27 [2022-03-30T20:12:27.468Z] [WARNING] No tests found.
16:12:27 [2022-03-30T20:12:27.468Z] [INFO] 
16:12:27 [2022-03-30T20:12:27.468Z] [INFO] --- maven-install-plugin:2.5.2:install (default-install) @ org.eclipse.tracecompass.alltests ---
16:12:27 [2022-03-30T20:12:27.468Z] [INFO] Installing /home/jenkins/agent/workspace/tracecompass-master-2020-06/releng/org.eclipse.tracecompass.alltests/target/org.eclipse.tracecompass.alltests-1.0.11-SNAPSHOT.jar to /home/jenkins/.m2/repository/org/eclipse/tracecompass/org.eclipse.tracecompass.alltests/1.0.11-SNAPSHOT/org.eclipse.tracecompass.alltests-1.0.11-SNAPSHOT.jar
16:12:27 [2022-03-30T20:12:27.468Z] [INFO] Installing /home/jenkins/agent/workspace/tracecompass-master-2020-06/releng/org.eclipse.tracecompass.alltests/pom.xml to /home/jenkins/.m2/repository/org/eclipse/tracecompass/org.eclipse.tracecompass.alltests/1.0.11-SNAPSHOT/org.eclipse.tracecompass.alltests-1.0.11-SNAPSHOT.pom
16:12:27 [2022-03-30T20:12:27.468Z] [INFO] Installing /home/jenkins/agent/workspace/tracecompass-master-2020-06/releng/org.eclipse.tracecompass.alltests/target/org.eclipse.tracecompass.alltests-1.0.11-SNAPSHOT-sources.jar to /home/jenkins/.m2/repository/org/eclipse/tracecompass/org.eclipse.tracecompass.alltests/1.0.11-SNAPSHOT/org.eclipse.tracecompass.alltests-1.0.11-SNAPSHOT-sources.jar
16:12:27 [2022-03-30T20:12:27.468Z] [INFO] Installing /home/jenkins/agent/workspace/tracecompass-master-2020-06/releng/org.eclipse.tracecompass.alltests/target/org.eclipse.tracecompass.alltests-1.0.11-SNAPSHOT.jar.pack.gz to /home/jenkins/.m2/repository/org/eclipse/tracecompass/org.eclipse.tracecompass.alltests/1.0.11-SNAPSHOT/org.eclipse.tracecompass.alltests-1.0.11-SNAPSHOT-pack200.jar.pack.gz
16:12:27 [2022-03-30T20:12:27.469Z] [INFO] Installing /home/jenkins/agent/workspace/tracecompass-master-2020-06/releng/org.eclipse.tracecompass.alltests/target/p2content.xml to /home/jenkins/.m2/repository/org/eclipse/tracecompass/org.eclipse.tracecompass.alltests/1.0.11-SNAPSHOT/org.eclipse.tracecompass.alltests-1.0.11-SNAPSHOT-p2metadata.xml
16:12:27 [2022-03-30T20:12:27.469Z] [INFO] Installing /home/jenkins/agent/workspace/tracecompass-master-2020-06/releng/org.eclipse.tracecompass.alltests/target/p2artifacts.xml to /home/jenkins/.m2/repository/org/eclipse/tracecompass/org.eclipse.tracecompass.alltests/1.0.11-SNAPSHOT/org.eclipse.tracecompass.alltests-1.0.11-SNAPSHOT-p2artifacts.xml
16:12:27 [2022-03-30T20:12:27.469Z] [INFO] 
16:12:27 [2022-03-30T20:12:27.469Z] [INFO] --- tycho-p2-plugin:2.3.0:update-local-index (default-update-local-index) @ org.eclipse.tracecompass.alltests ---
16:12:27 [2022-03-30T20:12:27.469Z] [INFO] 
16:12:27 [2022-03-30T20:12:27.469Z] [INFO] --< org.eclipse.tracecompass:org.eclipse.tracecompass.integration.core.tests >--
16:12:27 [2022-03-30T20:12:27.469Z] [INFO] Building org.eclipse.tracecompass.integration.core.tests 1.0.0-SNAPSHOT [135/139]
16:12:27 [2022-03-30T20:12:27.469Z] [INFO] ------------------------[ eclipse-test-plugin ]-------------------------
16:12:27 [2022-03-30T20:12:27.469Z] [INFO] 
16:12:27 [2022-03-30T20:12:27.469Z] [INFO] --- maven-clean-plugin:3.0.0:clean (default-clean) @ org.eclipse.tracecompass.integration.core.tests ---
16:12:27 [2022-03-30T20:12:27.469Z] [INFO] 
16:12:27 [2022-03-30T20:12:27.469Z] [INFO] --- tycho-packaging-plugin:2.3.0:build-qualifier (default-build-qualifier) @ org.eclipse.tracecompass.integration.core.tests ---
16:12:27 [2022-03-30T20:12:27.469Z] [INFO] The project's OSGi version is 1.0.0.202203301911
16:12:27 [2022-03-30T20:12:27.469Z] [INFO] 
16:12:27 [2022-03-30T20:12:27.469Z] [INFO] --- tycho-packaging-plugin:2.3.0:validate-id (default-validate-id) @ org.eclipse.tracecompass.integration.core.tests ---
16:12:27 [2022-03-30T20:12:27.469Z] [INFO] 
16:12:27 [2022-03-30T20:12:27.469Z] [INFO] --- tycho-packaging-plugin:2.3.0:validate-version (default-validate-version) @ org.eclipse.tracecompass.integration.core.tests ---
16:12:27 [2022-03-30T20:12:27.469Z] [INFO] 
16:12:27 [2022-03-30T20:12:27.469Z] [INFO] --- maven-enforcer-plugin:3.0.0-M3:enforce (enforce-maven-version) @ org.eclipse.tracecompass.integration.core.tests ---
16:12:27 [2022-03-30T20:12:27.469Z] [INFO] 
16:12:27 [2022-03-30T20:12:27.469Z] [INFO] --- maven-resources-plugin:3.0.2:resources (default-resources) @ org.eclipse.tracecompass.integration.core.tests ---
16:12:27 [2022-03-30T20:12:27.469Z] [INFO] Using 'UTF-8' encoding to copy filtered resources.
16:12:27 [2022-03-30T20:12:27.469Z] [INFO] skip non existing resourceDirectory /home/jenkins/agent/workspace/tracecompass-master-2020-06/releng/org.eclipse.tracecompass.integration.core.tests/src/main/resources
16:12:27 [2022-03-30T20:12:27.469Z] [INFO] 
16:12:27 [2022-03-30T20:12:27.469Z] [INFO] --- tycho-compiler-plugin:2.3.0:compile (default-compile) @ org.eclipse.tracecompass.integration.core.tests ---
16:12:27 [2022-03-30T20:12:27.469Z] [INFO] Compiling 1 source file to /home/jenkins/agent/workspace/tracecompass-master-2020-06/releng/org.eclipse.tracecompass.integration.core.tests/target/classes
16:12:27 [2022-03-30T20:12:27.727Z] [INFO] 
16:12:27 [2022-03-30T20:12:27.727Z] [INFO] --- maven-resources-plugin:3.0.2:testResources (default-testResources) @ org.eclipse.tracecompass.integration.core.tests ---
16:12:27 [2022-03-30T20:12:27.727Z] [INFO] Using 'UTF-8' encoding to copy filtered resources.
16:12:27 [2022-03-30T20:12:27.727Z] [INFO] skip non existing resourceDirectory /home/jenkins/agent/workspace/tracecompass-master-2020-06/releng/org.eclipse.tracecompass.integration.core.tests/src/test/resources
16:12:27 [2022-03-30T20:12:27.727Z] [INFO] 
16:12:27 [2022-03-30T20:12:27.727Z] [INFO] --- tycho-source-plugin:2.3.0:plugin-source (plugin-source) @ org.eclipse.tracecompass.integration.core.tests ---
16:12:27 [2022-03-30T20:12:27.727Z] [INFO] Building jar: /home/jenkins/agent/workspace/tracecompass-master-2020-06/releng/org.eclipse.tracecompass.integration.core.tests/target/org.eclipse.tracecompass.integration.core.tests-1.0.0-SNAPSHOT-sources.jar
16:12:27 [2022-03-30T20:12:27.727Z] [INFO] 
16:12:27 [2022-03-30T20:12:27.727Z] [INFO] --- target-platform-configuration:2.3.0:target-platform (default-target-platform) @ org.eclipse.tracecompass.integration.core.tests ---
16:12:27 [2022-03-30T20:12:27.727Z] [INFO] 
16:12:27 [2022-03-30T20:12:27.727Z] [INFO] --- tycho-packaging-plugin:2.3.0:package-plugin (default-package-plugin) @ org.eclipse.tracecompass.integration.core.tests ---
16:12:27 [2022-03-30T20:12:27.727Z] [INFO] Building jar: /home/jenkins/agent/workspace/tracecompass-master-2020-06/releng/org.eclipse.tracecompass.integration.core.tests/target/org.eclipse.tracecompass.integration.core.tests-1.0.0-SNAPSHOT.jar
16:12:27 [2022-03-30T20:12:27.727Z] [INFO] 
16:12:27 [2022-03-30T20:12:27.727Z] [INFO] --- tycho-p2-plugin:2.3.0:p2-metadata-default (default-p2-metadata-default) @ org.eclipse.tracecompass.integration.core.tests ---
16:12:27 [2022-03-30T20:12:27.727Z] [INFO] 
16:12:27 [2022-03-30T20:12:27.727Z] [INFO] --- tycho-source-feature-plugin:2.3.0:source-feature (source-feature) @ org.eclipse.tracecompass.integration.core.tests ---
16:12:27 [2022-03-30T20:12:27.727Z] [WARNING] Mojo tycho-source-feature-plugin:source-feature is replaced by the tycho-source-plugin:feature-source which offers equivalent and even enhanced functionality
16:12:27 [2022-03-30T20:12:27.727Z] [INFO] 
16:12:27 [2022-03-30T20:12:27.727Z] [INFO] --- tycho-pack200b-plugin:2.3.0:pack (pack200-pack) @ org.eclipse.tracecompass.integration.core.tests ---
16:12:27 [2022-03-30T20:12:27.727Z] [WARNING] Pack200 actions are deprecated and scheduled for removal.
16:12:27 [2022-03-30T20:12:27.727Z] [INFO] Pack200 packing jar /home/jenkins/agent/workspace/tracecompass-master-2020-06/releng/org.eclipse.tracecompass.integration.core.tests/target/org.eclipse.tracecompass.integration.core.tests-1.0.0-SNAPSHOT.jar
16:12:27 [2022-03-30T20:12:27.727Z] [INFO] 
16:12:27 [2022-03-30T20:12:27.727Z] [INFO] --- tycho-p2-plugin:2.3.0:p2-metadata (p2-metadata) @ org.eclipse.tracecompass.integration.core.tests ---
16:12:27 [2022-03-30T20:12:27.727Z] [INFO] 
16:12:27 [2022-03-30T20:12:27.727Z] [INFO] --- tycho-surefire-plugin:2.3.0:test (default-test) @ org.eclipse.tracecompass.integration.core.tests ---
16:12:27 [2022-03-30T20:12:27.986Z] [INFO] Executing Test Runtime with timeout 0, logs (if any) will be placed at: /home/jenkins/agent/workspace/tracecompass-master-2020-06/releng/org.eclipse.tracecompass.integration.core.tests/target/work/data/.metadata/.log
16:12:27 [2022-03-30T20:12:27.986Z] [INFO] Command line:
16:12:27 [2022-03-30T20:12:27.986Z] 	[/opt/tools/java/openjdk/jdk-11/11.0.2+9/bin/java, -Dosgi.noShutdown=false, -Dosgi.os=linux, -Dosgi.ws=gtk, -Dosgi.arch=x86_64, -Dorg.eclipse.swt.browser.DefaultType=mozilla, -Xms512m, -Xmx1024m, -Dosgi.clean=true, -jar, /home/jenkins/.m2/repository/p2/osgi/bundle/org.eclipse.equinox.launcher/1.5.700.v20200207-2156/org.eclipse.equinox.launcher-1.5.700.v20200207-2156.jar, -data, /home/jenkins/agent/workspace/tracecompass-master-2020-06/releng/org.eclipse.tracecompass.integration.core.tests/target/work/data, -install, /home/jenkins/agent/workspace/tracecompass-master-2020-06/releng/org.eclipse.tracecompass.integration.core.tests/target/work, -configuration, /home/jenkins/agent/workspace/tracecompass-master-2020-06/releng/org.eclipse.tracecompass.integration.core.tests/target/work/configuration, -application, org.eclipse.tycho.surefire.osgibooter.headlesstest, -testproperties, /home/jenkins/agent/workspace/tracecompass-master-2020-06/releng/org.eclipse.tracecompass.integration.core.tests/target/surefire.properties, -product, org.eclipse.platform.ide, -consoleLog]
16:12:27 [2022-03-30T20:12:27.986Z] Picked up _JAVA_OPTIONS: -Duser.home=/home/tracecompass
16:12:30 [2022-03-30T20:12:30.773Z] !SESSION 2022-03-30 20:12:28.044 -----------------------------------------------
16:12:30 [2022-03-30T20:12:30.773Z] eclipse.buildId=unknown
16:12:30 [2022-03-30T20:12:30.773Z] java.version=11.0.2
16:12:30 [2022-03-30T20:12:30.773Z] java.vendor=Oracle Corporation
16:12:30 [2022-03-30T20:12:30.773Z] BootLoader constants: OS=linux, ARCH=x86_64, WS=gtk, NL=en_US
16:12:30 [2022-03-30T20:12:30.773Z] Framework arguments:  -application org.eclipse.tycho.surefire.osgibooter.headlesstest -testproperties /home/jenkins/agent/workspace/tracecompass-master-2020-06/releng/org.eclipse.tracecompass.integration.core.tests/target/surefire.properties -product org.eclipse.platform.ide
16:12:30 [2022-03-30T20:12:30.773Z] Command-line arguments:  -data /home/jenkins/agent/workspace/tracecompass-master-2020-06/releng/org.eclipse.tracecompass.integration.core.tests/target/work/data -application org.eclipse.tycho.surefire.osgibooter.headlesstest -testproperties /home/jenkins/agent/workspace/tracecompass-master-2020-06/releng/org.eclipse.tracecompass.integration.core.tests/target/surefire.properties -product org.eclipse.platform.ide -consoleLog
16:12:30 [2022-03-30T20:12:30.773Z] 
16:12:30 [2022-03-30T20:12:30.773Z] !ENTRY org.eclipse.compare.win32 4 0 2022-03-30 20:12:30.548
16:12:30 [2022-03-30T20:12:30.773Z] !MESSAGE FrameworkEvent ERROR
16:12:30 [2022-03-30T20:12:30.773Z] !STACK 0
16:12:30 [2022-03-30T20:12:30.773Z] org.osgi.framework.BundleException: Could not resolve module: org.eclipse.compare.win32 [62]
16:12:30 [2022-03-30T20:12:30.773Z]   Unresolved requirement: Require-Capability: eclipse.platform; filter:="(osgi.os=win32)"
16:12:30 [2022-03-30T20:12:30.773Z] 
16:12:30 [2022-03-30T20:12:30.773Z] 	at org.eclipse.osgi.container.Module.start(Module.java:463)
16:12:30 [2022-03-30T20:12:30.773Z] 	at org.eclipse.osgi.container.ModuleContainer$ContainerStartLevel$2.run(ModuleContainer.java:1845)
16:12:30 [2022-03-30T20:12:30.773Z] 	at org.eclipse.osgi.internal.framework.EquinoxContainerAdaptor$1$1.execute(EquinoxContainerAdaptor.java:136)
16:12:30 [2022-03-30T20:12:30.773Z] 	at org.eclipse.osgi.container.ModuleContainer$ContainerStartLevel.incStartLevel(ModuleContainer.java:1838)
16:12:30 [2022-03-30T20:12:30.773Z] 	at org.eclipse.osgi.container.ModuleContainer$ContainerStartLevel.incStartLevel(ModuleContainer.java:1779)
16:12:30 [2022-03-30T20:12:30.773Z] 	at org.eclipse.osgi.container.ModuleContainer$ContainerStartLevel.doContainerStartLevel(ModuleContainer.java:1743)
16:12:30 [2022-03-30T20:12:30.773Z] 	at org.eclipse.osgi.container.ModuleContainer$ContainerStartLevel.dispatchEvent(ModuleContainer.java:1665)
16:12:30 [2022-03-30T20:12:30.773Z] 	at org.eclipse.osgi.container.ModuleContainer$ContainerStartLevel.dispatchEvent(ModuleContainer.java:1)
16:12:30 [2022-03-30T20:12:30.773Z] 	at org.eclipse.osgi.framework.eventmgr.EventManager.dispatchEvent(EventManager.java:234)
16:12:30 [2022-03-30T20:12:30.773Z] 	at org.eclipse.osgi.framework.eventmgr.EventManager$EventThread.run(EventManager.java:345)
16:12:30 [2022-03-30T20:12:30.773Z] 
16:12:30 [2022-03-30T20:12:30.773Z] !ENTRY org.eclipse.ecf.provider.filetransfer.httpclient45.win32 4 0 2022-03-30 20:12:30.572
16:12:30 [2022-03-30T20:12:30.773Z] !MESSAGE FrameworkEvent ERROR
16:12:30 [2022-03-30T20:12:30.773Z] !STACK 0
16:12:30 [2022-03-30T20:12:30.773Z] org.osgi.framework.BundleException: Could not resolve module: org.eclipse.ecf.provider.filetransfer.httpclient45.win32 [134]
16:12:30 [2022-03-30T20:12:30.773Z]   Unresolved requirement: Require-Capability: eclipse.platform; filter:="(osgi.os=win32)"
16:12:30 [2022-03-30T20:12:30.773Z]   Unresolved requirement: Import-Package: org.apache.http.impl.auth.win; version="[4.5.0,5.0.0)"
16:12:30 [2022-03-30T20:12:30.773Z]     -> Export-Package: org.apache.http.impl.auth.win; bundle-symbolic-name="org.apache.httpcomponents.httpclient.win"; bundle-version="4.5.10.v20200113-2105"; version="4.5.10"; x-internal:="true"; uses:="org.apache.http,org.apache.http.auth,org.apache.http.client,org.apache.http.impl.auth,org.apache.http.protocol,org.apache.http.util"
16:12:30 [2022-03-30T20:12:30.773Z]        org.apache.httpcomponents.httpclient.win [36]
16:12:30 [2022-03-30T20:12:30.773Z]          Unresolved requirement: Require-Capability: eclipse.platform; filter:="(osgi.os=win32)"
16:12:30 [2022-03-30T20:12:30.773Z] 
16:12:30 [2022-03-30T20:12:30.773Z] 	at org.eclipse.osgi.container.Module.start(Module.java:463)
16:12:30 [2022-03-30T20:12:30.773Z] 	at org.eclipse.osgi.container.ModuleContainer$ContainerStartLevel$2.run(ModuleContainer.java:1845)
16:12:30 [2022-03-30T20:12:30.773Z] 	at org.eclipse.osgi.internal.framework.EquinoxContainerAdaptor$1$1.execute(EquinoxContainerAdaptor.java:136)
16:12:30 [2022-03-30T20:12:30.773Z] 	at org.eclipse.osgi.container.ModuleContainer$ContainerStartLevel.incStartLevel(ModuleContainer.java:1838)
16:12:30 [2022-03-30T20:12:30.773Z] 	at org.eclipse.osgi.container.ModuleContainer$ContainerStartLevel.incStartLevel(ModuleContainer.java:1779)
16:12:30 [2022-03-30T20:12:30.773Z] 	at org.eclipse.osgi.container.ModuleContainer$ContainerStartLevel.doContainerStartLevel(ModuleContainer.java:1743)
16:12:30 [2022-03-30T20:12:30.774Z] 	at org.eclipse.osgi.container.ModuleContainer$ContainerStartLevel.dispatchEvent(ModuleContainer.java:1665)
16:12:30 [2022-03-30T20:12:30.774Z] 	at org.eclipse.osgi.container.ModuleContainer$ContainerStartLevel.dispatchEvent(ModuleContainer.java:1)
16:12:30 [2022-03-30T20:12:30.774Z] 	at org.eclipse.osgi.framework.eventmgr.EventManager.dispatchEvent(EventManager.java:234)
16:12:30 [2022-03-30T20:12:30.774Z] 	at org.eclipse.osgi.framework.eventmgr.EventManager$EventThread.run(EventManager.java:345)
16:12:33 [2022-03-30T20:12:33.302Z] Running org.eclipse.tracecompass.integration.core.tests.dataproviders.DataProviderManagerTest
16:12:55 [2022-03-30T20:12:55.224Z] Tests run: 2, Failures: 0, Errors: 0, Skipped: 0, Time elapsed: 20.258 s - in org.eclipse.tracecompass.integration.core.tests.dataproviders.DataProviderManagerTest
16:12:55 [2022-03-30T20:12:55.224Z] test(org.eclipse.tracecompass.integration.core.tests.dataproviders.DataProviderManagerTest)  Time elapsed: 0.007 s
16:12:55 [2022-03-30T20:12:55.224Z] testGetter(org.eclipse.tracecompass.integration.core.tests.dataproviders.DataProviderManagerTest)  Time elapsed: 0.008 s
16:12:55 [2022-03-30T20:12:55.224Z] 
16:12:55 [2022-03-30T20:12:55.224Z] Results:
16:12:55 [2022-03-30T20:12:55.224Z] 
16:12:55 [2022-03-30T20:12:55.224Z] Tests run: 2, Failures: 0, Errors: 0, Skipped: 0
16:12:55 [2022-03-30T20:12:55.224Z] 
16:12:55 [2022-03-30T20:12:55.224Z] [INFO] All tests passed!
16:12:55 [2022-03-30T20:12:55.224Z] [INFO] 
16:12:55 [2022-03-30T20:12:55.224Z] [INFO] --- maven-install-plugin:2.5.2:install (default-install) @ org.eclipse.tracecompass.integration.core.tests ---
16:12:55 [2022-03-30T20:12:55.224Z] [INFO] Installing /home/jenkins/agent/workspace/tracecompass-master-2020-06/releng/org.eclipse.tracecompass.integration.core.tests/target/org.eclipse.tracecompass.integration.core.tests-1.0.0-SNAPSHOT.jar to /home/jenkins/.m2/repository/org/eclipse/tracecompass/org.eclipse.tracecompass.integration.core.tests/1.0.0-SNAPSHOT/org.eclipse.tracecompass.integration.core.tests-1.0.0-SNAPSHOT.jar
16:12:55 [2022-03-30T20:12:55.225Z] [INFO] Installing /home/jenkins/agent/workspace/tracecompass-master-2020-06/releng/org.eclipse.tracecompass.integration.core.tests/pom.xml to /home/jenkins/.m2/repository/org/eclipse/tracecompass/org.eclipse.tracecompass.integration.core.tests/1.0.0-SNAPSHOT/org.eclipse.tracecompass.integration.core.tests-1.0.0-SNAPSHOT.pom
16:12:55 [2022-03-30T20:12:55.225Z] [INFO] Installing /home/jenkins/agent/workspace/tracecompass-master-2020-06/releng/org.eclipse.tracecompass.integration.core.tests/target/org.eclipse.tracecompass.integration.core.tests-1.0.0-SNAPSHOT-sources.jar to /home/jenkins/.m2/repository/org/eclipse/tracecompass/org.eclipse.tracecompass.integration.core.tests/1.0.0-SNAPSHOT/org.eclipse.tracecompass.integration.core.tests-1.0.0-SNAPSHOT-sources.jar
16:12:55 [2022-03-30T20:12:55.225Z] [INFO] Installing /home/jenkins/agent/workspace/tracecompass-master-2020-06/releng/org.eclipse.tracecompass.integration.core.tests/target/org.eclipse.tracecompass.integration.core.tests-1.0.0-SNAPSHOT.jar.pack.gz to /home/jenkins/.m2/repository/org/eclipse/tracecompass/org.eclipse.tracecompass.integration.core.tests/1.0.0-SNAPSHOT/org.eclipse.tracecompass.integration.core.tests-1.0.0-SNAPSHOT-pack200.jar.pack.gz
16:12:55 [2022-03-30T20:12:55.225Z] [INFO] Installing /home/jenkins/agent/workspace/tracecompass-master-2020-06/releng/org.eclipse.tracecompass.integration.core.tests/target/p2content.xml to /home/jenkins/.m2/repository/org/eclipse/tracecompass/org.eclipse.tracecompass.integration.core.tests/1.0.0-SNAPSHOT/org.eclipse.tracecompass.integration.core.tests-1.0.0-SNAPSHOT-p2metadata.xml
16:12:55 [2022-03-30T20:12:55.225Z] [INFO] Installing /home/jenkins/agent/workspace/tracecompass-master-2020-06/releng/org.eclipse.tracecompass.integration.core.tests/target/p2artifacts.xml to /home/jenkins/.m2/repository/org/eclipse/tracecompass/org.eclipse.tracecompass.integration.core.tests/1.0.0-SNAPSHOT/org.eclipse.tracecompass.integration.core.tests-1.0.0-SNAPSHOT-p2artifacts.xml
16:12:55 [2022-03-30T20:12:55.225Z] [INFO] 
16:12:55 [2022-03-30T20:12:55.225Z] [INFO] --- tycho-p2-plugin:2.3.0:update-local-index (default-update-local-index) @ org.eclipse.tracecompass.integration.core.tests ---
16:12:55 [2022-03-30T20:12:55.225Z] [INFO] 
16:12:55 [2022-03-30T20:12:55.225Z] [INFO] -----< org.eclipse.tracecompass:org.eclipse.tracecompass.testing >------
16:12:55 [2022-03-30T20:12:55.225Z] [INFO] Building org.eclipse.tracecompass.testing 7.3.0-SNAPSHOT       [136/139]
16:12:55 [2022-03-30T20:12:55.225Z] [INFO] --------------------------[ eclipse-feature ]---------------------------
16:12:55 [2022-03-30T20:12:55.225Z] [INFO] 
16:12:55 [2022-03-30T20:12:55.225Z] [INFO] --- maven-clean-plugin:3.0.0:clean (default-clean) @ org.eclipse.tracecompass.testing ---
16:12:55 [2022-03-30T20:12:55.225Z] [INFO] Deleting /home/jenkins/agent/workspace/tracecompass-master-2020-06/releng/org.eclipse.tracecompass.testing/target
16:12:55 [2022-03-30T20:12:55.225Z] [INFO] 
16:12:55 [2022-03-30T20:12:55.225Z] [INFO] --- tycho-packaging-plugin:2.3.0:build-qualifier-aggregator (default-build-qualifier-aggregator) @ org.eclipse.tracecompass.testing ---
16:12:55 [2022-03-30T20:12:55.225Z] [INFO] The project's OSGi version is 7.3.0.202203301911
16:12:55 [2022-03-30T20:12:55.225Z] [INFO] 
16:12:55 [2022-03-30T20:12:55.225Z] [INFO] --- tycho-packaging-plugin:2.3.0:validate-id (default-validate-id) @ org.eclipse.tracecompass.testing ---
16:12:55 [2022-03-30T20:12:55.225Z] [INFO] 
16:12:55 [2022-03-30T20:12:55.225Z] [INFO] --- tycho-packaging-plugin:2.3.0:validate-version (default-validate-version) @ org.eclipse.tracecompass.testing ---
16:12:55 [2022-03-30T20:12:55.225Z] [INFO] 
16:12:55 [2022-03-30T20:12:55.225Z] [INFO] --- maven-enforcer-plugin:3.0.0-M3:enforce (enforce-maven-version) @ org.eclipse.tracecompass.testing ---
16:12:55 [2022-03-30T20:12:55.225Z] [INFO] 
16:12:55 [2022-03-30T20:12:55.225Z] [INFO] --- target-platform-configuration:2.3.0:target-platform (default-target-platform) @ org.eclipse.tracecompass.testing ---
16:12:55 [2022-03-30T20:12:55.225Z] [INFO] 
16:12:55 [2022-03-30T20:12:55.225Z] [INFO] --- tycho-source-plugin:2.3.0:plugin-source (plugin-source) @ org.eclipse.tracecompass.testing ---
16:12:55 [2022-03-30T20:12:55.225Z] [INFO] 
16:12:55 [2022-03-30T20:12:55.225Z] [INFO] --- tycho-packaging-plugin:2.3.0:package-feature (default-package-feature) @ org.eclipse.tracecompass.testing ---
16:12:55 [2022-03-30T20:12:55.225Z] [INFO] Building jar: /home/jenkins/agent/workspace/tracecompass-master-2020-06/releng/org.eclipse.tracecompass.testing/target/org.eclipse.tracecompass.testing-7.3.0-SNAPSHOT.jar
16:12:55 [2022-03-30T20:12:55.225Z] [INFO] 
16:12:55 [2022-03-30T20:12:55.225Z] [INFO] --- tycho-p2-plugin:2.3.0:p2-metadata-default (default-p2-metadata-default) @ org.eclipse.tracecompass.testing ---
16:12:55 [2022-03-30T20:12:55.225Z] [INFO] 
16:12:55 [2022-03-30T20:12:55.225Z] [INFO] --- tycho-p2-plugin:2.3.0:feature-p2-metadata (default-feature-p2-metadata) @ org.eclipse.tracecompass.testing ---
16:12:55 [2022-03-30T20:12:55.225Z] [INFO] 
16:12:55 [2022-03-30T20:12:55.225Z] [INFO] --- tycho-source-feature-plugin:2.3.0:source-feature (source-feature) @ org.eclipse.tracecompass.testing ---
16:12:55 [2022-03-30T20:12:55.225Z] [WARNING] Mojo tycho-source-feature-plugin:source-feature is replaced by the tycho-source-plugin:feature-source which offers equivalent and even enhanced functionality
16:12:55 [2022-03-30T20:12:55.225Z] [INFO] Building jar: /home/jenkins/agent/workspace/tracecompass-master-2020-06/releng/org.eclipse.tracecompass.testing/target/org.eclipse.tracecompass.testing-7.3.0-SNAPSHOT-sources-feature.jar
16:12:55 [2022-03-30T20:12:55.225Z] [INFO] 
16:12:55 [2022-03-30T20:12:55.225Z] [INFO] --- tycho-pack200b-plugin:2.3.0:pack (pack200-pack) @ org.eclipse.tracecompass.testing ---
16:12:55 [2022-03-30T20:12:55.225Z] [WARNING] Pack200 actions are deprecated and scheduled for removal.
16:12:55 [2022-03-30T20:12:55.225Z] [INFO] 
16:12:55 [2022-03-30T20:12:55.225Z] [INFO] --- tycho-p2-plugin:2.3.0:p2-metadata (p2-metadata) @ org.eclipse.tracecompass.testing ---
16:12:55 [2022-03-30T20:12:55.225Z] [INFO] 
16:12:55 [2022-03-30T20:12:55.225Z] [INFO] --- maven-install-plugin:2.5.2:install (default-install) @ org.eclipse.tracecompass.testing ---
16:12:55 [2022-03-30T20:12:55.225Z] [INFO] Installing /home/jenkins/agent/workspace/tracecompass-master-2020-06/releng/org.eclipse.tracecompass.testing/target/org.eclipse.tracecompass.testing-7.3.0-SNAPSHOT.jar to /home/jenkins/.m2/repository/org/eclipse/tracecompass/org.eclipse.tracecompass.testing/7.3.0-SNAPSHOT/org.eclipse.tracecompass.testing-7.3.0-SNAPSHOT.jar
16:12:55 [2022-03-30T20:12:55.225Z] [INFO] Installing /home/jenkins/agent/workspace/tracecompass-master-2020-06/releng/org.eclipse.tracecompass.testing/.polyglot.build.properties to /home/jenkins/.m2/repository/org/eclipse/tracecompass/org.eclipse.tracecompass.testing/7.3.0-SNAPSHOT/org.eclipse.tracecompass.testing-7.3.0-SNAPSHOT.pom
16:12:55 [2022-03-30T20:12:55.225Z] [INFO] Installing /home/jenkins/agent/workspace/tracecompass-master-2020-06/releng/org.eclipse.tracecompass.testing/target/org.eclipse.tracecompass.testing-7.3.0-SNAPSHOT-sources-feature.jar to /home/jenkins/.m2/repository/org/eclipse/tracecompass/org.eclipse.tracecompass.testing/7.3.0-SNAPSHOT/org.eclipse.tracecompass.testing-7.3.0-SNAPSHOT-sources-feature.jar
16:12:55 [2022-03-30T20:12:55.225Z] [INFO] Installing /home/jenkins/agent/workspace/tracecompass-master-2020-06/releng/org.eclipse.tracecompass.testing/target/p2content.xml to /home/jenkins/.m2/repository/org/eclipse/tracecompass/org.eclipse.tracecompass.testing/7.3.0-SNAPSHOT/org.eclipse.tracecompass.testing-7.3.0-SNAPSHOT-p2metadata.xml
16:12:55 [2022-03-30T20:12:55.225Z] [INFO] Installing /home/jenkins/agent/workspace/tracecompass-master-2020-06/releng/org.eclipse.tracecompass.testing/target/p2artifacts.xml to /home/jenkins/.m2/repository/org/eclipse/tracecompass/org.eclipse.tracecompass.testing/7.3.0-SNAPSHOT/org.eclipse.tracecompass.testing-7.3.0-SNAPSHOT-p2artifacts.xml
16:12:55 [2022-03-30T20:12:55.225Z] [INFO] 
16:12:55 [2022-03-30T20:12:55.225Z] [INFO] --- tycho-p2-plugin:2.3.0:update-local-index (default-update-local-index) @ org.eclipse.tracecompass.testing ---
16:12:55 [2022-03-30T20:12:55.225Z] [INFO] 
16:12:55 [2022-03-30T20:12:55.225Z] [INFO] ----< org.eclipse.tracecompass:org.eclipse.tracecompass.tmf.remote >----
16:12:55 [2022-03-30T20:12:55.225Z] [INFO] Building org.eclipse.tracecompass.tmf.remote 7.3.0-SNAPSHOT    [137/139]
16:12:55 [2022-03-30T20:12:55.225Z] [INFO] --------------------------[ eclipse-feature ]---------------------------
16:12:55 [2022-03-30T20:12:55.225Z] [INFO] 
16:12:55 [2022-03-30T20:12:55.225Z] [INFO] --- maven-clean-plugin:3.0.0:clean (default-clean) @ org.eclipse.tracecompass.tmf.remote ---
16:12:55 [2022-03-30T20:12:55.225Z] [INFO] Deleting /home/jenkins/agent/workspace/tracecompass-master-2020-06/tmf/org.eclipse.tracecompass.tmf.remote/target
16:12:55 [2022-03-30T20:12:55.225Z] [INFO] 
16:12:55 [2022-03-30T20:12:55.225Z] [INFO] --- tycho-packaging-plugin:2.3.0:build-qualifier-aggregator (default-build-qualifier-aggregator) @ org.eclipse.tracecompass.tmf.remote ---
16:12:55 [2022-03-30T20:12:55.225Z] [INFO] The project's OSGi version is 7.3.0.202203301911
16:12:55 [2022-03-30T20:12:55.225Z] [INFO] 
16:12:55 [2022-03-30T20:12:55.225Z] [INFO] --- tycho-packaging-plugin:2.3.0:validate-id (default-validate-id) @ org.eclipse.tracecompass.tmf.remote ---
16:12:55 [2022-03-30T20:12:55.225Z] [INFO] 
16:12:55 [2022-03-30T20:12:55.225Z] [INFO] --- tycho-packaging-plugin:2.3.0:validate-version (default-validate-version) @ org.eclipse.tracecompass.tmf.remote ---
16:12:55 [2022-03-30T20:12:55.225Z] [INFO] 
16:12:55 [2022-03-30T20:12:55.225Z] [INFO] --- maven-enforcer-plugin:3.0.0-M3:enforce (enforce-maven-version) @ org.eclipse.tracecompass.tmf.remote ---
16:12:55 [2022-03-30T20:12:55.225Z] [INFO] 
16:12:55 [2022-03-30T20:12:55.225Z] [INFO] --- target-platform-configuration:2.3.0:target-platform (default-target-platform) @ org.eclipse.tracecompass.tmf.remote ---
16:12:55 [2022-03-30T20:12:55.225Z] [INFO] 
16:12:55 [2022-03-30T20:12:55.225Z] [INFO] --- tycho-source-plugin:2.3.0:plugin-source (plugin-source) @ org.eclipse.tracecompass.tmf.remote ---
16:12:55 [2022-03-30T20:12:55.225Z] [INFO] 
16:12:55 [2022-03-30T20:12:55.225Z] [INFO] --- tycho-packaging-plugin:2.3.0:package-feature (default-package-feature) @ org.eclipse.tracecompass.tmf.remote ---
16:12:55 [2022-03-30T20:12:55.225Z] [INFO] Building jar: /home/jenkins/agent/workspace/tracecompass-master-2020-06/tmf/org.eclipse.tracecompass.tmf.remote/target/org.eclipse.tracecompass.tmf.remote-7.3.0-SNAPSHOT.jar
16:12:55 [2022-03-30T20:12:55.225Z] [INFO] 
16:12:55 [2022-03-30T20:12:55.225Z] [INFO] --- tycho-p2-plugin:2.3.0:p2-metadata-default (default-p2-metadata-default) @ org.eclipse.tracecompass.tmf.remote ---
16:12:55 [2022-03-30T20:12:55.225Z] [INFO] 
16:12:55 [2022-03-30T20:12:55.225Z] [INFO] --- tycho-p2-plugin:2.3.0:feature-p2-metadata (default-feature-p2-metadata) @ org.eclipse.tracecompass.tmf.remote ---
16:12:55 [2022-03-30T20:12:55.226Z] [INFO] 
16:12:55 [2022-03-30T20:12:55.226Z] [INFO] --- tycho-source-feature-plugin:2.3.0:source-feature (source-feature) @ org.eclipse.tracecompass.tmf.remote ---
16:12:55 [2022-03-30T20:12:55.226Z] [WARNING] Mojo tycho-source-feature-plugin:source-feature is replaced by the tycho-source-plugin:feature-source which offers equivalent and even enhanced functionality
16:12:55 [2022-03-30T20:12:55.226Z] [INFO] Building jar: /home/jenkins/agent/workspace/tracecompass-master-2020-06/tmf/org.eclipse.tracecompass.tmf.remote/target/org.eclipse.tracecompass.tmf.remote-7.3.0-SNAPSHOT-sources-feature.jar
16:12:55 [2022-03-30T20:12:55.226Z] [INFO] 
16:12:55 [2022-03-30T20:12:55.226Z] [INFO] --- tycho-pack200b-plugin:2.3.0:pack (pack200-pack) @ org.eclipse.tracecompass.tmf.remote ---
16:12:55 [2022-03-30T20:12:55.226Z] [WARNING] Pack200 actions are deprecated and scheduled for removal.
16:12:55 [2022-03-30T20:12:55.226Z] [INFO] 
16:12:55 [2022-03-30T20:12:55.226Z] [INFO] --- tycho-p2-plugin:2.3.0:p2-metadata (p2-metadata) @ org.eclipse.tracecompass.tmf.remote ---
16:12:55 [2022-03-30T20:12:55.226Z] [INFO] 
16:12:55 [2022-03-30T20:12:55.226Z] [INFO] --- maven-install-plugin:2.5.2:install (default-install) @ org.eclipse.tracecompass.tmf.remote ---
16:12:55 [2022-03-30T20:12:55.226Z] [INFO] Installing /home/jenkins/agent/workspace/tracecompass-master-2020-06/tmf/org.eclipse.tracecompass.tmf.remote/target/org.eclipse.tracecompass.tmf.remote-7.3.0-SNAPSHOT.jar to /home/jenkins/.m2/repository/org/eclipse/tracecompass/org.eclipse.tracecompass.tmf.remote/7.3.0-SNAPSHOT/org.eclipse.tracecompass.tmf.remote-7.3.0-SNAPSHOT.jar
16:12:55 [2022-03-30T20:12:55.226Z] [INFO] Installing /home/jenkins/agent/workspace/tracecompass-master-2020-06/tmf/org.eclipse.tracecompass.tmf.remote/.polyglot.build.properties to /home/jenkins/.m2/repository/org/eclipse/tracecompass/org.eclipse.tracecompass.tmf.remote/7.3.0-SNAPSHOT/org.eclipse.tracecompass.tmf.remote-7.3.0-SNAPSHOT.pom
16:12:55 [2022-03-30T20:12:55.226Z] [INFO] Installing /home/jenkins/agent/workspace/tracecompass-master-2020-06/tmf/org.eclipse.tracecompass.tmf.remote/target/org.eclipse.tracecompass.tmf.remote-7.3.0-SNAPSHOT-sources-feature.jar to /home/jenkins/.m2/repository/org/eclipse/tracecompass/org.eclipse.tracecompass.tmf.remote/7.3.0-SNAPSHOT/org.eclipse.tracecompass.tmf.remote-7.3.0-SNAPSHOT-sources-feature.jar
16:12:55 [2022-03-30T20:12:55.226Z] [INFO] Installing /home/jenkins/agent/workspace/tracecompass-master-2020-06/tmf/org.eclipse.tracecompass.tmf.remote/target/p2content.xml to /home/jenkins/.m2/repository/org/eclipse/tracecompass/org.eclipse.tracecompass.tmf.remote/7.3.0-SNAPSHOT/org.eclipse.tracecompass.tmf.remote-7.3.0-SNAPSHOT-p2metadata.xml
16:12:55 [2022-03-30T20:12:55.226Z] [INFO] Installing /home/jenkins/agent/workspace/tracecompass-master-2020-06/tmf/org.eclipse.tracecompass.tmf.remote/target/p2artifacts.xml to /home/jenkins/.m2/repository/org/eclipse/tracecompass/org.eclipse.tracecompass.tmf.remote/7.3.0-SNAPSHOT/org.eclipse.tracecompass.tmf.remote-7.3.0-SNAPSHOT-p2artifacts.xml
16:12:55 [2022-03-30T20:12:55.226Z] [INFO] 
16:12:55 [2022-03-30T20:12:55.226Z] [INFO] --- tycho-p2-plugin:2.3.0:update-local-index (default-update-local-index) @ org.eclipse.tracecompass.tmf.remote ---
16:12:55 [2022-03-30T20:12:55.226Z] [INFO] 
16:12:55 [2022-03-30T20:12:55.226Z] [INFO] ---< org.eclipse.tracecompass:org.eclipse.tracecompass.releng-site >----
16:12:55 [2022-03-30T20:12:55.226Z] [INFO] Building Trace Compass Repository 7.3.0-SNAPSHOT               [138/139]
16:12:55 [2022-03-30T20:12:55.226Z] [INFO] -------------------------[ eclipse-repository ]-------------------------
16:12:55 [2022-03-30T20:12:55.226Z] [INFO] 
16:12:55 [2022-03-30T20:12:55.226Z] [INFO] --- maven-clean-plugin:3.0.0:clean (default-clean) @ org.eclipse.tracecompass.releng-site ---
16:12:55 [2022-03-30T20:12:55.226Z] [INFO] 
16:12:55 [2022-03-30T20:12:55.226Z] [INFO] --- tycho-packaging-plugin:2.3.0:build-qualifier-aggregator (default-build-qualifier-aggregator) @ org.eclipse.tracecompass.releng-site ---
16:12:55 [2022-03-30T20:12:55.226Z] [INFO] The project's OSGi version is 7.3.0.202203301911
16:12:55 [2022-03-30T20:12:55.226Z] [INFO] 
16:12:55 [2022-03-30T20:12:55.226Z] [INFO] --- maven-enforcer-plugin:3.0.0-M3:enforce (enforce-maven-version) @ org.eclipse.tracecompass.releng-site ---
16:12:55 [2022-03-30T20:12:55.226Z] [INFO] 
16:12:55 [2022-03-30T20:12:55.226Z] [INFO] --- maven-clean-plugin:3.0.0:clean (default-clean-1) @ org.eclipse.tracecompass.releng-site ---
16:12:55 [2022-03-30T20:12:55.226Z] [INFO] 
16:12:55 [2022-03-30T20:12:55.226Z] [INFO] --- maven-resources-plugin:3.0.2:resources (default-resources) @ org.eclipse.tracecompass.releng-site ---
16:12:55 [2022-03-30T20:12:55.226Z] [INFO] Using 'UTF-8' encoding to copy filtered resources.
16:12:55 [2022-03-30T20:12:55.226Z] [INFO] skip non existing resourceDirectory /home/jenkins/agent/workspace/tracecompass-master-2020-06/releng/org.eclipse.tracecompass.releng-site/src/main/resources
16:12:55 [2022-03-30T20:12:55.226Z] [INFO] 
16:12:55 [2022-03-30T20:12:55.226Z] [INFO] --- target-platform-configuration:2.3.0:target-platform (default-target-platform) @ org.eclipse.tracecompass.releng-site ---
16:12:55 [2022-03-30T20:12:55.226Z] [INFO] 
16:12:55 [2022-03-30T20:12:55.226Z] [INFO] --- tycho-p2-publisher-plugin:2.3.0:publish-osgi-ee (default-publish-osgi-ee) @ org.eclipse.tracecompass.releng-site ---
16:12:55 [2022-03-30T20:12:55.226Z] [INFO] Published profile IUs: [config.a.jre.javase 11.0.0, a.jre.javase 11.0.0]
16:12:55 [2022-03-30T20:12:55.226Z] [INFO] Published profile IUs: [config.a.jre.javase 15.0.0, a.jre.javase 15.0.0]
16:12:55 [2022-03-30T20:12:55.226Z] [INFO] Published profile IUs: [config.a.jre.javase 16.0.0, a.jre.javase 16.0.0]
16:12:55 [2022-03-30T20:12:55.226Z] [INFO] 
16:12:55 [2022-03-30T20:12:55.226Z] [INFO] --- tycho-p2-publisher-plugin:2.3.0:publish-products (default-publish-products) @ org.eclipse.tracecompass.releng-site ---
16:12:55 [2022-03-30T20:12:55.226Z] [INFO] 
16:12:55 [2022-03-30T20:12:55.226Z] [INFO] --- tycho-p2-publisher-plugin:2.3.0:publish-categories (default-publish-categories) @ org.eclipse.tracecompass.releng-site ---
16:12:55 [2022-03-30T20:12:55.226Z] [INFO] 
16:12:55 [2022-03-30T20:12:55.226Z] [INFO] --- tycho-p2-publisher-plugin:2.3.0:attach-artifacts (default-attach-artifacts) @ org.eclipse.tracecompass.releng-site ---
16:12:55 [2022-03-30T20:12:55.226Z] [INFO] 
16:12:55 [2022-03-30T20:12:55.226Z] [INFO] --- tycho-p2-repository-plugin:2.3.0:assemble-repository (default-assemble-repository) @ org.eclipse.tracecompass.releng-site ---
16:12:55 [2022-03-30T20:12:55.226Z] [INFO] Fetching org.eclipse.cdt.dsf.gdb.ui_2.6.500.202003021149.jar.pack.gz from https://download.eclipse.org/tools/cdt/releases/9.11/cdt-9.11.1/plugins/ (245.28kB)
16:12:55 [2022-03-30T20:12:55.226Z] [INFO] The user operation is waiting for background work to complete.
16:12:55 [2022-03-30T20:12:55.226Z] [INFO] Unpacking org.eclipse.cdt.dsf.gdb.ui_2.6.500.202003021149...
16:12:55 [2022-03-30T20:12:55.226Z] [INFO] Fetching org.eclipse.cdt.dsf.ui_2.5.400.202003021149.jar.pack.gz from https://download.eclipse.org/tools/cdt/releases/9.11/cdt-9.11.1/plugins/ (359.65kB)
16:12:55 [2022-03-30T20:12:55.226Z] [INFO] The user operation is waiting for background work to complete.
16:12:55 [2022-03-30T20:12:55.226Z] [INFO] Fetching org.eclipse.cdt.dsf.ui_2.5.400.202003021149.jar.pack.gz from https://download.eclipse.org/tools/cdt/releases/9.11/cdt-9.11.1/plugins/ (359.65kB)
16:12:55 [2022-03-30T20:12:55.226Z] [INFO] Unpacking org.eclipse.cdt.dsf.ui_2.5.400.202003021149...
16:12:55 [2022-03-30T20:12:55.483Z] [INFO] Fetching org.eclipse.tm.terminal.control_4.6.1.202005200056.jar.pack.gz from https://download.eclipse.org/tools/cdt/releases/9.11/cdt-9.11.1/plugins/ (72.59kB)
16:12:55 [2022-03-30T20:12:55.483Z] [INFO] The user operation is waiting for background work to complete.
16:12:55 [2022-03-30T20:12:55.483Z] [INFO] Fetching org.eclipse.tm.terminal.control_4.6.1.202005200056.jar.pack.gz from https://download.eclipse.org/tools/cdt/releases/9.11/cdt-9.11.1/plugins/ (72.59kB)
16:12:55 [2022-03-30T20:12:55.741Z] [INFO] Unpacking org.eclipse.tm.terminal.control_4.6.1.202005200056...
16:13:02 [2022-03-30T20:13:02.299Z] [INFO] 
16:13:02 [2022-03-30T20:13:02.299Z] [INFO] --- tycho-source-plugin:2.3.0:plugin-source (plugin-source) @ org.eclipse.tracecompass.releng-site ---
16:13:02 [2022-03-30T20:13:02.299Z] [INFO] 
16:13:02 [2022-03-30T20:13:02.299Z] [INFO] --- tycho-p2-repository-plugin:2.3.0:archive-repository (default-archive-repository) @ org.eclipse.tracecompass.releng-site ---
16:13:02 [2022-03-30T20:13:02.299Z] [INFO] 
16:13:02 [2022-03-30T20:13:02.299Z] [INFO] --- tycho-source-feature-plugin:2.3.0:source-feature (source-feature) @ org.eclipse.tracecompass.releng-site ---
16:13:02 [2022-03-30T20:13:02.299Z] [WARNING] Mojo tycho-source-feature-plugin:source-feature is replaced by the tycho-source-plugin:feature-source which offers equivalent and even enhanced functionality
16:13:02 [2022-03-30T20:13:02.299Z] [INFO] 
16:13:02 [2022-03-30T20:13:02.299Z] [INFO] --- tycho-pack200b-plugin:2.3.0:pack (pack200-pack) @ org.eclipse.tracecompass.releng-site ---
16:13:02 [2022-03-30T20:13:02.299Z] [WARNING] Pack200 actions are deprecated and scheduled for removal.
16:13:02 [2022-03-30T20:13:02.299Z] [INFO] 
16:13:02 [2022-03-30T20:13:02.299Z] [INFO] --- tycho-p2-plugin:2.3.0:p2-metadata (p2-metadata) @ org.eclipse.tracecompass.releng-site ---
16:13:02 [2022-03-30T20:13:02.299Z] [INFO] 
16:13:02 [2022-03-30T20:13:02.299Z] [INFO] --- repository-utils:1.7.0:generate-repository-facade (generate-facade) @ org.eclipse.tracecompass.releng-site ---
16:13:03 [2022-03-30T20:13:03.670Z] [INFO] Building zip: /home/jenkins/agent/workspace/tracecompass-master-2020-06/releng/org.eclipse.tracecompass.releng-site/target/org.eclipse.tracecompass.releng-site-7.3.0-SNAPSHOT.zip
16:13:05 [2022-03-30T20:13:05.569Z] [INFO] 
16:13:05 [2022-03-30T20:13:05.569Z] [INFO] --- maven-install-plugin:2.5.2:install (default-install) @ org.eclipse.tracecompass.releng-site ---
16:13:05 [2022-03-30T20:13:05.569Z] [INFO] No primary artifact to install, installing attached artifacts instead.
16:13:05 [2022-03-30T20:13:05.569Z] [INFO] Installing /home/jenkins/agent/workspace/tracecompass-master-2020-06/releng/org.eclipse.tracecompass.releng-site/pom.xml to /home/jenkins/.m2/repository/org/eclipse/tracecompass/org.eclipse.tracecompass.releng-site/7.3.0-SNAPSHOT/org.eclipse.tracecompass.releng-site-7.3.0-SNAPSHOT.pom
16:13:05 [2022-03-30T20:13:05.569Z] [INFO] Installing /home/jenkins/agent/workspace/tracecompass-master-2020-06/releng/org.eclipse.tracecompass.releng-site/target/p2content.xml to /home/jenkins/.m2/repository/org/eclipse/tracecompass/org.eclipse.tracecompass.releng-site/7.3.0-SNAPSHOT/org.eclipse.tracecompass.releng-site-7.3.0-SNAPSHOT-p2metadata.xml
16:13:05 [2022-03-30T20:13:05.569Z] [INFO] Installing /home/jenkins/agent/workspace/tracecompass-master-2020-06/releng/org.eclipse.tracecompass.releng-site/target/p2artifacts.xml to /home/jenkins/.m2/repository/org/eclipse/tracecompass/org.eclipse.tracecompass.releng-site/7.3.0-SNAPSHOT/org.eclipse.tracecompass.releng-site-7.3.0-SNAPSHOT-p2artifacts.xml
16:13:05 [2022-03-30T20:13:05.569Z] [INFO] 
16:13:05 [2022-03-30T20:13:05.569Z] [INFO] --- tycho-p2-plugin:2.3.0:update-local-index (default-update-local-index) @ org.eclipse.tracecompass.releng-site ---
16:13:05 [2022-03-30T20:13:05.569Z] [INFO] 
16:13:05 [2022-03-30T20:13:05.569Z] [INFO] --< org.eclipse.tracecompass:org.eclipse.tracecompass.jsontrace.core.tests >--
16:13:05 [2022-03-30T20:13:05.569Z] [INFO] Building org.eclipse.tracecompass.jsontrace.core.tests 1.0.3-SNAPSHOT [139/139]
16:13:05 [2022-03-30T20:13:05.569Z] [INFO] ---------------------------[ eclipse-plugin ]---------------------------
16:13:05 [2022-03-30T20:13:05.569Z] [INFO] 
16:13:05 [2022-03-30T20:13:05.569Z] [INFO] --- maven-clean-plugin:3.0.0:clean (default-clean) @ org.eclipse.tracecompass.jsontrace.core.tests ---
16:13:05 [2022-03-30T20:13:05.569Z] [INFO] 
16:13:05 [2022-03-30T20:13:05.569Z] [INFO] --- tycho-packaging-plugin:2.3.0:build-qualifier (default-build-qualifier) @ org.eclipse.tracecompass.jsontrace.core.tests ---
16:13:05 [2022-03-30T20:13:05.569Z] [INFO] The project's OSGi version is 1.0.3.202203301911
16:13:05 [2022-03-30T20:13:05.569Z] [INFO] 
16:13:05 [2022-03-30T20:13:05.569Z] [INFO] --- tycho-packaging-plugin:2.3.0:validate-id (default-validate-id) @ org.eclipse.tracecompass.jsontrace.core.tests ---
16:13:05 [2022-03-30T20:13:05.569Z] [INFO] 
16:13:05 [2022-03-30T20:13:05.569Z] [INFO] --- tycho-packaging-plugin:2.3.0:validate-version (default-validate-version) @ org.eclipse.tracecompass.jsontrace.core.tests ---
16:13:05 [2022-03-30T20:13:05.569Z] [INFO] 
16:13:05 [2022-03-30T20:13:05.569Z] [INFO] --- maven-enforcer-plugin:3.0.0-M3:enforce (enforce-maven-version) @ org.eclipse.tracecompass.jsontrace.core.tests ---
16:13:05 [2022-03-30T20:13:05.569Z] [INFO] 
16:13:05 [2022-03-30T20:13:05.569Z] [INFO] --- maven-resources-plugin:3.0.2:resources (default-resources) @ org.eclipse.tracecompass.jsontrace.core.tests ---
16:13:05 [2022-03-30T20:13:05.569Z] [INFO] Using 'UTF-8' encoding to copy filtered resources.
16:13:05 [2022-03-30T20:13:05.569Z] [INFO] skip non existing resourceDirectory /home/jenkins/agent/workspace/tracecompass-master-2020-06/jsontrace/org.eclipse.tracecompass.jsontrace.core.tests/src/main/resources
16:13:05 [2022-03-30T20:13:05.569Z] [INFO] 
16:13:05 [2022-03-30T20:13:05.569Z] [INFO] --- tycho-compiler-plugin:2.3.0:compile (default-compile) @ org.eclipse.tracecompass.jsontrace.core.tests ---
16:13:05 [2022-03-30T20:13:05.569Z] [INFO] Compiling 3 source files to /home/jenkins/agent/workspace/tracecompass-master-2020-06/jsontrace/org.eclipse.tracecompass.jsontrace.core.tests/target/classes
16:13:05 [2022-03-30T20:13:05.569Z] [INFO] 
16:13:05 [2022-03-30T20:13:05.569Z] [INFO] --- maven-resources-plugin:3.0.2:testResources (default-testResources) @ org.eclipse.tracecompass.jsontrace.core.tests ---
16:13:05 [2022-03-30T20:13:05.569Z] [INFO] Using 'UTF-8' encoding to copy filtered resources.
16:13:05 [2022-03-30T20:13:05.570Z] [INFO] skip non existing resourceDirectory /home/jenkins/agent/workspace/tracecompass-master-2020-06/jsontrace/org.eclipse.tracecompass.jsontrace.core.tests/src/test/resources
16:13:05 [2022-03-30T20:13:05.570Z] [INFO] 
16:13:05 [2022-03-30T20:13:05.570Z] [INFO] --- tycho-source-plugin:2.3.0:plugin-source (plugin-source) @ org.eclipse.tracecompass.jsontrace.core.tests ---
16:13:05 [2022-03-30T20:13:05.570Z] [INFO] Building jar: /home/jenkins/agent/workspace/tracecompass-master-2020-06/jsontrace/org.eclipse.tracecompass.jsontrace.core.tests/target/org.eclipse.tracecompass.jsontrace.core.tests-1.0.3-SNAPSHOT-sources.jar
16:13:05 [2022-03-30T20:13:05.570Z] [INFO] 
16:13:05 [2022-03-30T20:13:05.570Z] [INFO] --- target-platform-configuration:2.3.0:target-platform (default-target-platform) @ org.eclipse.tracecompass.jsontrace.core.tests ---
16:13:05 [2022-03-30T20:13:05.570Z] [INFO] 
16:13:05 [2022-03-30T20:13:05.570Z] [INFO] --- tycho-packaging-plugin:2.3.0:package-plugin (default-package-plugin) @ org.eclipse.tracecompass.jsontrace.core.tests ---
16:13:05 [2022-03-30T20:13:05.570Z] [INFO] Building jar: /home/jenkins/agent/workspace/tracecompass-master-2020-06/jsontrace/org.eclipse.tracecompass.jsontrace.core.tests/target/org.eclipse.tracecompass.jsontrace.core.tests-1.0.3-SNAPSHOT.jar
16:13:05 [2022-03-30T20:13:05.570Z] [INFO] 
16:13:05 [2022-03-30T20:13:05.570Z] [INFO] --- tycho-p2-plugin:2.3.0:p2-metadata-default (default-p2-metadata-default) @ org.eclipse.tracecompass.jsontrace.core.tests ---
16:13:05 [2022-03-30T20:13:05.570Z] [INFO] 
16:13:05 [2022-03-30T20:13:05.570Z] [INFO] --- tycho-source-feature-plugin:2.3.0:source-feature (source-feature) @ org.eclipse.tracecompass.jsontrace.core.tests ---
16:13:05 [2022-03-30T20:13:05.570Z] [WARNING] Mojo tycho-source-feature-plugin:source-feature is replaced by the tycho-source-plugin:feature-source which offers equivalent and even enhanced functionality
16:13:05 [2022-03-30T20:13:05.570Z] [INFO] 
16:13:05 [2022-03-30T20:13:05.570Z] [INFO] --- tycho-pack200b-plugin:2.3.0:pack (pack200-pack) @ org.eclipse.tracecompass.jsontrace.core.tests ---
16:13:05 [2022-03-30T20:13:05.570Z] [WARNING] Pack200 actions are deprecated and scheduled for removal.
16:13:05 [2022-03-30T20:13:05.570Z] [INFO] Pack200 packing jar /home/jenkins/agent/workspace/tracecompass-master-2020-06/jsontrace/org.eclipse.tracecompass.jsontrace.core.tests/target/org.eclipse.tracecompass.jsontrace.core.tests-1.0.3-SNAPSHOT.jar
16:13:05 [2022-03-30T20:13:05.570Z] [INFO] 
16:13:05 [2022-03-30T20:13:05.570Z] [INFO] --- tycho-p2-plugin:2.3.0:p2-metadata (p2-metadata) @ org.eclipse.tracecompass.jsontrace.core.tests ---
16:13:05 [2022-03-30T20:13:05.570Z] [INFO] 
16:13:05 [2022-03-30T20:13:05.570Z] [INFO] --- maven-install-plugin:2.5.2:install (default-install) @ org.eclipse.tracecompass.jsontrace.core.tests ---
16:13:05 [2022-03-30T20:13:05.570Z] [INFO] Installing /home/jenkins/agent/workspace/tracecompass-master-2020-06/jsontrace/org.eclipse.tracecompass.jsontrace.core.tests/target/org.eclipse.tracecompass.jsontrace.core.tests-1.0.3-SNAPSHOT.jar to /home/jenkins/.m2/repository/org/eclipse/tracecompass/org.eclipse.tracecompass.jsontrace.core.tests/1.0.3-SNAPSHOT/org.eclipse.tracecompass.jsontrace.core.tests-1.0.3-SNAPSHOT.jar
16:13:05 [2022-03-30T20:13:05.570Z] [INFO] Installing /home/jenkins/agent/workspace/tracecompass-master-2020-06/jsontrace/org.eclipse.tracecompass.jsontrace.core.tests/pom.xml to /home/jenkins/.m2/repository/org/eclipse/tracecompass/org.eclipse.tracecompass.jsontrace.core.tests/1.0.3-SNAPSHOT/org.eclipse.tracecompass.jsontrace.core.tests-1.0.3-SNAPSHOT.pom
16:13:05 [2022-03-30T20:13:05.570Z] [INFO] Installing /home/jenkins/agent/workspace/tracecompass-master-2020-06/jsontrace/org.eclipse.tracecompass.jsontrace.core.tests/target/org.eclipse.tracecompass.jsontrace.core.tests-1.0.3-SNAPSHOT-sources.jar to /home/jenkins/.m2/repository/org/eclipse/tracecompass/org.eclipse.tracecompass.jsontrace.core.tests/1.0.3-SNAPSHOT/org.eclipse.tracecompass.jsontrace.core.tests-1.0.3-SNAPSHOT-sources.jar
16:13:05 [2022-03-30T20:13:05.570Z] [INFO] Installing /home/jenkins/agent/workspace/tracecompass-master-2020-06/jsontrace/org.eclipse.tracecompass.jsontrace.core.tests/target/org.eclipse.tracecompass.jsontrace.core.tests-1.0.3-SNAPSHOT.jar.pack.gz to /home/jenkins/.m2/repository/org/eclipse/tracecompass/org.eclipse.tracecompass.jsontrace.core.tests/1.0.3-SNAPSHOT/org.eclipse.tracecompass.jsontrace.core.tests-1.0.3-SNAPSHOT-pack200.jar.pack.gz
16:13:05 [2022-03-30T20:13:05.570Z] [INFO] Installing /home/jenkins/agent/workspace/tracecompass-master-2020-06/jsontrace/org.eclipse.tracecompass.jsontrace.core.tests/target/p2content.xml to /home/jenkins/.m2/repository/org/eclipse/tracecompass/org.eclipse.tracecompass.jsontrace.core.tests/1.0.3-SNAPSHOT/org.eclipse.tracecompass.jsontrace.core.tests-1.0.3-SNAPSHOT-p2metadata.xml
16:13:05 [2022-03-30T20:13:05.570Z] [INFO] Installing /home/jenkins/agent/workspace/tracecompass-master-2020-06/jsontrace/org.eclipse.tracecompass.jsontrace.core.tests/target/p2artifacts.xml to /home/jenkins/.m2/repository/org/eclipse/tracecompass/org.eclipse.tracecompass.jsontrace.core.tests/1.0.3-SNAPSHOT/org.eclipse.tracecompass.jsontrace.core.tests-1.0.3-SNAPSHOT-p2artifacts.xml
16:13:05 [2022-03-30T20:13:05.570Z] [INFO] 
16:13:05 [2022-03-30T20:13:05.570Z] [INFO] --- tycho-p2-plugin:2.3.0:update-local-index (default-update-local-index) @ org.eclipse.tracecompass.jsontrace.core.tests ---
16:13:05 [2022-03-30T20:13:05.570Z] [INFO] ------------------------------------------------------------------------
16:13:05 [2022-03-30T20:13:05.570Z] [INFO] Reactor Summary:
16:13:05 [2022-03-30T20:13:05.570Z] [INFO] 
16:13:05 [2022-03-30T20:13:05.570Z] [INFO] Trace Compass Parent 7.3.0-SNAPSHOT ................ SUCCESS [  4.648 s]
16:13:05 [2022-03-30T20:13:05.570Z] [INFO] Trace Compass Tracetype-agnostic Analyses Parent 7.3.0-SNAPSHOT SUCCESS [  0.008 s]
16:13:05 [2022-03-30T20:13:05.570Z] [INFO] Trace Compass Common Utilities Parent 7.3.0-SNAPSHOT SUCCESS [  0.006 s]
16:13:05 [2022-03-30T20:13:05.570Z] [INFO] org.eclipse.tracecompass.common.core 4.3.1-SNAPSHOT  SUCCESS [ 11.760 s]
16:13:05 [2022-03-30T20:13:05.570Z] [INFO] Trace Compass State System Parent 7.3.0-SNAPSHOT ... SUCCESS [  0.012 s]
16:13:05 [2022-03-30T20:13:05.570Z] [INFO] org.eclipse.tracecompass.datastore.core 1.2.2-SNAPSHOT SUCCESS [  2.089 s]
16:13:05 [2022-03-30T20:13:05.570Z] [INFO] org.eclipse.tracecompass.segmentstore.core 3.0.1-SNAPSHOT SUCCESS [  1.002 s]
16:13:05 [2022-03-30T20:13:05.570Z] [INFO] org.eclipse.tracecompass.statesystem.core 5.1.1-SNAPSHOT SUCCESS [  1.471 s]
16:13:05 [2022-03-30T20:13:05.570Z] [INFO] Trace Compass TMF Parent 7.3.0-SNAPSHOT ............ SUCCESS [  0.006 s]
16:13:05 [2022-03-30T20:13:05.570Z] [INFO] Trace Compass Filter Parser 1.0.6-SNAPSHOT ......... SUCCESS [  0.496 s]
16:13:05 [2022-03-30T20:13:05.570Z] [INFO] org.eclipse.tracecompass.tmf.core 7.3.0-SNAPSHOT ... SUCCESS [  5.626 s]
16:13:05 [2022-03-30T20:13:05.570Z] [INFO] org.eclipse.tracecompass.analysis.counters.core 2.0.6-SNAPSHOT SUCCESS [  0.581 s]
16:13:05 [2022-03-30T20:13:05.570Z] [INFO] Trace Compass CTF Support Parent 7.3.0-SNAPSHOT .... SUCCESS [  0.005 s]
16:13:05 [2022-03-30T20:13:05.570Z] [INFO] Trace Compass CTF Parser Plug-in 1.0.6-SNAPSHOT .... SUCCESS [  3.819 s]
16:13:05 [2022-03-30T20:13:05.570Z] [INFO] org.eclipse.tracecompass.ctf.core 4.1.0-SNAPSHOT ... SUCCESS [  1.391 s]
16:13:05 [2022-03-30T20:13:05.570Z] [INFO] Trace Compass CTF Core Tests Plug-in 1.0.11-SNAPSHOT SUCCESS [ 57.454 s]
16:13:05 [2022-03-30T20:13:05.570Z] [INFO] org.eclipse.tracecompass.statesystem.core.tests 1.0.14-SNAPSHOT SUCCESS [ 11.658 s]
16:13:05 [2022-03-30T20:13:05.570Z] [INFO] org.eclipse.tracecompass.tmf.core.tests 1.0.18-SNAPSHOT SUCCESS [05:20 min]
16:13:05 [2022-03-30T20:13:05.570Z] [INFO] org.eclipse.tracecompass.tmf.ctf.core 4.3.0-SNAPSHOT SUCCESS [  0.730 s]
16:13:05 [2022-03-30T20:13:05.570Z] [INFO] org.eclipse.tracecompass.tmf.ctf.core.tests 1.0.14-SNAPSHOT SUCCESS [04:46 min]
16:13:05 [2022-03-30T20:13:05.570Z] [INFO] org.eclipse.tracecompass.analysis.counters.core.tests 1.0.1-SNAPSHOT SUCCESS [  6.453 s]
16:13:05 [2022-03-30T20:13:05.570Z] [INFO] org.eclipse.tracecompass.tmf.ui 7.1.1-SNAPSHOT ..... SUCCESS [  8.805 s]
16:13:05 [2022-03-30T20:13:05.570Z] [INFO] org.eclipse.tracecompass.analysis.counters.ui 2.0.0-SNAPSHOT SUCCESS [  0.522 s]
16:13:05 [2022-03-30T20:13:05.570Z] [INFO] org.eclipse.tracecompass.tmf.ui.tests 1.0.18-SNAPSHOT SUCCESS [03:00 min]
16:13:05 [2022-03-30T20:13:05.570Z] [INFO] org.eclipse.tracecompass.tmf.ui.swtbot.tests 1.0.17-SNAPSHOT SUCCESS [05:25 min]
16:13:05 [2022-03-30T20:13:05.570Z] [INFO] org.eclipse.tracecompass.analysis.graph.core 3.1.0-SNAPSHOT SUCCESS [  0.607 s]
16:13:05 [2022-03-30T20:13:05.570Z] [INFO] org.eclipse.tracecompass.tmf.chart.core 1.0.4-SNAPSHOT SUCCESS [  0.411 s]
16:13:05 [2022-03-30T20:13:05.570Z] [INFO] org.eclipse.tracecompass.analysis.lami.core 1.1.3-SNAPSHOT SUCCESS [  0.673 s]
16:13:05 [2022-03-30T20:13:05.570Z] [INFO] org.eclipse.tracecompass.analysis.timing.core 5.2.3-SNAPSHOT SUCCESS [  0.587 s]
16:13:05 [2022-03-30T20:13:05.570Z] [INFO] org.eclipse.tracecompass.analysis.os.linux.core 6.0.2-SNAPSHOT SUCCESS [  1.388 s]
16:13:05 [2022-03-30T20:13:05.570Z] [INFO] Trace Compass LTTng Support Parent 7.3.0-SNAPSHOT .. SUCCESS [  0.006 s]
16:13:05 [2022-03-30T20:13:05.570Z] [INFO] org.eclipse.tracecompass.lttng2.common.core 1.1.3-SNAPSHOT SUCCESS [  0.415 s]
16:13:05 [2022-03-30T20:13:05.570Z] [INFO] org.eclipse.tracecompass.tmf.analysis.xml.core 4.0.4-SNAPSHOT SUCCESS [  1.280 s]
16:13:05 [2022-03-30T20:13:05.570Z] [INFO] org.eclipse.tracecompass.lttng2.kernel.core 3.0.5-SNAPSHOT SUCCESS [  0.714 s]
16:13:05 [2022-03-30T20:13:05.570Z] [INFO] org.eclipse.tracecompass.analysis.counters.ui.swtbot.tests 1.0.2-SNAPSHOT SUCCESS [01:41 min]
16:13:05 [2022-03-30T20:13:05.570Z] [INFO] org.eclipse.tracecompass.analysis.graph.core.tests 1.0.6-SNAPSHOT SUCCESS [  9.488 s]
16:13:05 [2022-03-30T20:13:05.570Z] [INFO] org.eclipse.tracecompass.analysis.graph.ui 1.0.12-SNAPSHOT SUCCESS [  0.513 s]
16:13:05 [2022-03-30T20:13:05.570Z] [INFO] org.eclipse.tracecompass.analysis.lami.core.tests 1.0.4-SNAPSHOT SUCCESS [  6.642 s]
16:13:05 [2022-03-30T20:13:05.570Z] [INFO] org.eclipse.tracecompass.tmf.chart.ui 1.0.11-SNAPSHOT SUCCESS [  0.843 s]
16:13:05 [2022-03-30T20:13:05.570Z] [INFO] org.eclipse.tracecompass.analysis.lami.ui 1.1.5-SNAPSHOT SUCCESS [  0.645 s]
16:13:05 [2022-03-30T20:13:05.570Z] [INFO] org.eclipse.tracecompass.tmf.chart.core.tests 1.0.3-SNAPSHOT SUCCESS [  6.051 s]
16:13:05 [2022-03-30T20:13:05.570Z] [INFO] org.eclipse.tracecompass.tmf.chart.ui.swtbot.tests 1.0.6-SNAPSHOT SUCCESS [ 16.290 s]
16:13:05 [2022-03-30T20:13:05.570Z] [INFO] org.eclipse.tracecompass.analysis.lami.ui.swtbot.tests 1.0.6-SNAPSHOT SUCCESS [ 29.081 s]
16:13:05 [2022-03-30T20:13:05.570Z] [INFO] org.eclipse.tracecompass.analysis.os.linux.core.tests 1.0.15-SNAPSHOT SUCCESS [02:01 min]
16:13:05 [2022-03-30T20:13:05.571Z] [INFO] org.eclipse.tracecompass.analysis.timing.ui 5.0.2-SNAPSHOT SUCCESS [  0.744 s]
16:13:05 [2022-03-30T20:13:05.571Z] [INFO] org.eclipse.tracecompass.analysis.os.linux.ui 4.0.4-SNAPSHOT SUCCESS [  0.849 s]
16:13:05 [2022-03-30T20:13:05.571Z] [INFO] org.eclipse.tracecompass.analysis.os.linux.ui.tests 1.0.9-SNAPSHOT SUCCESS [ 14.723 s]
16:13:05 [2022-03-30T20:13:05.571Z] [INFO] org.eclipse.tracecompass.analysis.timing.core.tests 1.0.6-SNAPSHOT SUCCESS [ 14.239 s]
16:13:05 [2022-03-30T20:13:05.571Z] [INFO] org.eclipse.tracecompass.analysis.timing.ui.swtbot.tests 1.0.11-SNAPSHOT SUCCESS [ 30.322 s]
16:13:05 [2022-03-30T20:13:05.571Z] [INFO] org.eclipse.tracecompass.analysis.os.linux.ui.swtbot.tests 1.0.16-SNAPSHOT SUCCESS [01:01 min]
16:13:05 [2022-03-30T20:13:05.571Z] [INFO] org.eclipse.tracecompass.analysis.profiling.core 2.3.0-SNAPSHOT SUCCESS [  0.523 s]
16:13:05 [2022-03-30T20:13:05.571Z] [INFO] org.eclipse.tracecompass.analysis.profiling.core.tests 1.0.6-SNAPSHOT SUCCESS [ 49.965 s]
16:13:05 [2022-03-30T20:13:05.571Z] [INFO] org.eclipse.tracecompass.analysis.profiling.ui 3.0.0-SNAPSHOT SUCCESS [  0.741 s]
16:13:05 [2022-03-30T20:13:05.571Z] [INFO] org.eclipse.tracecompass.analysis.profiling.ui.swtbot.tests 1.0.6-SNAPSHOT SUCCESS [ 16.320 s]
16:13:05 [2022-03-30T20:13:05.571Z] [INFO] Trace Compass BTF Support Parent 7.3.0-SNAPSHOT .... SUCCESS [  0.005 s]
16:13:05 [2022-03-30T20:13:05.571Z] [INFO] org.eclipse.tracecompass.btf.core 3.0.0-SNAPSHOT ... SUCCESS [  0.331 s]
16:13:05 [2022-03-30T20:13:05.571Z] [INFO] Trace Compass Documentation 7.3.0-SNAPSHOT ......... SUCCESS [  0.004 s]
16:13:05 [2022-03-30T20:13:05.571Z] [INFO] Trace Compass Developer Guide 7.3.0-SNAPSHOT ....... SUCCESS [ 33.700 s]
16:13:05 [2022-03-30T20:13:05.571Z] [INFO] org.eclipse.tracecompass.tmf.analysis.xml.ui 2.1.16-SNAPSHOT SUCCESS [  0.801 s]
16:13:05 [2022-03-30T20:13:05.571Z] [INFO] org.eclipse.tracecompass.tmf 7.3.0-SNAPSHOT ........ SUCCESS [  0.513 s]
16:13:05 [2022-03-30T20:13:05.571Z] [INFO] org.eclipse.tracecompass.btf.ui 1.0.4-SNAPSHOT ..... SUCCESS [  0.410 s]
16:13:05 [2022-03-30T20:13:05.571Z] [INFO] org.eclipse.tracecompass.btf 7.3.0-SNAPSHOT ........ SUCCESS [  0.188 s]
16:13:05 [2022-03-30T20:13:05.571Z] [INFO] org.eclipse.tracecompass.btf.core.tests 1.0.3-SNAPSHOT SUCCESS [  6.794 s]
16:13:05 [2022-03-30T20:13:05.571Z] [INFO] org.eclipse.tracecompass.common.core.tests 1.1.9-SNAPSHOT SUCCESS [  6.636 s]
16:13:05 [2022-03-30T20:13:05.571Z] [INFO] org.eclipse.tracecompass.ctf 7.3.0-SNAPSHOT ........ SUCCESS [  0.080 s]
16:13:05 [2022-03-30T20:13:05.571Z] [INFO] org.eclipse.tracecompass.ctf.parser.tests 1.0.3-SNAPSHOT SUCCESS [  5.196 s]
16:13:05 [2022-03-30T20:13:05.571Z] [INFO] org.eclipse.tracecompass.tmf.ctf 7.3.0-SNAPSHOT .... SUCCESS [  0.110 s]
16:13:05 [2022-03-30T20:13:05.571Z] [INFO] org.eclipse.tracecompass.tmf.ctf.ui.swtbot.tests 1.0.11-SNAPSHOT SUCCESS [02:17 min]
16:13:05 [2022-03-30T20:13:05.571Z] [INFO] Trace Compass User Guide 7.3.0-SNAPSHOT ............ SUCCESS [  7.507 s]
16:13:05 [2022-03-30T20:13:05.571Z] [INFO] Trace Compass GDB Tracepoint Analysis User Guide 7.3.0-SNAPSHOT SUCCESS [  4.521 s]
16:13:05 [2022-03-30T20:13:05.571Z] [INFO] Trace Compass RCP User Guide 7.3.0-SNAPSHOT ........ SUCCESS [  4.341 s]
16:13:05 [2022-03-30T20:13:05.571Z] [INFO] Trace Compass Pcap User Guide 7.3.0-SNAPSHOT ....... SUCCESS [  4.374 s]
16:13:05 [2022-03-30T20:13:05.571Z] [INFO] org.eclipse.tracecompass.examples 1.0.9-SNAPSHOT ... SUCCESS [  0.493 s]
16:13:05 [2022-03-30T20:13:05.571Z] [INFO] Trace Compass GDB Tracepoint Analysis Parent 7.3.0-SNAPSHOT SUCCESS [  0.004 s]
16:13:05 [2022-03-30T20:13:05.571Z] [INFO] org.eclipse.tracecompass.gdbtrace.core 1.0.7-SNAPSHOT SUCCESS [  0.579 s]
16:13:05 [2022-03-30T20:13:05.571Z] [INFO] org.eclipse.tracecompass.gdbtrace.ui 1.1.4-SNAPSHOT  SUCCESS [  0.405 s]
16:13:05 [2022-03-30T20:13:05.571Z] [INFO] org.eclipse.tracecompass.gdbtrace 7.3.0-SNAPSHOT ... SUCCESS [  0.181 s]
16:13:05 [2022-03-30T20:13:05.571Z] [INFO] org.eclipse.tracecompass.gdbtrace.core.tests 1.0.2-SNAPSHOT SUCCESS [  5.755 s]
16:13:05 [2022-03-30T20:13:05.571Z] [INFO] org.eclipse.tracecompass.gdbtrace.ui.tests 1.0.2-SNAPSHOT SUCCESS [ 13.454 s]
16:13:05 [2022-03-30T20:13:05.571Z] [INFO] org.eclipse.tracecompass.lttng2.common.core.tests 1.0.2-SNAPSHOT SUCCESS [  4.849 s]
16:13:05 [2022-03-30T20:13:05.571Z] [INFO] org.eclipse.tracecompass.lttng2.control.core 1.2.5-SNAPSHOT SUCCESS [  0.492 s]
16:13:05 [2022-03-30T20:13:05.571Z] [INFO] org.eclipse.tracecompass.tmf.remote.core 2.0.5-SNAPSHOT SUCCESS [  0.287 s]
16:13:05 [2022-03-30T20:13:05.571Z] [INFO] org.eclipse.tracecompass.tmf.remote.ui 1.0.9-SNAPSHOT SUCCESS [  0.673 s]
16:13:05 [2022-03-30T20:13:05.571Z] [INFO] org.eclipse.tracecompass.lttng2.control.ui 1.2.13-SNAPSHOT SUCCESS [  1.491 s]
16:13:05 [2022-03-30T20:13:05.571Z] [INFO] org.eclipse.tracecompass.lttng2.control 7.3.0-SNAPSHOT SUCCESS [  0.123 s]
16:13:05 [2022-03-30T20:13:05.571Z] [INFO] org.eclipse.tracecompass.lttng2.control.core.tests 1.1.3-SNAPSHOT SUCCESS [  6.232 s]
16:13:05 [2022-03-30T20:13:05.571Z] [INFO] org.eclipse.tracecompass.tmf.remote.core.tests 1.0.2-SNAPSHOT SUCCESS [  5.856 s]
16:13:05 [2022-03-30T20:13:05.571Z] [INFO] org.eclipse.tracecompass.lttng2.control.ui.tests 2.0.5-SNAPSHOT SUCCESS [ 37.180 s]
16:13:05 [2022-03-30T20:13:05.571Z] [INFO] org.eclipse.tracecompass.lttng2.control.ui.swtbot.tests 1.0.8-SNAPSHOT SUCCESS [ 59.810 s]
16:13:05 [2022-03-30T20:13:05.571Z] [INFO] org.eclipse.tracecompass.lttng2.kernel.ui 2.0.2-SNAPSHOT SUCCESS [  0.338 s]
16:13:05 [2022-03-30T20:13:05.571Z] [INFO] org.eclipse.tracecompass.lttng2.kernel 7.3.0-SNAPSHOT SUCCESS [  0.174 s]
16:13:05 [2022-03-30T20:13:05.571Z] [INFO] org.eclipse.tracecompass.tmf.analysis.xml.core.tests 1.0.13-SNAPSHOT SUCCESS [ 45.496 s]
16:13:05 [2022-03-30T20:13:05.571Z] [INFO] org.eclipse.tracecompass.lttng2.kernel.core.tests 2.0.4-SNAPSHOT SUCCESS [01:12 min]
16:13:05 [2022-03-30T20:13:05.571Z] [INFO] org.eclipse.tracecompass.lttng2.kernel.ui.swtbot.tests 1.0.18-SNAPSHOT SUCCESS [04:38 min]
16:13:05 [2022-03-30T20:13:05.571Z] [INFO] org.eclipse.tracecompass.lttng2.ust.core 5.0.4-SNAPSHOT SUCCESS [  0.520 s]
16:13:05 [2022-03-30T20:13:05.571Z] [INFO] org.eclipse.tracecompass.lttng2.ust.ui 3.0.10-SNAPSHOT SUCCESS [  0.459 s]
16:13:05 [2022-03-30T20:13:05.571Z] [INFO] org.eclipse.tracecompass.lttng2.ust 7.3.0-SNAPSHOT . SUCCESS [  0.139 s]
16:13:05 [2022-03-30T20:13:05.571Z] [INFO] org.eclipse.tracecompass.lttng2.ust.core.tests 1.0.12-SNAPSHOT SUCCESS [ 31.925 s]
16:13:05 [2022-03-30T20:13:05.571Z] [INFO] org.eclipse.tracecompass.lttng2.ust.ui.tests 1.0.2-SNAPSHOT SUCCESS [ 12.816 s]
16:13:05 [2022-03-30T20:13:05.571Z] [INFO] org.eclipse.tracecompass.lttng2.ust.ui.swtbot.tests 1.0.15-SNAPSHOT SUCCESS [01:17 min]
16:13:05 [2022-03-30T20:13:05.571Z] [INFO] Trace Compass Pcap Format Support Parent 7.3.0-SNAPSHOT SUCCESS [  0.004 s]
16:13:05 [2022-03-30T20:13:05.571Z] [INFO] org.eclipse.tracecompass.pcap.core 1.1.3-SNAPSHOT .. SUCCESS [  0.400 s]
16:13:05 [2022-03-30T20:13:05.571Z] [INFO] Trace Compass Pcap Parser Core Tests Plug-in 1.0.5-SNAPSHOT SUCCESS [  8.776 s]
16:13:05 [2022-03-30T20:13:05.571Z] [INFO] org.eclipse.tracecompass.tmf.pcap.core 1.0.5-SNAPSHOT SUCCESS [  0.294 s]
16:13:05 [2022-03-30T20:13:05.571Z] [INFO] org.eclipse.tracecompass.tmf.pcap.ui 1.1.4-SNAPSHOT  SUCCESS [  0.340 s]
16:13:05 [2022-03-30T20:13:05.571Z] [INFO] org.eclipse.tracecompass.tmf.pcap 7.3.0-SNAPSHOT ... SUCCESS [  0.189 s]
16:13:05 [2022-03-30T20:13:05.571Z] [INFO] org.eclipse.tracecompass.tmf.pcap.core.tests 1.0.3-SNAPSHOT SUCCESS [  7.097 s]
16:13:05 [2022-03-30T20:13:05.571Z] [INFO] org.eclipse.tracecompass.tmf.pcap.ui.swtbot.tests 1.0.2-SNAPSHOT SUCCESS [ 32.712 s]
16:13:05 [2022-03-30T20:13:05.571Z] [INFO] Trace Compass RCP Parent 7.3.0-SNAPSHOT ............ SUCCESS [  0.003 s]
16:13:05 [2022-03-30T20:13:05.571Z] [INFO] Trace Compass RCP Branding plug-in 7.3.0-SNAPSHOT .. SUCCESS [  0.118 s]
16:13:05 [2022-03-30T20:13:05.571Z] [INFO] Trace Compass RCP Branding Feature 7.3.0-SNAPSHOT .. SUCCESS [  0.067 s]
16:13:05 [2022-03-30T20:13:05.571Z] [INFO] org.eclipse.tracecompass.tmf.cli.core 1.0.2-SNAPSHOT SUCCESS [  0.285 s]
16:13:05 [2022-03-30T20:13:05.571Z] [INFO] org.eclipse.tracecompass.rcp.ui 7.3.0-SNAPSHOT ..... SUCCESS [  0.553 s]
16:13:05 [2022-03-30T20:13:05.571Z] [INFO] Trace Compass RCP Feature 7.3.0-SNAPSHOT ........... SUCCESS [  1.023 s]
16:13:05 [2022-03-30T20:13:05.571Z] [INFO] org.eclipse.tracecompass.tmf.cli.core.tests 1.0.2-SNAPSHOT SUCCESS [  5.150 s]
16:13:05 [2022-03-30T20:13:05.571Z] [INFO] org.eclipse.tracecompass.rcp.ui.tests 2.0.4-SNAPSHOT SUCCESS [ 12.548 s]
16:13:05 [2022-03-30T20:13:05.571Z] [INFO] org.eclipse.tracecompass.rcp.incubator.ui 1.0.2-SNAPSHOT SUCCESS [  0.159 s]
16:13:05 [2022-03-30T20:13:05.571Z] [INFO] org.eclipse.tracecompass.rcp.incubator 7.3.0-SNAPSHOT SUCCESS [  0.111 s]
16:13:05 [2022-03-30T20:13:05.571Z] [INFO] Trace Compass Json trace Parent 7.3.0-SNAPSHOT ..... SUCCESS [  0.003 s]
16:13:05 [2022-03-30T20:13:05.571Z] [INFO] org.eclipse.tracecompass.jsontrace.core 1.0.3-SNAPSHOT SUCCESS [  0.191 s]
16:13:05 [2022-03-30T20:13:05.571Z] [INFO] org.eclipse.tracecompass.jsontrace 7.3.0-SNAPSHOT .. SUCCESS [  0.148 s]
16:13:05 [2022-03-30T20:13:05.571Z] [INFO] org.eclipse.tracecompass.tmf.cli 7.3.0-SNAPSHOT .... SUCCESS [  0.045 s]
16:13:05 [2022-03-30T20:13:05.571Z] [INFO] Trace Compass RCP Product 7.3.0-SNAPSHOT ........... SUCCESS [01:15 min]
16:13:05 [2022-03-30T20:13:05.571Z] [INFO] Trace Compass Release Engineering Parent 7.3.0-SNAPSHOT SUCCESS [  0.015 s]
16:13:05 [2022-03-30T20:13:05.571Z] [INFO] Trace Compass Target Platform 7.3.0-SNAPSHOT ....... SUCCESS [  2.719 s]
16:13:05 [2022-03-30T20:13:05.571Z] [INFO] org.eclipse.tracecompass.integration.swtbot.tests 1.0.13-SNAPSHOT SUCCESS [08:22 min]
16:13:05 [2022-03-30T20:13:05.571Z] [INFO] org.eclipse.tracecompass.datastore.core.tests 1.0.6-SNAPSHOT SUCCESS [  7.507 s]
16:13:05 [2022-03-30T20:13:05.571Z] [INFO] org.eclipse.tracecompass.segmentstore.core.tests 1.0.6-SNAPSHOT SUCCESS [  6.156 s]
16:13:05 [2022-03-30T20:13:05.571Z] [INFO] org.eclipse.tracecompass.tmf.analysis.xml.ui.swtbot.tests 1.0.13-SNAPSHOT SUCCESS [01:05 min]
16:13:05 [2022-03-30T20:13:05.571Z] [INFO] org.eclipse.tracecompass.tmf.analysis.xml.ui.tests 1.0.4-SNAPSHOT SUCCESS [ 13.295 s]
16:13:05 [2022-03-30T20:13:05.571Z] [INFO] org.eclipse.tracecompass.tmf.chart.ui.tests 1.0.2-SNAPSHOT SUCCESS [ 12.343 s]
16:13:05 [2022-03-30T20:13:05.571Z] [INFO] org.eclipse.tracecompass.tmf.remote.ui.swtbot.tests 1.0.9-SNAPSHOT SUCCESS [01:44 min]
16:13:05 [2022-03-30T20:13:05.571Z] [INFO] org.eclipse.tracecompass.tmf.remote.ui.tests 1.0.2-SNAPSHOT SUCCESS [ 12.658 s]
16:13:05 [2022-03-30T20:13:05.571Z] [INFO] Trace Compass All Tests 1.0.11-SNAPSHOT ............ SUCCESS [  6.170 s]
16:13:05 [2022-03-30T20:13:05.571Z] [INFO] org.eclipse.tracecompass.integration.core.tests 1.0.0-SNAPSHOT SUCCESS [ 26.233 s]
16:13:05 [2022-03-30T20:13:05.571Z] [INFO] org.eclipse.tracecompass.testing 7.3.0-SNAPSHOT .... SUCCESS [  0.357 s]
16:13:05 [2022-03-30T20:13:05.571Z] [INFO] org.eclipse.tracecompass.tmf.remote 7.3.0-SNAPSHOT . SUCCESS [  0.086 s]
16:13:05 [2022-03-30T20:13:05.571Z] [INFO] Trace Compass Repository 7.3.0-SNAPSHOT ............ SUCCESS [ 11.390 s]
16:13:05 [2022-03-30T20:13:05.571Z] [INFO] org.eclipse.tracecompass.jsontrace.core.tests 1.0.3-SNAPSHOT SUCCESS [  0.164 s]
16:13:05 [2022-03-30T20:13:05.571Z] [INFO] ------------------------------------------------------------------------
16:13:05 [2022-03-30T20:13:05.571Z] [INFO] BUILD SUCCESS
16:13:05 [2022-03-30T20:13:05.571Z] [INFO] ------------------------------------------------------------------------
16:13:05 [2022-03-30T20:13:05.571Z] [INFO] Total time:  01:01 h
16:13:05 [2022-03-30T20:13:05.571Z] [INFO] Finished at: 2022-03-30T20:13:05Z
16:13:05 [2022-03-30T20:13:05.572Z] [INFO] ------------------------------------------------------------------------