Skip to content
Failed

Console Output

Started by user Maxim Nesen
Rebuilds build #44
Running as Maxim Nesen
Agent basic-j5hf3 is provisioned from template basic
---
apiVersion: "v1"
kind: "Pod"
metadata:
  annotations: {}
  labels:
    jenkins: "slave"
    jenkins/label-digest: "61a7508ed1b04e9ada836fcd14d4d8ef5687c7dd"
    jenkins/label: "basic"
  name: "basic-j5hf3"
  namespace: "jersey"
spec:
  containers:
  - env:
    - name: "JENKINS_SECRET"
      value: "********"
    - name: "JENKINS_TUNNEL"
      value: "jenkins-discovery.jersey.svc.cluster.local:50000"
    - name: "JENKINS_AGENT_NAME"
      value: "basic-j5hf3"
    - name: "JENKINS_REMOTING_JAVA_OPTS"
      value: "-showversion -XshowSettings:vm -Xmx256m -Dorg.jenkinsci.remoting.engine.JnlpProtocol3.disabled=true\
        \ -Dorg.jenkinsci.plugins.gitclient.CliGitAPIImpl.useSETSID=true"
    - name: "JAVA_TOOL_OPTIONS"
      value: ""
    - name: "_JAVA_OPTIONS"
      value: ""
    - name: "OPENJ9_JAVA_OPTIONS"
      value: "-XX:+IgnoreUnrecognizedVMOptions -XX:+IdleTuningCompactOnIdle -XX:+IdleTuningGcOnIdle"
    - name: "JENKINS_NAME"
      value: "basic-j5hf3"
    - name: "JENKINS_AGENT_WORKDIR"
      value: "/home/jenkins/agent"
    - name: "JENKINS_URL"
      value: "http://jenkins-ui.jersey.svc.cluster.local/jersey/"
    image: "docker.io/eclipsecbi/jiro-agent-basic:remoting-3044.vb_940a_a_e4f72e"
    imagePullPolicy: "Always"
    name: "jnlp"
    resources:
      limits:
        cpu: "2000m"
        memory: "4096Mi"
      requests:
        cpu: "1000m"
        memory: "4096Mi"
    tty: true
    volumeMounts:
    - mountPath: "/home/jenkins/.m2/toolchains.xml"
      name: "m2-dir"
      readOnly: true
      subPath: "toolchains.xml"
    - mountPath: "/home/jenkins/.mavenrc"
      name: "m2-dir"
      readOnly: true
      subPath: ".mavenrc"
    - mountPath: "/opt/tools"
      name: "volume-0"
      readOnly: false
    - mountPath: "/home/jenkins"
      name: "volume-2"
      readOnly: false
    - mountPath: "/home/jenkins/.m2/repository"
      name: "volume-3"
      readOnly: false
    - mountPath: "/home/jenkins/.m2/settings-security.xml"
      name: "m2-secret-dir"
      readOnly: true
      subPath: "settings-security.xml"
    - mountPath: "/home/jenkins/.m2/wrapper"
      name: "volume-4"
      readOnly: false
    - mountPath: "/home/jenkins/.m2/settings.xml"
      name: "m2-secret-dir"
      readOnly: true
      subPath: "settings.xml"
    - mountPath: "/home/jenkins/.ssh"
      name: "volume-1"
      readOnly: false
      subPath: ""
    - mountPath: "/home/jenkins/agent"
      name: "workspace-volume"
      readOnly: false
    workingDir: "/home/jenkins/agent"
  nodeSelector:
    kubernetes.io/os: "linux"
  restartPolicy: "Never"
  volumes:
  - name: "volume-0"
    persistentVolumeClaim:
      claimName: "tools-claim-jiro-jersey"
      readOnly: true
  - name: "m2-secret-dir"
    secret:
      secretName: "m2-secret-dir"
  - emptyDir:
      medium: ""
    name: "volume-2"
  - configMap:
      name: "m2-dir"
    name: "m2-dir"
  - configMap:
      name: "known-hosts"
    name: "volume-1"
  - emptyDir:
      medium: ""
    name: "workspace-volume"
  - emptyDir:
      medium: ""
    name: "volume-4"
  - emptyDir:
      medium: ""
    name: "volume-3"

Building remotely on basic-j5hf3 (basic) in workspace /home/jenkins/agent/workspace/Jersey-examples_bundle_release
[WS-CLEANUP] Deleting project workspace...
[WS-CLEANUP] Deferred wipeout is used...
The recommended git tool is: git
using credential github-bot-ssh
Cloning the remote Git repository
Cloning repository git@github.com:eclipse-ee4j/jersey.git
 > git init /home/jenkins/agent/workspace/Jersey-examples_bundle_release # timeout=10
Fetching upstream changes from git@github.com:eclipse-ee4j/jersey.git
 > git --version # timeout=10
 > git --version # 'git version 2.20.1'
using GIT_SSH to set credentials GitHub bot SSH
[INFO] Currently running in a labeled security context
 > /usr/bin/chcon --type=ssh_home_t /home/jenkins/agent/workspace/Jersey-examples_bundle_release@tmp/jenkins-gitclient-ssh432992944104473266.key
Verifying host key using known hosts file
 > git fetch --tags --force --progress -- git@github.com:eclipse-ee4j/jersey.git +refs/heads/*:refs/remotes/origin/* # timeout=10
 > git config remote.origin.url git@github.com:eclipse-ee4j/jersey.git # timeout=10
 > git config --add remote.origin.fetch +refs/heads/*:refs/remotes/origin/* # timeout=10
Avoid second fetch
 > git rev-parse refs/remotes/origin/tags/2.39^{commit} # timeout=10
 > git rev-parse tags/2.39^{commit} # timeout=10
Checking out Revision a40074eef3c79cfc466feb37d525b0101539780a (tags/2.39)
 > git config core.sparsecheckout # timeout=10
 > git checkout -f a40074eef3c79cfc466feb37d525b0101539780a # timeout=10
Commit message: "2.39"
First time build. Skipping changelog.
[Jersey-examples_bundle_release] $ /bin/sh -xe /tmp/jenkins7213778284085461033.sh
+ gpg --batch --import ****
gpg: directory '/home/jenkins/.gnupg' created
gpg: keybox '/home/jenkins/.gnupg/pubring.kbx' created
gpg: key 372703E4D5313120: 1 signature not checked due to a missing key
gpg: /home/jenkins/.gnupg/trustdb.gpg: trustdb created
gpg: key 372703E4D5313120: public key "Eclipse Jersey <jersey-dev@eclipse.org>" imported
gpg: To migrate 'secring.gpg', with each smartcard, run: gpg --card-status
gpg: key 372703E4D5313120: secret key imported
gpg: Total number processed: 1
gpg:               imported: 1
gpg:       secret keys read: 1
gpg:   secret keys imported: 1
gpg: no ultimately trusted keys found
++ gpg --list-keys --with-colons
++ awk -F: '/fpr:/ {print $10}'
++ sort -u
+ for fpr in $(gpg --list-keys --with-colons  | awk -F: '/fpr:/ {print $10}' | sort -u)
+ echo -e '5\ny\n'
+ gpg --batch --command-fd 0 --expert --edit-key 0B743A794876D3C78AB542A118D239B1CBCD2236 trust
Secret subkeys are available.

pub  rsa4096/372703E4D5313120
     created: 2018-10-03  expires: 2023-10-02  usage: SCEA
     trust: unknown       validity: unknown
ssb  rsa4096/18D239B1CBCD2236
     created: 2018-10-03  expires: 2023-10-02  usage: S   
[ unknown] (1). Eclipse Jersey <jersey-dev@eclipse.org>

pub  rsa4096/372703E4D5313120
     created: 2018-10-03  expires: 2023-10-02  usage: SCEA
     trust: unknown       validity: unknown
ssb  rsa4096/18D239B1CBCD2236
     created: 2018-10-03  expires: 2023-10-02  usage: S   
[ unknown] (1). Eclipse Jersey <jersey-dev@eclipse.org>

Please decide how far you trust this user to correctly verify other users' keys
(by looking at passports, checking fingerprints from different sources, etc.)

  1 = I don't know or won't say
  2 = I do NOT trust
  3 = I trust marginally
  4 = I trust fully
  5 = I trust ultimately
  m = back to the main menu


pub  rsa4096/372703E4D5313120
     created: 2018-10-03  expires: 2023-10-02  usage: SCEA
     trust: ultimate      validity: unknown
ssb  rsa4096/18D239B1CBCD2236
     created: 2018-10-03  expires: 2023-10-02  usage: S   
[ unknown] (1). Eclipse Jersey <jersey-dev@eclipse.org>
Please note that the shown key validity is not necessarily correct
unless you restart the program.

+ for fpr in $(gpg --list-keys --with-colons  | awk -F: '/fpr:/ {print $10}' | sort -u)
+ echo -e '5\ny\n'
+ gpg --batch --command-fd 0 --expert --edit-key 2EABB8F15F15E18885312232372703E4D5313120 trust
Secret subkeys are available.

gpg: checking the trustdb
gpg: marginals needed: 3  completes needed: 1  trust model: pgp
gpg: depth: 0  valid:   1  signed:   0  trust: 0-, 0q, 0n, 0m, 0f, 1u
gpg: next trustdb check due at 2023-10-02
pub  rsa4096/372703E4D5313120
     created: 2018-10-03  expires: 2023-10-02  usage: SCEA
     trust: ultimate      validity: ultimate
ssb  rsa4096/18D239B1CBCD2236
     created: 2018-10-03  expires: 2023-10-02  usage: S   
[ultimate] (1). Eclipse Jersey <jersey-dev@eclipse.org>

pub  rsa4096/372703E4D5313120
     created: 2018-10-03  expires: 2023-10-02  usage: SCEA
     trust: ultimate      validity: ultimate
ssb  rsa4096/18D239B1CBCD2236
     created: 2018-10-03  expires: 2023-10-02  usage: S   
[ultimate] (1). Eclipse Jersey <jersey-dev@eclipse.org>

Please decide how far you trust this user to correctly verify other users' keys
(by looking at passports, checking fingerprints from different sources, etc.)

  1 = I don't know or won't say
  2 = I do NOT trust
  3 = I trust marginally
  4 = I trust fully
  5 = I trust ultimately
  m = back to the main menu


pub  rsa4096/372703E4D5313120
     created: 2018-10-03  expires: 2023-10-02  usage: SCEA
     trust: ultimate      validity: ultimate
ssb  rsa4096/18D239B1CBCD2236
     created: 2018-10-03  expires: 2023-10-02  usage: S   
[ultimate] (1). Eclipse Jersey <jersey-dev@eclipse.org>

[Jersey-examples_bundle_release] $ /bin/bash -xe /tmp/jenkins13342517824011967141.sh
+ MVN_HOME=/opt/tools/apache-maven/latest/
+ PATH=/opt/tools/apache-maven/latest//bin:/opt/tools/java/oracle/jdk-8/latest:/bin:/opt/tools/java/oracle/jdk-8/latest/bin:/opt/tools/java/oracle/jdk-8/latest/bin:/opt/java/openjdk/bin:/usr/local/sbin:/usr/local/bin:/usr/sbin:/usr/bin:/sbin:/bin
+ mvn clean install -C -B -DskipTests -Denforcer.skip -Ppre-release,staging -pl org.glassfish.jersey.examples:project -amd
[INFO] Scanning for projects...
[INFO] ------------------------------------------------------------------------
[INFO] Reactor Build Order:
[INFO] 
[INFO] jersey-examples                                                    [pom]
[INFO] jersey-examples-assemblies                                         [jar]
[INFO] jersey-examples-server-sent-events-jersey                          [jar]
[INFO] jersey-4507                                                        [jar]
[INFO] jersey-examples-webapp-parent-pom                                  [pom]
[INFO] jersey-examples-helloworld-webapp                                  [war]
[INFO] jersey-tests-memleak-redeployment-hello-world-app-ref              [jar]
[INFO] jersey-examples-bookmark                                           [war]
[INFO] jersey-examples-bookmark-em                                        [war]
[INFO] jersey-examples-bookstore-webapp                                   [war]
[INFO] jersey-examples-cdi-webapp                                         [war]
[INFO] jersey-examples-clipboard                                          [jar]
[INFO] jersey-examples-clipboard-programmatic                             [jar]
[INFO] jersey-examples-declarative-linking                                [jar]
[INFO] jersey-examples-entity-filtering                                   [jar]
[INFO] jersey-examples-entity-filtering-selectable                        [jar]
[INFO] jersey-examples-entity-filtering-security                          [jar]
[INFO] jersey-examples-extended-wadl-webapp                               [war]
[INFO] jersey-examples-exception-mapping                                  [jar]
[INFO] jersey-examples-freemarker-webapp                                  [war]
[INFO] jersey-examples-groovy                                             [jar]
[INFO] jersey-examples-helloworld                                         [jar]
[INFO] jersey-examples-helloworld-benchmark                               [jar]
[INFO] jersey-examples-helloworld-cdi2-se                                 [jar]
[INFO] jersey-examples-helloworld-netty                                   [jar]
[INFO] jersey-examples-helloworld-programmatic                            [jar]
[INFO] jersey-examples-helloworld-pure-jax-rs                             [jar]
[INFO] jersey-examples-helloworld-weld                                    [jar]
[INFO] jersey-examples-helloworld-spring-webapp                           [war]
[INFO] helloworld-spring-annotations                                      [jar]
[INFO] jersey-examples-http-patch                                         [jar]
[INFO] jersey-examples-http-trace                                         [jar]
[INFO] jersey-examples-https-clientserver-grizzly                         [jar]
[INFO] jersey-examples-https-server-glassfish                             [war]
[INFO] jersey-examples-java8-webapp                                       [war]
[INFO] jersey-examples-jaxb                                               [jar]
[INFO] jersey-examples-jaxrs-types-injection                              [jar]
[INFO] jersey-examples-ejb                                                [war]
[INFO] jersey-examples-json-binding-webapp                                [war]
[INFO] jersey-examples-json-jackson                                       [jar]
[INFO] jersey-examples-json-jackson1                                      [jar]
[INFO] jersey-examples-json-jettison                                      [jar]
[INFO] jersey-examples-json-moxy                                          [jar]
[INFO] jersey-examples-json-processing-webapp                             [war]
[INFO] jersey-examples-json-with-padding                                  [jar]
[INFO] jersey-examples-managed-beans-webapp                               [war]
[INFO] jersey-examples-managed-client                                     [jar]
[INFO] jersey-examples-managed-client-webapp                              [war]
[INFO] jersey-examples-managed-client-simple-webapp                       [war]
[INFO] jersey-examples-multipart-webapp                                   [war]
[INFO] jersey-examples-open-tracing                                       [jar]
[INFO] jersey-examples-osgi-helloworld-webapp                             [pom]
[INFO] jersey-examples-osgi-helloworld-webapp-lib                         [jar]
[INFO] jersey-examples-osgi-helloworld-webapp-additional                  [jar]
[INFO] jersey-examples-osgi-helloworld-webapp-alternate-version           [jar]
[INFO] jersey-examples-osgi-helloworld-webapp-wab                         [war]
[INFO] jersey-examples-osgi-helloworld-webapp-test                        [pom]
[INFO] jersey-examples-osgi-http-service                                  [pom]
[INFO] jersey-examples-osgi-http-service-bundle                           [jar]
[INFO] jersey-examples-osgi-http-service-test                             [pom]
[INFO] oauth-client-twitter                                               [jar]
[INFO] jersey-examples-reload                                             [jar]
[INFO] jersey-examples-rx-client-webapp                                   [war]
[INFO] jersey-examples-server-async                                       [jar]
[INFO] jersey-examples-server-async-managed                               [jar]
[INFO] jersey-examples-server-async-standalone                            [pom]
[INFO] jersey-examples-server-async-standalone-client                     [jar]
[INFO] jersey-examples-server-async-standalone-webapp                     [war]
[INFO] jersey-examples-server-sent-events-jaxrs                           [jar]
[INFO] jersey-examples-servlet3-webapp                                    [war]
[INFO] jersey-examples-simple-console                                     [jar]
[INFO] jersey-examples-sse-item-store-jersey-webapp                       [war]
[INFO] jersey-examples-sse-item-store-jaxrs-webapp                        [war]
[INFO] jersey-examples-sse-twitter-aggregator                             [jar]
[INFO] jersey-examples-system-properties                                  [jar]
[INFO] jersey-examples-moxy                                               [jar]
[INFO] jersey-bundles-examples                                            [pom]
[INFO] 
[INFO] ---------------< org.glassfish.jersey.examples:project >----------------
[INFO] Building jersey-examples 2.39                                     [1/77]
[INFO] --------------------------------[ pom ]---------------------------------
[INFO] 
[INFO] --- maven-clean-plugin:2.5:clean (default-clean) @ project ---
[INFO] 
[INFO] --- maven-enforcer-plugin:3.1.0:enforce (enforce-versions) @ project ---
[INFO] Skipping Rule Enforcement.
[INFO] 
[INFO] --- maven-checkstyle-plugin:3.1.2:check (verify) @ project ---
[INFO] Starting audit...
Audit done.
[INFO] You have 0 Checkstyle violations.
[INFO] 
[INFO] --- directory-maven-plugin:1.0:highest-basedir (directories) @ project ---
[INFO] Highest basedir set to: /home/jenkins/agent/workspace/Jersey-examples_bundle_release
[INFO] 
[INFO] --- build-helper-maven-plugin:3.3.0:parse-version (parse-version) @ project ---
[INFO] 
[INFO] --- build-helper-maven-plugin:3.3.0:add-source (default) @ project ---
[INFO] Source directory: /home/jenkins/agent/workspace/Jersey-examples_bundle_release/examples/target/generated-sources/rsrc-gen added.
[INFO] 
[INFO] --- maven-resources-plugin:2.6:copy-resources (copy-legaldocs) @ project ---
[INFO] Using 'UTF-8' encoding to copy filtered resources.
[INFO] Copying 2 resources to META-INF/
[INFO] 
[INFO] --- maven-resources-plugin:2.6:copy-resources (copy-legaldocs-to-sources) @ project ---
[INFO] Using 'UTF-8' encoding to copy filtered resources.
[INFO] Copying 2 resources to META-INF/
[INFO] 
[INFO] --- maven-resources-plugin:2.6:copy-resources (copy-legaldocs-to-osgi-bundles) @ project ---
[INFO] Using 'UTF-8' encoding to copy filtered resources.
[INFO] Copying 2 resources to META-INF/
[INFO] 
[INFO] --- maven-resources-plugin:2.6:copy-resources (copy-legaldocs-to-wars) @ project ---
[INFO] Using 'UTF-8' encoding to copy filtered resources.
[INFO] Copying 2 resources to META-INF/
[INFO] 
[INFO] --- build-helper-maven-plugin:3.3.0:reserve-network-port (reserve-port) @ project ---
[INFO] Reserved port 45695 for jersey.config.test.container.port
[INFO] Reserved port 45127 for jersey.config.test.container.stop.port
[INFO] 
[INFO] --- maven-source-plugin:3.2.1:jar-no-fork (attach-sources) @ project ---
[INFO] 
[INFO] --- maven-javadoc-plugin:3.4.0:jar (attach-javadocs) @ project ---
[INFO] Not executing Javadoc as the project is not a Java classpath-capable package
[INFO] 
[INFO] --- maven-install-plugin:3.0.1:install (default-install) @ project ---
[INFO] Installing /home/jenkins/agent/workspace/Jersey-examples_bundle_release/examples/pom.xml to /home/jenkins/.m2/repository/org/glassfish/jersey/examples/project/2.39/project-2.39.pom
[INFO] 
[INFO] --------------< org.glassfish.jersey.examples:assemblies >--------------
[INFO] Building jersey-examples-assemblies 2.39                          [2/77]
[INFO] --------------------------------[ jar ]---------------------------------
[INFO] 
[INFO] --- maven-clean-plugin:2.5:clean (default-clean) @ assemblies ---
[INFO] 
[INFO] --- maven-enforcer-plugin:3.1.0:enforce (enforce-versions) @ assemblies ---
[INFO] Skipping Rule Enforcement.
[INFO] 
[INFO] --- maven-checkstyle-plugin:3.1.2:check (verify) @ assemblies ---
[INFO] Starting audit...
Audit done.
[INFO] You have 0 Checkstyle violations.
[INFO] 
[INFO] --- directory-maven-plugin:1.0:highest-basedir (directories) @ assemblies ---
[INFO] Highest basedir set to: /home/jenkins/agent/workspace/Jersey-examples_bundle_release
[INFO] 
[INFO] --- build-helper-maven-plugin:3.3.0:parse-version (parse-version) @ assemblies ---
[INFO] 
[INFO] --- build-helper-maven-plugin:3.3.0:add-source (default) @ assemblies ---
[INFO] Source directory: /home/jenkins/agent/workspace/Jersey-examples_bundle_release/examples/assemblies/target/generated-sources/rsrc-gen added.
[INFO] 
[INFO] --- maven-resources-plugin:2.6:copy-resources (copy-legaldocs) @ assemblies ---
[INFO] Using 'UTF-8' encoding to copy filtered resources.
[INFO] Copying 2 resources to META-INF/
[INFO] 
[INFO] --- maven-resources-plugin:2.6:copy-resources (copy-legaldocs-to-sources) @ assemblies ---
[INFO] Using 'UTF-8' encoding to copy filtered resources.
[INFO] Copying 2 resources to META-INF/
[INFO] 
[INFO] --- maven-resources-plugin:2.6:copy-resources (copy-legaldocs-to-osgi-bundles) @ assemblies ---
[INFO] Using 'UTF-8' encoding to copy filtered resources.
[INFO] Copying 2 resources to META-INF/
[INFO] 
[INFO] --- maven-resources-plugin:2.6:copy-resources (copy-legaldocs-to-wars) @ assemblies ---
[INFO] Using 'UTF-8' encoding to copy filtered resources.
[INFO] Copying 2 resources to META-INF/
[INFO] 
[INFO] --- maven-resources-plugin:2.6:resources (default-resources) @ assemblies ---
[INFO] Using 'UTF-8' encoding to copy filtered resources.
[INFO] Copying 4 resources
[INFO] Copying 2 resources
[INFO] 
[INFO] --- maven-compiler-plugin:3.9.0:compile (default-compile) @ assemblies ---
[INFO] Nothing to compile - all classes are up to date
[INFO] 
[INFO] --- maven-resources-plugin:2.6:testResources (default-testResources) @ assemblies ---
[INFO] Using 'UTF-8' encoding to copy filtered resources.
[INFO] skip non existing resourceDirectory /home/jenkins/agent/workspace/Jersey-examples_bundle_release/examples/assemblies/src/test/resources
[INFO] 
[INFO] --- maven-compiler-plugin:3.9.0:testCompile (default-testCompile) @ assemblies ---
[INFO] No sources to compile
[INFO] 
[INFO] --- build-helper-maven-plugin:3.3.0:reserve-network-port (reserve-port) @ assemblies ---
[INFO] Reserved port 44295 for jersey.config.test.container.port
[INFO] Reserved port 39541 for jersey.config.test.container.stop.port
[INFO] 
[INFO] --- maven-surefire-plugin:3.0.0-M7:test (default-test) @ assemblies ---
[INFO] Tests are skipped.
[INFO] 
[INFO] --- maven-jar-plugin:3.2.2:jar (default-jar) @ assemblies ---
[INFO] Building jar: /home/jenkins/agent/workspace/Jersey-examples_bundle_release/examples/assemblies/target/assemblies.jar
[INFO] 
[INFO] --- maven-source-plugin:3.2.1:jar-no-fork (attach-sources) @ assemblies ---
[INFO] Building jar: /home/jenkins/agent/workspace/Jersey-examples_bundle_release/examples/assemblies/target/assemblies-sources.jar
[INFO] 
[INFO] --- maven-javadoc-plugin:3.4.0:jar (attach-javadocs) @ assemblies ---
[INFO] 
[INFO] --- maven-install-plugin:3.0.1:install (default-install) @ assemblies ---
[INFO] Installing /home/jenkins/agent/workspace/Jersey-examples_bundle_release/examples/assemblies/pom.xml to /home/jenkins/.m2/repository/org/glassfish/jersey/examples/assemblies/2.39/assemblies-2.39.pom
[INFO] Installing /home/jenkins/agent/workspace/Jersey-examples_bundle_release/examples/assemblies/target/assemblies.jar to /home/jenkins/.m2/repository/org/glassfish/jersey/examples/assemblies/2.39/assemblies-2.39.jar
[INFO] Installing /home/jenkins/agent/workspace/Jersey-examples_bundle_release/examples/assemblies/target/assemblies-sources.jar to /home/jenkins/.m2/repository/org/glassfish/jersey/examples/assemblies/2.39/assemblies-2.39-sources.jar
[INFO] 
[INFO] ------< org.glassfish.jersey.examples:server-sent-events-jersey >-------
[INFO] Building jersey-examples-server-sent-events-jersey 2.39           [3/77]
[INFO] --------------------------------[ jar ]---------------------------------
[WARNING] The POM for org.glassfish.jersey.containers:jersey-container-grizzly2-http:jar:2.39 is missing, no dependency information available
[WARNING] The POM for org.glassfish.jersey.inject:jersey-hk2:jar:2.39 is missing, no dependency information available
[WARNING] The POM for org.glassfish.jersey.media:jersey-media-sse:jar:2.39 is missing, no dependency information available
[WARNING] The POM for org.glassfish.jersey.test-framework.providers:jersey-test-framework-provider-bundle:pom:2.39 is missing, no dependency information available
[INFO] ------------------------------------------------------------------------
[INFO] Reactor Summary for jersey-examples 2.39:
[INFO] 
[INFO] jersey-examples .................................... SUCCESS [ 16.587 s]
[INFO] jersey-examples-assemblies ......................... SUCCESS [  3.192 s]
[INFO] jersey-examples-server-sent-events-jersey .......... FAILURE [  0.548 s]
[INFO] jersey-4507 ........................................ SKIPPED
[INFO] jersey-examples-webapp-parent-pom .................. SKIPPED
[INFO] jersey-examples-helloworld-webapp .................. SKIPPED
[INFO] jersey-tests-memleak-redeployment-hello-world-app-ref SKIPPED
[INFO] jersey-examples-bookmark ........................... SKIPPED
[INFO] jersey-examples-bookmark-em ........................ SKIPPED
[INFO] jersey-examples-bookstore-webapp ................... SKIPPED
[INFO] jersey-examples-cdi-webapp ......................... SKIPPED
[INFO] jersey-examples-clipboard .......................... SKIPPED
[INFO] jersey-examples-clipboard-programmatic ............. SKIPPED
[INFO] jersey-examples-declarative-linking ................ SKIPPED
[INFO] jersey-examples-entity-filtering ................... SKIPPED
[INFO] jersey-examples-entity-filtering-selectable ........ SKIPPED
[INFO] jersey-examples-entity-filtering-security .......... SKIPPED
[INFO] jersey-examples-extended-wadl-webapp ............... SKIPPED
[INFO] jersey-examples-exception-mapping .................. SKIPPED
[INFO] jersey-examples-freemarker-webapp .................. SKIPPED
[INFO] jersey-examples-groovy ............................. SKIPPED
[INFO] jersey-examples-helloworld ......................... SKIPPED
[INFO] jersey-examples-helloworld-benchmark ............... SKIPPED
[INFO] jersey-examples-helloworld-cdi2-se ................. SKIPPED
[INFO] jersey-examples-helloworld-netty ................... SKIPPED
[INFO] jersey-examples-helloworld-programmatic ............ SKIPPED
[INFO] jersey-examples-helloworld-pure-jax-rs ............. SKIPPED
[INFO] jersey-examples-helloworld-weld .................... SKIPPED
[INFO] jersey-examples-helloworld-spring-webapp ........... SKIPPED
[INFO] helloworld-spring-annotations ...................... SKIPPED
[INFO] jersey-examples-http-patch ......................... SKIPPED
[INFO] jersey-examples-http-trace ......................... SKIPPED
[INFO] jersey-examples-https-clientserver-grizzly ......... SKIPPED
[INFO] jersey-examples-https-server-glassfish ............. SKIPPED
[INFO] jersey-examples-java8-webapp ....................... SKIPPED
[INFO] jersey-examples-jaxb ............................... SKIPPED
[INFO] jersey-examples-jaxrs-types-injection .............. SKIPPED
[INFO] jersey-examples-ejb ................................ SKIPPED
[INFO] jersey-examples-json-binding-webapp ................ SKIPPED
[INFO] jersey-examples-json-jackson ....................... SKIPPED
[INFO] jersey-examples-json-jackson1 ...................... SKIPPED
[INFO] jersey-examples-json-jettison ...................... SKIPPED
[INFO] jersey-examples-json-moxy .......................... SKIPPED
[INFO] jersey-examples-json-processing-webapp ............. SKIPPED
[INFO] jersey-examples-json-with-padding .................. SKIPPED
[INFO] jersey-examples-managed-beans-webapp ............... SKIPPED
[INFO] jersey-examples-managed-client ..................... SKIPPED
[INFO] jersey-examples-managed-client-webapp .............. SKIPPED
[INFO] jersey-examples-managed-client-simple-webapp ....... SKIPPED
[INFO] jersey-examples-multipart-webapp ................... SKIPPED
[INFO] jersey-examples-open-tracing ....................... SKIPPED
[INFO] jersey-examples-osgi-helloworld-webapp ............. SKIPPED
[INFO] jersey-examples-osgi-helloworld-webapp-lib ......... SKIPPED
[INFO] jersey-examples-osgi-helloworld-webapp-additional .. SKIPPED
[INFO] jersey-examples-osgi-helloworld-webapp-alternate-version SKIPPED
[INFO] jersey-examples-osgi-helloworld-webapp-wab ......... SKIPPED
[INFO] jersey-examples-osgi-helloworld-webapp-test ........ SKIPPED
[INFO] jersey-examples-osgi-http-service .................. SKIPPED
[INFO] jersey-examples-osgi-http-service-bundle ........... SKIPPED
[INFO] jersey-examples-osgi-http-service-test ............. SKIPPED
[INFO] oauth-client-twitter ............................... SKIPPED
[INFO] jersey-examples-reload ............................. SKIPPED
[INFO] jersey-examples-rx-client-webapp ................... SKIPPED
[INFO] jersey-examples-server-async ....................... SKIPPED
[INFO] jersey-examples-server-async-managed ............... SKIPPED
[INFO] jersey-examples-server-async-standalone ............ SKIPPED
[INFO] jersey-examples-server-async-standalone-client ..... SKIPPED
[INFO] jersey-examples-server-async-standalone-webapp ..... SKIPPED
[INFO] jersey-examples-server-sent-events-jaxrs ........... SKIPPED
[INFO] jersey-examples-servlet3-webapp .................... SKIPPED
[INFO] jersey-examples-simple-console ..................... SKIPPED
[INFO] jersey-examples-sse-item-store-jersey-webapp ....... SKIPPED
[INFO] jersey-examples-sse-item-store-jaxrs-webapp ........ SKIPPED
[INFO] jersey-examples-sse-twitter-aggregator ............. SKIPPED
[INFO] jersey-examples-system-properties .................. SKIPPED
[INFO] jersey-examples-moxy ............................... SKIPPED
[INFO] jersey-bundles-examples ............................ SKIPPED
[INFO] ------------------------------------------------------------------------
[INFO] BUILD FAILURE
[INFO] ------------------------------------------------------------------------
[INFO] Total time:  38.906 s
[INFO] Finished at: 2023-02-17T05:34:38Z
[INFO] ------------------------------------------------------------------------
[ERROR] Failed to execute goal on project server-sent-events-jersey: Could not resolve dependencies for project org.glassfish.jersey.examples:server-sent-events-jersey:jar:2.39: The following artifacts could not be resolved: org.glassfish.jersey.containers:jersey-container-grizzly2-http:jar:2.39, org.glassfish.jersey.inject:jersey-hk2:jar:2.39, org.glassfish.jersey.media:jersey-media-sse:jar:2.39, org.glassfish.jersey.test-framework.providers:jersey-test-framework-provider-bundle:pom:2.39: Could not find artifact org.glassfish.jersey.containers:jersey-container-grizzly2-http:jar:2.39 in sonatype-nexus-staging (https://jakarta.oss.sonatype.org/content/repositories/staging/) -> [Help 1]
[ERROR] 
[ERROR] To see the full stack trace of the errors, re-run Maven with the -e switch.
[ERROR] Re-run Maven using the -X switch to enable full debug logging.
[ERROR] 
[ERROR] For more information about the errors and possible solutions, please read the following articles:
[ERROR] [Help 1] http://cwiki.apache.org/confluence/display/MAVEN/DependencyResolutionException
[ERROR] 
[ERROR] After correcting the problems, you can resume the build with the command
[ERROR]   mvn <args> -rf :server-sent-events-jersey
Build step 'Execute shell' marked build as failure
Finished: FAILURE