FailedConsole Output

Started by user fwaibel@datenkollektiv.de
Building in workspace /home/hudson/genie.virgo/.jenkins/jobs/recipe-accessing-data-mongodb/workspace
 > /usr/local/bin/git rev-parse --is-inside-work-tree # timeout=10
Fetching changes from the remote Git repository
 > /usr/local/bin/git config remote.origin.url git://git.eclipse.org/gitroot/virgo/org.eclipse.virgo.samples.git # timeout=10
Fetching upstream changes from git://git.eclipse.org/gitroot/virgo/org.eclipse.virgo.samples.git
 > /usr/local/bin/git --version # timeout=10
 > /usr/local/bin/git fetch --tags --progress git://git.eclipse.org/gitroot/virgo/org.eclipse.virgo.samples.git +refs/heads/*:refs/remotes/origin/*
 > /usr/local/bin/git rev-parse feature/spring_data_kay^{commit} # timeout=10
 > /usr/local/bin/git rev-parse refs/remotes/origin/feature/spring_data_kay^{commit} # timeout=10
Checking out Revision 1f606ba8789f44af84443956898602f30031363f (refs/remotes/origin/feature/spring_data_kay)
 > /usr/local/bin/git config core.sparsecheckout # timeout=10
 > /usr/local/bin/git checkout -f 1f606ba8789f44af84443956898602f30031363f
Commit message: "Update recipe-accessing-data-mongodb to use Spring Data Kay SR8"
First time build. Skipping changelog.
[Gradle] - Launching build.
[recipe-accessing-data-mongodb] $ /home/hudson/genie.virgo/.jenkins/jobs/recipe-accessing-data-mongodb/workspace/recipe-accessing-data-mongodb/gradlew -Declipse.build=true -Dci.build=true clean asciidoc
Picked up JAVA_TOOL_OPTIONS: -Xmx2G -Djava.io.tmpdir=/tmp/genie.virgo
Starting a Gradle Daemon (subsequent builds will be faster)
Download https://plugins.gradle.org/m2/org/asciidoctor/asciidoctor-gradle-plugin/1.5.3/asciidoctor-gradle-plugin-1.5.3.pom
Download https://plugins.gradle.org/m2/gradle/plugin/com/eclipsesource/dockerizor/dockerizor/0.9.1/dockerizor-0.9.1.pom
Download https://repo.maven.apache.org/maven2/com/github/docker-java/docker-java/3.0.14/docker-java-3.0.14.pom
Download https://repo.maven.apache.org/maven2/de/gesellix/unix-socket-factory/2016-04-06T22-21-19/unix-socket-factory-2016-04-06T22-21-19.pom
Download https://repo.maven.apache.org/maven2/org/glassfish/jersey/connectors/jersey-apache-connector/2.23.1/jersey-apache-connector-2.23.1.pom
Download https://repo.maven.apache.org/maven2/com/fasterxml/jackson/jaxrs/jackson-jaxrs-json-provider/2.6.4/jackson-jaxrs-json-provider-2.6.4.pom
Download https://repo.maven.apache.org/maven2/org/glassfish/jersey/core/jersey-client/2.23.1/jersey-client-2.23.1.pom
Download https://repo.maven.apache.org/maven2/com/kohlschutter/junixsocket/junixsocket-common/2.0.4/junixsocket-common-2.0.4.pom
Download https://repo.maven.apache.org/maven2/com/fasterxml/jackson/jaxrs/jackson-jaxrs-providers/2.6.4/jackson-jaxrs-providers-2.6.4.pom
Download https://repo.maven.apache.org/maven2/org/glassfish/jersey/connectors/project/2.23.1/project-2.23.1.pom
Download https://repo.maven.apache.org/maven2/org/apache/httpcomponents/httpclient/4.5/httpclient-4.5.pom
Download https://repo.maven.apache.org/maven2/org/apache/httpcomponents/httpcore/4.4.5/httpcore-4.4.5.pom
Download https://repo.maven.apache.org/maven2/io/netty/netty-transport-native-epoll/4.1.11.Final/netty-transport-native-epoll-4.1.11.Final.pom
Download https://repo.maven.apache.org/maven2/com/google/guava/guava/19.0/guava-19.0.pom
Download https://repo.maven.apache.org/maven2/org/slf4j/slf4j-api/1.7.21/slf4j-api-1.7.21.pom
Download https://repo.maven.apache.org/maven2/commons-codec/commons-codec/1.10/commons-codec-1.10.pom
Download https://repo.maven.apache.org/maven2/io/netty/netty-transport-native-kqueue/4.1.11.Final/netty-transport-native-kqueue-4.1.11.Final.pom
Download https://repo.maven.apache.org/maven2/org/apache/commons/commons-compress/1.12/commons-compress-1.12.pom
Download https://repo.maven.apache.org/maven2/org/slf4j/jcl-over-slf4j/1.7.21/jcl-over-slf4j-1.7.21.pom
Download https://repo.maven.apache.org/maven2/org/bouncycastle/bcpkix-jdk15on/1.54/bcpkix-jdk15on-1.54.pom
Download https://repo.maven.apache.org/maven2/org/glassfish/jersey/project/2.23.1/project-2.23.1.pom
Download https://repo.maven.apache.org/maven2/com/kohlschutter/junixsocket/junixsocket-native-common/2.0.4/junixsocket-native-common-2.0.4.pom
Download https://repo.maven.apache.org/maven2/io/netty/netty-handler/4.1.11.Final/netty-handler-4.1.11.Final.pom
Download https://repo.maven.apache.org/maven2/com/kohlschutter/junixsocket/junixsocket-parent/2.0.4/junixsocket-parent-2.0.4.pom
Download https://repo.maven.apache.org/maven2/org/slf4j/slf4j-parent/1.7.21/slf4j-parent-1.7.21.pom
Download https://repo.maven.apache.org/maven2/io/netty/netty-parent/4.1.11.Final/netty-parent-4.1.11.Final.pom
Download https://repo.maven.apache.org/maven2/com/google/guava/guava-parent/19.0/guava-parent-19.0.pom
Download https://repo.maven.apache.org/maven2/org/apache/httpcomponents/httpcomponents-core/4.4.5/httpcomponents-core-4.4.5.pom
Download https://repo.maven.apache.org/maven2/net/java/jvnet-parent/4/jvnet-parent-4.pom
Download https://repo.maven.apache.org/maven2/org/apache/httpcomponents/httpcomponents-client/4.5/httpcomponents-client-4.5.pom
Download https://repo.maven.apache.org/maven2/org/apache/commons/commons-parent/35/commons-parent-35.pom
Download https://repo.maven.apache.org/maven2/com/kohlschutter/kohlschutter-parent/1.1/kohlschutter-parent-1.1.pom
Download https://repo.maven.apache.org/maven2/io/netty/netty-codec-http/4.1.11.Final/netty-codec-http-4.1.11.Final.pom
Download https://repo.maven.apache.org/maven2/io/netty/netty-handler-proxy/4.1.11.Final/netty-handler-proxy-4.1.11.Final.pom
Download https://repo.maven.apache.org/maven2/org/apache/apache/15/apache-15.pom
Download https://repo.maven.apache.org/maven2/org/glassfish/hk2/hk2-bom/2.4.0-b34/hk2-bom-2.4.0-b34.pom
Download https://repo.maven.apache.org/maven2/net/java/jvnet-parent/5/jvnet-parent-5.pom
Download https://repo.maven.apache.org/maven2/com/fasterxml/jackson/module/jackson-module-jaxb-annotations/2.6.4/jackson-module-jaxb-annotations-2.6.4.pom
Download https://repo.maven.apache.org/maven2/com/fasterxml/jackson/core/jackson-databind/2.6.4/jackson-databind-2.6.4.pom
Download https://repo.maven.apache.org/maven2/com/fasterxml/jackson/jaxrs/jackson-jaxrs-base/2.6.4/jackson-jaxrs-base-2.6.4.pom
Download https://repo.maven.apache.org/maven2/javax/ws/rs/javax.ws.rs-api/2.0.1/javax.ws.rs-api-2.0.1.pom
Download https://repo.maven.apache.org/maven2/org/glassfish/jersey/core/jersey-common/2.23.1/jersey-common-2.23.1.pom
Download https://repo.maven.apache.org/maven2/org/glassfish/hk2/hk2-api/2.4.0-b34/hk2-api-2.4.0-b34.pom
Download https://repo.maven.apache.org/maven2/org/glassfish/hk2/external/javax.inject/2.4.0-b34/javax.inject-2.4.0-b34.pom
Download https://repo.maven.apache.org/maven2/org/glassfish/hk2/hk2-locator/2.4.0-b34/hk2-locator-2.4.0-b34.pom
Download https://repo.maven.apache.org/maven2/org/glassfish/hk2/hk2-parent/2.4.0-b34/hk2-parent-2.4.0-b34.pom
Download https://repo.maven.apache.org/maven2/org/glassfish/hk2/external/2.4.0-b34/external-2.4.0-b34.pom
Download https://repo.maven.apache.org/maven2/log4j/log4j/1.2.17/log4j-1.2.17.pom
Download https://repo.maven.apache.org/maven2/org/scijava/native-lib-loader/2.0.2/native-lib-loader-2.0.2.pom
Download https://repo.maven.apache.org/maven2/org/scijava/pom-scijava/3.1/pom-scijava-3.1.pom
Download https://repo.maven.apache.org/maven2/org/bouncycastle/bcprov-jdk15on/1.54/bcprov-jdk15on-1.54.pom
Download https://repo.maven.apache.org/maven2/io/netty/netty-codec/4.1.11.Final/netty-codec-4.1.11.Final.pom
Download https://repo.maven.apache.org/maven2/io/netty/netty-buffer/4.1.11.Final/netty-buffer-4.1.11.Final.pom
Download https://repo.maven.apache.org/maven2/io/netty/netty-transport/4.1.11.Final/netty-transport-4.1.11.Final.pom
Download https://repo.maven.apache.org/maven2/io/netty/netty-codec-socks/4.1.11.Final/netty-codec-socks-4.1.11.Final.pom
Download https://repo.maven.apache.org/maven2/io/netty/netty-common/4.1.11.Final/netty-common-4.1.11.Final.pom
Download https://repo.maven.apache.org/maven2/io/netty/netty-transport-native-unix-common/4.1.11.Final/netty-transport-native-unix-common-4.1.11.Final.pom
Download https://repo.maven.apache.org/maven2/com/fasterxml/jackson/core/jackson-annotations/2.6.0/jackson-annotations-2.6.0.pom
Download https://repo.maven.apache.org/maven2/com/fasterxml/jackson/jackson-parent/2.6.1/jackson-parent-2.6.1.pom
Download https://repo.maven.apache.org/maven2/com/fasterxml/oss-parent/23/oss-parent-23.pom
Download https://repo.maven.apache.org/maven2/javax/annotation/javax.annotation-api/1.2/javax.annotation-api-1.2.pom
Download https://repo.maven.apache.org/maven2/org/glassfish/hk2/osgi-resource-locator/1.0.1/osgi-resource-locator-1.0.1.pom
Download https://repo.maven.apache.org/maven2/org/glassfish/jersey/bundles/repackaged/jersey-guava/2.23.1/jersey-guava-2.23.1.pom
Download https://repo.maven.apache.org/maven2/org/glassfish/pom/8/pom-8.pom
Download https://repo.maven.apache.org/maven2/org/glassfish/jersey/bundles/repackaged/project/2.23.1/project-2.23.1.pom
Download https://repo.maven.apache.org/maven2/org/glassfish/jersey/bundles/project/2.23.1/project-2.23.1.pom
Download https://repo.maven.apache.org/maven2/org/glassfish/hk2/hk2-utils/2.4.0-b34/hk2-utils-2.4.0-b34.pom
Download https://repo.maven.apache.org/maven2/org/glassfish/hk2/external/aopalliance-repackaged/2.4.0-b34/aopalliance-repackaged-2.4.0-b34.pom
Download https://repo.maven.apache.org/maven2/org/javassist/javassist/3.18.1-GA/javassist-3.18.1-GA.pom
Download https://repo.maven.apache.org/maven2/io/netty/netty-resolver/4.1.11.Final/netty-resolver-4.1.11.Final.pom
Download https://repo.maven.apache.org/maven2/org/apache/httpcomponents/httpclient/4.5.2/httpclient-4.5.2.pom
Download https://repo.maven.apache.org/maven2/org/apache/httpcomponents/httpcomponents-client/4.5.2/httpcomponents-client-4.5.2.pom
Download https://repo.maven.apache.org/maven2/org/slf4j/slf4j-api/1.7.21/slf4j-api-1.7.21.jar
Download https://repo.maven.apache.org/maven2/org/apache/commons/commons-compress/1.12/commons-compress-1.12.jar
Download https://repo.maven.apache.org/maven2/org/bouncycastle/bcpkix-jdk15on/1.54/bcpkix-jdk15on-1.54.jar
Download https://repo.maven.apache.org/maven2/com/fasterxml/jackson/jaxrs/jackson-jaxrs-json-provider/2.6.4/jackson-jaxrs-json-provider-2.6.4.jar
Download https://repo.maven.apache.org/maven2/org/apache/httpcomponents/httpclient/4.5.2/httpclient-4.5.2.jar
Download https://repo.maven.apache.org/maven2/org/glassfish/jersey/core/jersey-client/2.23.1/jersey-client-2.23.1.jar
Download https://repo.maven.apache.org/maven2/com/kohlschutter/junixsocket/junixsocket-common/2.0.4/junixsocket-common-2.0.4.jar
Download https://repo.maven.apache.org/maven2/org/glassfish/jersey/connectors/jersey-apache-connector/2.23.1/jersey-apache-connector-2.23.1.jar
Download https://repo.maven.apache.org/maven2/com/github/docker-java/docker-java/3.0.14/docker-java-3.0.14.jar
Download https://repo.maven.apache.org/maven2/io/netty/netty-codec-http/4.1.11.Final/netty-codec-http-4.1.11.Final.jar
Download https://repo.maven.apache.org/maven2/org/slf4j/jcl-over-slf4j/1.7.21/jcl-over-slf4j-1.7.21.jar
Download https://repo.maven.apache.org/maven2/commons-codec/commons-codec/1.10/commons-codec-1.10.jar
Download https://repo.maven.apache.org/maven2/de/gesellix/unix-socket-factory/2016-04-06T22-21-19/unix-socket-factory-2016-04-06T22-21-19.jar
Download https://repo.maven.apache.org/maven2/org/apache/httpcomponents/httpcore/4.4.5/httpcore-4.4.5.jar
Download https://repo.maven.apache.org/maven2/com/kohlschutter/junixsocket/junixsocket-native-common/2.0.4/junixsocket-native-common-2.0.4.jar
Download https://repo.maven.apache.org/maven2/io/netty/netty-handler-proxy/4.1.11.Final/netty-handler-proxy-4.1.11.Final.jar
Download https://repo.maven.apache.org/maven2/io/netty/netty-handler/4.1.11.Final/netty-handler-4.1.11.Final.jar
Download https://repo.maven.apache.org/maven2/io/netty/netty-transport-native-kqueue/4.1.11.Final/netty-transport-native-kqueue-4.1.11.Final-osx-x86_64.jar
Download https://repo.maven.apache.org/maven2/com/fasterxml/jackson/jaxrs/jackson-jaxrs-base/2.6.4/jackson-jaxrs-base-2.6.4.jar
Download https://repo.maven.apache.org/maven2/com/fasterxml/jackson/module/jackson-module-jaxb-annotations/2.6.4/jackson-module-jaxb-annotations-2.6.4.jar
Download https://repo.maven.apache.org/maven2/io/netty/netty-transport-native-epoll/4.1.11.Final/netty-transport-native-epoll-4.1.11.Final-linux-x86_64.jar
Download https://repo.maven.apache.org/maven2/org/glassfish/jersey/core/jersey-common/2.23.1/jersey-common-2.23.1.jar
Download https://repo.maven.apache.org/maven2/com/fasterxml/jackson/core/jackson-databind/2.6.4/jackson-databind-2.6.4.jar
Download https://repo.maven.apache.org/maven2/javax/ws/rs/javax.ws.rs-api/2.0.1/javax.ws.rs-api-2.0.1.jar
Download https://repo.maven.apache.org/maven2/org/glassfish/hk2/hk2-locator/2.4.0-b34/hk2-locator-2.4.0-b34.jar
Download https://repo.maven.apache.org/maven2/org/glassfish/hk2/hk2-api/2.4.0-b34/hk2-api-2.4.0-b34.jar
Download https://repo.maven.apache.org/maven2/org/glassfish/hk2/external/javax.inject/2.4.0-b34/javax.inject-2.4.0-b34.jar
Download https://repo.maven.apache.org/maven2/log4j/log4j/1.2.17/log4j-1.2.17.jar
Download https://repo.maven.apache.org/maven2/org/bouncycastle/bcprov-jdk15on/1.54/bcprov-jdk15on-1.54.jar
Download https://repo.maven.apache.org/maven2/io/netty/netty-codec/4.1.11.Final/netty-codec-4.1.11.Final.jar
Download https://repo.maven.apache.org/maven2/io/netty/netty-codec-socks/4.1.11.Final/netty-codec-socks-4.1.11.Final.jar
Download https://plugins.gradle.org/m2/org/asciidoctor/asciidoctor-gradle-plugin/1.5.3/asciidoctor-gradle-plugin-1.5.3.jar
Download https://repo.maven.apache.org/maven2/com/fasterxml/jackson/core/jackson-annotations/2.6.0/jackson-annotations-2.6.0.jar
Download https://repo.maven.apache.org/maven2/org/scijava/native-lib-loader/2.0.2/native-lib-loader-2.0.2.jar
Download https://repo.maven.apache.org/maven2/io/netty/netty-resolver/4.1.11.Final/netty-resolver-4.1.11.Final.jar
Download https://repo.maven.apache.org/maven2/io/netty/netty-common/4.1.11.Final/netty-common-4.1.11.Final.jar
Download https://repo.maven.apache.org/maven2/io/netty/netty-transport-native-unix-common/4.1.11.Final/netty-transport-native-unix-common-4.1.11.Final.jar
Download https://repo.maven.apache.org/maven2/org/glassfish/hk2/external/aopalliance-repackaged/2.4.0-b34/aopalliance-repackaged-2.4.0-b34.jar
Download https://repo.maven.apache.org/maven2/javax/annotation/javax.annotation-api/1.2/javax.annotation-api-1.2.jar
Download https://plugins.gradle.org/m2/gradle/plugin/com/eclipsesource/dockerizor/dockerizor/0.9.1/dockerizor-0.9.1.jar
Download https://repo.maven.apache.org/maven2/org/glassfish/hk2/osgi-resource-locator/1.0.1/osgi-resource-locator-1.0.1.jar
Download https://repo.maven.apache.org/maven2/io/netty/netty-transport/4.1.11.Final/netty-transport-4.1.11.Final.jar
Download https://repo.maven.apache.org/maven2/org/glassfish/jersey/bundles/repackaged/jersey-guava/2.23.1/jersey-guava-2.23.1.jar
Download https://repo.maven.apache.org/maven2/io/netty/netty-buffer/4.1.11.Final/netty-buffer-4.1.11.Final.jar
Download https://repo.maven.apache.org/maven2/org/glassfish/hk2/hk2-utils/2.4.0-b34/hk2-utils-2.4.0-b34.jar
Download https://repo.maven.apache.org/maven2/org/javassist/javassist/3.18.1-GA/javassist-3.18.1-GA.jar
Download https://repo.maven.apache.org/maven2/com/google/guava/guava/19.0/guava-19.0.jar

FAILURE: Build failed with an exception.

* What went wrong:
A problem occurred configuring root project 'recipe-accessing-data-mongodb'.
> Could not resolve all artifacts for configuration ':classpath'.
   > Could not download org.eclipse.virgo.bundlor.gradle.plugin.jar (org.eclipse.virgo.bundlor:org.eclipse.virgo.bundlor.gradle.plugin:1.1.3.M01)
      > Failed to download SHA1 for resource 'http://build.eclipse.org/rt/virgo/gradle/bundles/org/eclipse/virgo/bundlor/org.eclipse.virgo.bundlor.gradle.plugin/1.1.3.M01/org.eclipse.virgo.bundlor.gradle.plugin-1.1.3.M01.jar'.
         > For input string: "<!"

* Try:
Run with --stacktrace option to get the stack trace. Run with --info or --debug option to get more log output. Run with --scan to get full insights.

* Get more help at https://help.gradle.org

BUILD FAILED in 16s
Build step 'Invoke Gradle script' changed build result to FAILURE
Build step 'Invoke Gradle script' marked build as failure
Sending e-mails to: fwaibel@datenkollektiv.de
Archiving artifacts
Started calculate disk usage of build
Finished Calculation of disk usage of build in 0 seconds
Started calculate disk usage of workspace
Finished Calculation of disk usage of workspace in 0 seconds
Finished: FAILURE