FailedConsole Output

Skipping 6,067 KB.. Full Log
AAA==:org.eclipse.virgo.site:org.eclipse.equinox.regions:build
:org.eclipse.virgo.site:org.eclipse.virgo.core:assemble
:org.eclipse.virgo.site:org.eclipse.virgo.core:compileTestJava UP-TO-DATE
:org.eclipse.virgo.site:org.eclipse.virgo.core:processTestResources UP-TO-DATE
:org.eclipse.virgo.site:org.eclipse.virgo.core:testClasses UP-TO-DATE
:org.eclipse.virgo.site:org.eclipse.virgo.core:test UP-TO-DATE
:org.eclipse.virgo.site:org.eclipse.virgo.core:check UP-TO-DATE
:org.eclipse.virgo.site:org.eclipse.virgo.core:build
:org.eclipse.virgo.site:org.eclipse.virgo.ds:assemble
:org.eclipse.virgo.site:org.eclipse.virgo.ds:compileTestJava UP-TO-DATE
:org.eclipse.virgo.site:org.eclipse.virgo.ds:processTestResources UP-TO-DATE
:org.eclipse.virgo.site:org.eclipse.virgo.ds:testClasses UP-TO-DATE
:org.eclipse.virgo.site:org.eclipse.virgo.ds:test UP-TO-DATE
:org.eclipse.virgo.site:org.eclipse.virgo.ds:check UP-TO-DATE
:org.eclipse.virgo.site:org.eclipse.virgo.ds:build
:org.eclipse.virgo.site:org.eclipse.virgo.kernel:assemble
:org.eclipse.virgo.site:org.eclipse.virgo.kernel:compileTestJava UP-TO-DATE
:org.eclipse.virgo.site:org.eclipse.virgo.kernel:processTestResources UP-TO-DATE
:org.eclipse.virgo.site:org.eclipse.virgo.kernel:testClasses UP-TO-DATE
:org.eclipse.virgo.site:org.eclipse.virgo.kernel:test UP-TO-DATE
:org.eclipse.virgo.site:org.eclipse.virgo.kernel:check UP-TO-DATE
:org.eclipse.virgo.site:org.eclipse.virgo.kernel:build
:org.eclipse.virgo.site:org.eclipse.virgo.kernel.httpservice:assemble
:org.eclipse.virgo.site:org.eclipse.virgo.kernel.httpservice:compileTestJava UP-TO-DATE
:org.eclipse.virgo.site:org.eclipse.virgo.kernel.httpservice:processTestResources UP-TO-DATE
:org.eclipse.virgo.site:org.eclipse.virgo.kernel.httpservice:testClasses UP-TO-DATE
:org.eclipse.virgo.site:org.eclipse.virgo.kernel.httpservice:test UP-TO-DATE
:org.eclipse.virgo.site:org.eclipse.virgo.kernel.httpservice:check UP-TO-DATE
:org.eclipse.virgo.site:org.eclipse.virgo.kernel.httpservice:build
:org.eclipse.virgo.site:org.eclipse.virgo.kernel.springintegration:assemble
:org.eclipse.virgo.site:org.eclipse.virgo.kernel.springintegration:compileTestJava UP-TO-DATE
:org.eclipse.virgo.site:org.eclipse.virgo.kernel.springintegration:processTestResources UP-TO-DATE
:org.eclipse.virgo.site:org.eclipse.virgo.kernel.springintegration:testClasses UP-TO-DATE
:org.eclipse.virgo.site:org.eclipse.virgo.kernel.springintegration:test UP-TO-DATE
:org.eclipse.virgo.site:org.eclipse.virgo.kernel.springintegration:check UP-TO-DATE
:org.eclipse.virgo.site:org.eclipse.virgo.kernel.springintegration:build
:org.eclipse.virgo.site:org.eclipse.virgo.management:assemble
:org.eclipse.virgo.site:org.eclipse.virgo.management:compileTestJava UP-TO-DATE
:org.eclipse.virgo.site:org.eclipse.virgo.management:processTestResources UP-TO-DATE
:org.eclipse.virgo.site:org.eclipse.virgo.management:testClasses UP-TO-DATE
:org.eclipse.virgo.site:org.eclipse.virgo.management:test UP-TO-DATE
:org.eclipse.virgo.site:org.eclipse.virgo.management:check UP-TO-DATE
:org.eclipse.virgo.site:org.eclipse.virgo.management:build
:org.eclipse.virgo.site:org.eclipse.virgo.medic:assemble
:org.eclipse.virgo.site:org.eclipse.virgo.medic:compileTestJava UP-TO-DATE
:org.eclipse.virgo.site:org.eclipse.virgo.medic:processTestResources UP-TO-DATE
:org.eclipse.virgo.site:org.eclipse.virgo.medic:testClasses UP-TO-DATE
:org.eclipse.virgo.site:org.eclipse.virgo.medic:test UP-TO-DATE
:org.eclipse.virgo.site:org.eclipse.virgo.medic:check UP-TO-DATE
:org.eclipse.virgo.site:org.eclipse.virgo.medic:build
:org.eclipse.virgo.site:org.eclipse.virgo.nano.mbeans:assemble
:org.eclipse.virgo.site:org.eclipse.virgo.nano.mbeans:compileTestJava UP-TO-DATE
:org.eclipse.virgo.site:org.eclipse.virgo.nano.mbeans:processTestResources UP-TO-DATE
:org.eclipse.virgo.site:org.eclipse.virgo.nano.mbeans:testClasses UP-TO-DATE
:org.eclipse.virgo.site:org.eclipse.virgo.nano.mbeans:test UP-TO-DATE
:org.eclipse.virgo.site:org.eclipse.virgo.nano.mbeans:check UP-TO-DATE
:org.eclipse.virgo.site:org.eclipse.virgo.nano.mbeans:build
:org.eclipse.virgo.site:org.eclipse.virgo.shell:assemble
:org.eclipse.virgo.site:org.eclipse.virgo.shell:compileTestJava UP-TO-DATE
:org.eclipse.virgo.site:org.eclipse.virgo.shell:processTestResources UP-TO-DATE
:org.eclipse.virgo.site:org.eclipse.virgo.shell:testClasses UP-TO-DATE
:org.eclipse.virgo.site:org.eclipse.virgo.shell:test UP-TO-DATE
:org.eclipse.virgo.site:org.eclipse.virgo.shell:check UP-TO-DATE
:org.eclipse.virgo.site:org.eclipse.virgo.shell:build
:org.eclipse.virgo.site:org.eclipse.virgo.simpleconfigurator:assemble
:org.eclipse.virgo.site:org.eclipse.virgo.simpleconfigurator:compileTestJava UP-TO-DATE
:org.eclipse.virgo.site:org.eclipse.virgo.simpleconfigurator:processTestResources UP-TO-DATE
:org.eclipse.virgo.site:org.eclipse.virgo.simpleconfigurator:testClasses UP-TO-DATE
:org.eclipse.virgo.site:org.eclipse.virgo.simpleconfigurator:test UP-TO-DATE
:org.eclipse.virgo.site:org.eclipse.virgo.simpleconfigurator:check UP-TO-DATE
:org.eclipse.virgo.site:org.eclipse.virgo.simpleconfigurator:build
:org.eclipse.virgo.site:org.eclipse.virgo.springdm:assemble
:org.eclipse.virgo.site:org.eclipse.virgo.springdm:compileTestJava UP-TO-DATE
:org.eclipse.virgo.site:org.eclipse.virgo.springdm:processTestResources UP-TO-DATE
:org.eclipse.virgo.site:org.eclipse.virgo.springdm:testClasses UP-TO-DATE
:org.eclipse.virgo.site:org.eclipse.virgo.springdm:test UP-TO-DATE
:org.eclipse.virgo.site:org.eclipse.virgo.springdm:check UP-TO-DATE
:org.eclipse.virgo.site:org.eclipse.virgo.springdm:build
:repository:org.eclipse.virgo.repository:assemble
:repository:org.eclipse.virgo.repository:findbugsMain
FindBugs rule violations were found. See the report at: file:///jobs/genie.virgo/gradle-build-with-smoke-test/workspace/repository/org.eclipse.virgo.repository/build/reports/findbugs/main.xml
:repository:org.eclipse.virgo.repository:compileTestJava
:repository:org.eclipse.virgo.repository:processTestResources
:repository:org.eclipse.virgo.repository:testClasses
:repository:org.eclipse.virgo.repository:test
:repository:org.eclipse.virgo.repository:check
:repository:org.eclipse.virgo.repository:build
:test:org.eclipse.virgo.test.stubs:assemble
:test:org.eclipse.virgo.test.stubs:findbugsMain
:test:org.eclipse.virgo.test.stubs:compileTestAspect
:test:org.eclipse.virgo.test.stubs:compileTestJava
:test:org.eclipse.virgo.test.stubs:processTestResources
:test:org.eclipse.virgo.test.stubs:testClasses
:test:org.eclipse.virgo.test.stubs:test
:test:org.eclipse.virgo.test.stubs:check
:test:org.eclipse.virgo.test.stubs:build
:test:org.eclipse.virgo.test.tools:assemble
:test:org.eclipse.virgo.test.tools:findbugsMain
FindBugs rule violations were found. See the report at: file:///jobs/genie.virgo/gradle-build-with-smoke-test/workspace/test/org.eclipse.virgo.test.tools/build/reports/findbugs/main.xml
:test:org.eclipse.virgo.test.tools:compileTestJava UP-TO-DATE
:test:org.eclipse.virgo.test.tools:processTestResources UP-TO-DATE
:test:org.eclipse.virgo.test.tools:testClasses UP-TO-DATE
:test:org.eclipse.virgo.test.tools:test UP-TO-DATE
:test:org.eclipse.virgo.test.tools:check
:test:org.eclipse.virgo.test.tools:build
:util:org.eclipse.virgo.util.common:assemble
:util:org.eclipse.virgo.util.common:findbugsMain
:util:org.eclipse.virgo.util.common:compileTestJava
:util:org.eclipse.virgo.util.common:processTestResources UP-TO-DATE
:util:org.eclipse.virgo.util.common:testClasses
:util:org.eclipse.virgo.util.common:test
:util:org.eclipse.virgo.util.common:check
:util:org.eclipse.virgo.util.common:build
:util:org.eclipse.virgo.util.env:assemble
:util:org.eclipse.virgo.util.env:findbugsMain
:util:org.eclipse.virgo.util.env:compileTestJava
:util:org.eclipse.virgo.util.env:processTestResources UP-TO-DATE
:util:org.eclipse.virgo.util.env:testClasses
:util:org.eclipse.virgo.util.env:test
:util:org.eclipse.virgo.util.env:check
:util:org.eclipse.virgo.util.env:build
:util:org.eclipse.virgo.util.integrationtest:assemble
:util:org.eclipse.virgo.util.integrationtest:findbugsMain UP-TO-DATE
:util:org.eclipse.virgo.util.integrationtest:compileTestJavaincorrect classpath: /jobs/genie.virgo/gradle-build-with-smoke-test/workspace/util/org.eclipse.virgo.util.integrationtest/build/classes/main
incorrect classpath: /jobs/genie.virgo/gradle-build-with-smoke-test/workspace/util/org.eclipse.virgo.util.integrationtest/build/resources/main
----------
1. WARNING in /jobs/genie.virgo/gradle-build-with-smoke-test/workspace/util/org.eclipse.virgo.util.integrationtest/src/test/java/org/eclipse/virgo/util/test/UtilBundlesResolutionPaxExamTests.java (at line 111)
	Dictionary<String, String> headers = bundle.getHeaders();
	                                     ^^^^^^^^^^^^^^^^^^^
Type safety: The expression of type Dictionary needs unchecked conversion to conform to Dictionary<String,String>
----------
1 problem (1 warning)

:util:org.eclipse.virgo.util.integrationtest:processTestResources UP-TO-DATE
:util:org.eclipse.virgo.util.integrationtest:testClasses
:util:org.eclipse.virgo.util.integrationtest:test
:util:org.eclipse.virgo.util.integrationtest:check
:util:org.eclipse.virgo.util.integrationtest:build
:util:org.eclipse.virgo.util.io:assemble
:util:org.eclipse.virgo.util.io:findbugsMain
FindBugs rule violations were found. See the report at: file:///jobs/genie.virgo/gradle-build-with-smoke-test/workspace/util/org.eclipse.virgo.util.io/build/reports/findbugs/main.xml
:util:org.eclipse.virgo.util.io:compileTestJava
:util:org.eclipse.virgo.util.io:processTestResources
:util:org.eclipse.virgo.util.io:testClasses
:util:org.eclipse.virgo.util.io:test
:util:org.eclipse.virgo.util.io:check
:util:org.eclipse.virgo.util.io:build
:util:org.eclipse.virgo.util.jmx:assemble
:util:org.eclipse.virgo.util.jmx:findbugsMain
:util:org.eclipse.virgo.util.jmx:compileTestAspect
:util:org.eclipse.virgo.util.jmx:compileTestJava
:util:org.eclipse.virgo.util.jmx:processTestResources UP-TO-DATE
:util:org.eclipse.virgo.util.jmx:testClasses
:util:org.eclipse.virgo.util.jmx:test
:util:org.eclipse.virgo.util.jmx:check
:util:org.eclipse.virgo.util.jmx:build
:util:org.eclipse.virgo.util.math:assemble
:util:org.eclipse.virgo.util.math:findbugsMain
:util:org.eclipse.virgo.util.math:compileTestJava
:util:org.eclipse.virgo.util.math:processTestResources UP-TO-DATE
:util:org.eclipse.virgo.util.math:testClasses
:util:org.eclipse.virgo.util.math:test
:util:org.eclipse.virgo.util.math:check
:util:org.eclipse.virgo.util.math:build
:util:org.eclipse.virgo.util.osgi:assemble
:util:org.eclipse.virgo.util.osgi:findbugsMain
:util:org.eclipse.virgo.util.osgi:compileTestJava
:util:org.eclipse.virgo.util.osgi:processTestResources
:util:org.eclipse.virgo.util.osgi:testClasses
:util:org.eclipse.virgo.util.osgi:test
:util:org.eclipse.virgo.util.osgi:check
:util:org.eclipse.virgo.util.osgi:build
:util:org.eclipse.virgo.util.osgi.manifest:assemble
:util:org.eclipse.virgo.util.osgi.manifest:findbugsMain
:util:org.eclipse.virgo.util.osgi.manifest:compileTestJava
:util:org.eclipse.virgo.util.osgi.manifest:processTestResources
:util:org.eclipse.virgo.util.osgi.manifest:testClasses
:util:org.eclipse.virgo.util.osgi.manifest:test
:util:org.eclipse.virgo.util.osgi.manifest:check
:util:org.eclipse.virgo.util.osgi.manifest:build
:util:org.eclipse.virgo.util.parser.launcher:assemble
:util:org.eclipse.virgo.util.parser.launcher:findbugsMain
:util:org.eclipse.virgo.util.parser.launcher:compileTestJava
:util:org.eclipse.virgo.util.parser.launcher:processTestResources
:util:org.eclipse.virgo.util.parser.launcher:testClasses
:util:org.eclipse.virgo.util.parser.launcher:test
:util:org.eclipse.virgo.util.parser.launcher:check
:util:org.eclipse.virgo.util.parser.launcher:build
:util:org.eclipse.virgo.util.parser.manifest:assemble
:util:org.eclipse.virgo.util.parser.manifest:findbugsMain
:util:org.eclipse.virgo.util.parser.manifest:compileTestJava
:util:org.eclipse.virgo.util.parser.manifest:processTestResources
:util:org.eclipse.virgo.util.parser.manifest:testClasses
:util:org.eclipse.virgo.util.parser.manifest:test
:util:org.eclipse.virgo.util.parser.manifest:check
:util:org.eclipse.virgo.util.parser.manifest:build
:web:org.eclipse.virgo.web.core:assemble
:web:org.eclipse.virgo.web.core:findbugsMain
:web:org.eclipse.virgo.web.core:compileTestJava
:web:org.eclipse.virgo.web.core:processTestResources UP-TO-DATE
:web:org.eclipse.virgo.web.core:testClasses
:web:org.eclipse.virgo.web.core:test
:web:org.eclipse.virgo.web.core:check
:web:org.eclipse.virgo.web.core:build
:web:org.eclipse.virgo.web.dm:assemble
:web:org.eclipse.virgo.web.dm:findbugsMain
:web:org.eclipse.virgo.web.dm:compileTestJavaincorrect classpath: /jobs/genie.virgo/gradle-build-with-smoke-test/workspace/web/org.eclipse.virgo.web.dm/build/resources/main

:web:org.eclipse.virgo.web.dm:processTestResources UP-TO-DATE
:web:org.eclipse.virgo.web.dm:testClasses
:web:org.eclipse.virgo.web.dm:test
:web:org.eclipse.virgo.web.dm:check
:web:org.eclipse.virgo.web.dm:build
:web:org.eclipse.virgo.web.enterprise.appdeployer:assemble
:web:org.eclipse.virgo.web.enterprise.appdeployer:findbugsMain
FindBugs rule violations were found. See the report at: file:///jobs/genie.virgo/gradle-build-with-smoke-test/workspace/web/org.eclipse.virgo.web.enterprise.appdeployer/build/reports/findbugs/main.xml
:web:org.eclipse.virgo.web.enterprise.appdeployer:compileTestJava UP-TO-DATE
:web:org.eclipse.virgo.web.enterprise.appdeployer:processTestResources UP-TO-DATE
:web:org.eclipse.virgo.web.enterprise.appdeployer:testClasses UP-TO-DATE
:web:org.eclipse.virgo.web.enterprise.appdeployer:test UP-TO-DATE
:web:org.eclipse.virgo.web.enterprise.appdeployer:check
:web:org.eclipse.virgo.web.enterprise.appdeployer:build
:web:org.eclipse.virgo.web.enterprise.applistener:assemble
:web:org.eclipse.virgo.web.enterprise.applistener:findbugsMain
:web:org.eclipse.virgo.web.enterprise.applistener:compileTestJava UP-TO-DATE
:web:org.eclipse.virgo.web.enterprise.applistener:processTestResources UP-TO-DATE
:web:org.eclipse.virgo.web.enterprise.applistener:testClasses UP-TO-DATE
:web:org.eclipse.virgo.web.enterprise.applistener:test UP-TO-DATE
:web:org.eclipse.virgo.web.enterprise.applistener:check
:web:org.eclipse.virgo.web.enterprise.applistener:build
:web:org.eclipse.virgo.web.enterprise.catalina.fragment.webbeans:assemble
:web:org.eclipse.virgo.web.enterprise.catalina.fragment.webbeans:findbugsMain UP-TO-DATE
:web:org.eclipse.virgo.web.enterprise.catalina.fragment.webbeans:compileTestJava UP-TO-DATE
:web:org.eclipse.virgo.web.enterprise.catalina.fragment.webbeans:processTestResources UP-TO-DATE
:web:org.eclipse.virgo.web.enterprise.catalina.fragment.webbeans:testClasses UP-TO-DATE
:web:org.eclipse.virgo.web.enterprise.catalina.fragment.webbeans:test UP-TO-DATE
:web:org.eclipse.virgo.web.enterprise.catalina.fragment.webbeans:check UP-TO-DATE
:web:org.eclipse.virgo.web.enterprise.catalina.fragment.webbeans:build
:web:org.eclipse.virgo.web.enterprise.javax.persistence.extension:assemble
:web:org.eclipse.virgo.web.enterprise.javax.persistence.extension:findbugsMain
FindBugs rule violations were found. See the report at: file:///jobs/genie.virgo/gradle-build-with-smoke-test/workspace/web/org.eclipse.virgo.web.enterprise.javax.persistence.extension/build/reports/findbugs/main.xml
:web:org.eclipse.virgo.web.enterprise.javax.persistence.extension:compileTestJava----------
1. WARNING in /jobs/genie.virgo/gradle-build-with-smoke-test/workspace/web/org.eclipse.virgo.web.enterprise.javax.persistence.extension/src/test/java/org/eclipse/virgo/web/enterprise/javax/persistence/extension/TestPersistenceProvider.java (at line 25)
	PersistenceUnitInfo arg0, Map arg1) {
	                          ^^^
Map is a raw type. References to generic type Map<K,V> should be parameterized
----------
2. WARNING in /jobs/genie.virgo/gradle-build-with-smoke-test/workspace/web/org.eclipse.virgo.web.enterprise.javax.persistence.extension/src/test/java/org/eclipse/virgo/web/enterprise/javax/persistence/extension/TestPersistenceProvider.java (at line 30)
	public EntityManagerFactory createEntityManagerFactory(String arg0, Map arg1) {
	                                                                    ^^^
Map is a raw type. References to generic type Map<K,V> should be parameterized
----------
2 problems (2 warnings)

:web:org.eclipse.virgo.web.enterprise.javax.persistence.extension:processTestResources UP-TO-DATE
:web:org.eclipse.virgo.web.enterprise.javax.persistence.extension:testClasses
:web:org.eclipse.virgo.web.enterprise.javax.persistence.extension:test
:web:org.eclipse.virgo.web.enterprise.javax.persistence.extension:check
:web:org.eclipse.virgo.web.enterprise.javax.persistence.extension:build
:web:org.eclipse.virgo.web.enterprise.javax.persistence.provider.initializer:assemble
:web:org.eclipse.virgo.web.enterprise.javax.persistence.provider.initializer:findbugsMain
:web:org.eclipse.virgo.web.enterprise.javax.persistence.provider.initializer:compileTestJava
:web:org.eclipse.virgo.web.enterprise.javax.persistence.provider.initializer:processTestResources UP-TO-DATE
:web:org.eclipse.virgo.web.enterprise.javax.persistence.provider.initializer:testClasses
:web:org.eclipse.virgo.web.enterprise.javax.persistence.provider.initializer:test
:web:org.eclipse.virgo.web.enterprise.javax.persistence.provider.initializer:check
:web:org.eclipse.virgo.web.enterprise.javax.persistence.provider.initializer:build
:web:org.eclipse.virgo.web.enterprise.jsf.support:assemble
:web:org.eclipse.virgo.web.enterprise.jsf.support:findbugsMain
:web:org.eclipse.virgo.web.enterprise.jsf.support:compileTestJava UP-TO-DATE
:web:org.eclipse.virgo.web.enterprise.jsf.support:processTestResources UP-TO-DATE
:web:org.eclipse.virgo.web.enterprise.jsf.support:testClasses UP-TO-DATE
:web:org.eclipse.virgo.web.enterprise.jsf.support:test UP-TO-DATE
:web:org.eclipse.virgo.web.enterprise.jsf.support:check
:web:org.eclipse.virgo.web.enterprise.jsf.support:build
:web:org.eclipse.virgo.web.enterprise.openejb.fragment.bval:assemble
:web:org.eclipse.virgo.web.enterprise.openejb.fragment.bval:findbugsMain UP-TO-DATE
:web:org.eclipse.virgo.web.enterprise.openejb.fragment.bval:compileTestJava UP-TO-DATE
:web:org.eclipse.virgo.web.enterprise.openejb.fragment.bval:processTestResources UP-TO-DATE
:web:org.eclipse.virgo.web.enterprise.openejb.fragment.bval:testClasses UP-TO-DATE
:web:org.eclipse.virgo.web.enterprise.openejb.fragment.bval:test UP-TO-DATE
:web:org.eclipse.virgo.web.enterprise.openejb.fragment.bval:check UP-TO-DATE
:web:org.eclipse.virgo.web.enterprise.openejb.fragment.bval:build
:web:org.eclipse.virgo.web.enterprise.openejb.fragment.jotm:assemble
:web:org.eclipse.virgo.web.enterprise.openejb.fragment.jotm:findbugsMain
:web:org.eclipse.virgo.web.enterprise.openejb.fragment.jotm:compileTestJava UP-TO-DATE
:web:org.eclipse.virgo.web.enterprise.openejb.fragment.jotm:processTestResources UP-TO-DATE
:web:org.eclipse.virgo.web.enterprise.openejb.fragment.jotm:testClasses UP-TO-DATE
:web:org.eclipse.virgo.web.enterprise.openejb.fragment.jotm:test UP-TO-DATE
:web:org.eclipse.virgo.web.enterprise.openejb.fragment.jotm:check
:web:org.eclipse.virgo.web.enterprise.openejb.fragment.jotm:build
:web:org.eclipse.virgo.web.enterprise.openejb.fragment.jpa:assemble
:web:org.eclipse.virgo.web.enterprise.openejb.fragment.jpa:findbugsMain UP-TO-DATE
:web:org.eclipse.virgo.web.enterprise.openejb.fragment.jpa:compileTestJava UP-TO-DATE
:web:org.eclipse.virgo.web.enterprise.openejb.fragment.jpa:processTestResources UP-TO-DATE
:web:org.eclipse.virgo.web.enterprise.openejb.fragment.jpa:testClasses UP-TO-DATE
:web:org.eclipse.virgo.web.enterprise.openejb.fragment.jpa:test UP-TO-DATE
:web:org.eclipse.virgo.web.enterprise.openejb.fragment.jpa:check UP-TO-DATE
:web:org.eclipse.virgo.web.enterprise.openejb.fragment.jpa:build
:web:org.eclipse.virgo.web.enterprise.openejb.fragment.webbeans:assemble
:web:org.eclipse.virgo.web.enterprise.openejb.fragment.webbeans:findbugsMain UP-TO-DATE
:web:org.eclipse.virgo.web.enterprise.openejb.fragment.webbeans:compileTestJava UP-TO-DATE
:web:org.eclipse.virgo.web.enterprise.openejb.fragment.webbeans:processTestResources UP-TO-DATE
:web:org.eclipse.virgo.web.enterprise.openejb.fragment.webbeans:testClasses UP-TO-DATE
:web:org.eclipse.virgo.web.enterprise.openejb.fragment.webbeans:test UP-TO-DATE
:web:org.eclipse.virgo.web.enterprise.openejb.fragment.webbeans:check UP-TO-DATE
:web:org.eclipse.virgo.web.enterprise.openejb.fragment.webbeans:build
:web:org.eclipse.virgo.web.enterprise.openejb.initialiser:assemble
:web:org.eclipse.virgo.web.enterprise.openejb.initialiser:findbugsMain
:web:org.eclipse.virgo.web.enterprise.openejb.initialiser:compileTestJava UP-TO-DATE
:web:org.eclipse.virgo.web.enterprise.openejb.initialiser:processTestResources UP-TO-DATE
:web:org.eclipse.virgo.web.enterprise.openejb.initialiser:testClasses UP-TO-DATE
:web:org.eclipse.virgo.web.enterprise.openejb.initialiser:test UP-TO-DATE
:web:org.eclipse.virgo.web.enterprise.openejb.initialiser:check
:web:org.eclipse.virgo.web.enterprise.openejb.initialiser:build
:web:org.eclipse.virgo.web.enterprise.openejb.jpa.integration:assemble
:web:org.eclipse.virgo.web.enterprise.openejb.jpa.integration:findbugsMain
FindBugs rule violations were found. See the report at: file:///jobs/genie.virgo/gradle-build-with-smoke-test/workspace/web/org.eclipse.virgo.web.enterprise.openejb.jpa.integration/build/reports/findbugs/main.xml
:web:org.eclipse.virgo.web.enterprise.openejb.jpa.integration:compileTestJava UP-TO-DATE
:web:org.eclipse.virgo.web.enterprise.openejb.jpa.integration:processTestResources UP-TO-DATE
:web:org.eclipse.virgo.web.enterprise.openejb.jpa.integration:testClasses UP-TO-DATE
:web:org.eclipse.virgo.web.enterprise.openejb.jpa.integration:test UP-TO-DATE
:web:org.eclipse.virgo.web.enterprise.openejb.jpa.integration:check
:web:org.eclipse.virgo.web.enterprise.openejb.jpa.integration:build
:web:org.eclipse.virgo.web.enterprise.openejb.tomcat.factory:assemble
:web:org.eclipse.virgo.web.enterprise.openejb.tomcat.factory:findbugsMain
:web:org.eclipse.virgo.web.enterprise.openejb.tomcat.factory:compileTestJava
:web:org.eclipse.virgo.web.enterprise.openejb.tomcat.factory:processTestResources UP-TO-DATE
:web:org.eclipse.virgo.web.enterprise.openejb.tomcat.factory:testClasses
:web:org.eclipse.virgo.web.enterprise.openejb.tomcat.factory:test
:web:org.eclipse.virgo.web.enterprise.openejb.tomcat.factory:check
:web:org.eclipse.virgo.web.enterprise.openejb.tomcat.factory:build
:web:org.eclipse.virgo.web.enterprise.openwebbeans.initialiser:assemble
:web:org.eclipse.virgo.web.enterprise.openwebbeans.initialiser:findbugsMain
:web:org.eclipse.virgo.web.enterprise.openwebbeans.initialiser:compileTestJava UP-TO-DATE
:web:org.eclipse.virgo.web.enterprise.openwebbeans.initialiser:processTestResources UP-TO-DATE
:web:org.eclipse.virgo.web.enterprise.openwebbeans.initialiser:testClasses UP-TO-DATE
:web:org.eclipse.virgo.web.enterprise.openwebbeans.initialiser:test UP-TO-DATE
:web:org.eclipse.virgo.web.enterprise.openwebbeans.initialiser:check
:web:org.eclipse.virgo.web.enterprise.openwebbeans.initialiser:build
:web:org.eclipse.virgo.web.enterprise.persistence.openejb.classloading.hook:assemble
:web:org.eclipse.virgo.web.enterprise.persistence.openejb.classloading.hook:findbugsMain
:web:org.eclipse.virgo.web.enterprise.persistence.openejb.classloading.hook:compileTestJava
:web:org.eclipse.virgo.web.enterprise.persistence.openejb.classloading.hook:processTestResources UP-TO-DATE
:web:org.eclipse.virgo.web.enterprise.persistence.openejb.classloading.hook:testClasses
:web:org.eclipse.virgo.web.enterprise.persistence.openejb.classloading.hook:test
:web:org.eclipse.virgo.web.enterprise.persistence.openejb.classloading.hook:check
:web:org.eclipse.virgo.web.enterprise.persistence.openejb.classloading.hook:build
:web:org.eclipse.virgo.web.enterprise.security:assemble
:web:org.eclipse.virgo.web.enterprise.security:findbugsMain
:web:org.eclipse.virgo.web.enterprise.security:compileTestJava----------
1. WARNING in /jobs/genie.virgo/gradle-build-with-smoke-test/workspace/web/org.eclipse.virgo.web.enterprise.security/src/test/java/org/eclipse/virgo/web/enterprise/security/StandardSecurityServiceTest.java (at line 193)
	ThreadLocal<Wrapper> wrapperLocal = (ThreadLocal<Wrapper>) wrapper; 
	                                    ^^^^^^^^^^^^^^^^^^^^^^^^^^^^^^
Type safety: Unchecked cast from Object to ThreadLocal<Wrapper>
----------
1 problem (1 warning)

:web:org.eclipse.virgo.web.enterprise.security:processTestResources UP-TO-DATE
:web:org.eclipse.virgo.web.enterprise.security:testClasses
:web:org.eclipse.virgo.web.enterprise.security:test
:web:org.eclipse.virgo.web.enterprise.security:check
:web:org.eclipse.virgo.web.enterprise.security:build
:web:org.eclipse.virgo.web.enterprise.security.openejb.classloading.hook:assemble
:web:org.eclipse.virgo.web.enterprise.security.openejb.classloading.hook:findbugsMain
:web:org.eclipse.virgo.web.enterprise.security.openejb.classloading.hook:compileTestJava UP-TO-DATE
:web:org.eclipse.virgo.web.enterprise.security.openejb.classloading.hook:processTestResources UP-TO-DATE
:web:org.eclipse.virgo.web.enterprise.security.openejb.classloading.hook:testClasses UP-TO-DATE
:web:org.eclipse.virgo.web.enterprise.security.openejb.classloading.hook:test UP-TO-DATE
:web:org.eclipse.virgo.web.enterprise.security.openejb.classloading.hook:check
:web:org.eclipse.virgo.web.enterprise.security.openejb.classloading.hook:build
:web:org.eclipse.virgo.web.enterprise.security.valve:assemble
:web:org.eclipse.virgo.web.enterprise.security.valve:findbugsMain
:web:org.eclipse.virgo.web.enterprise.security.valve:compileTestJava UP-TO-DATE
:web:org.eclipse.virgo.web.enterprise.security.valve:processTestResources UP-TO-DATE
:web:org.eclipse.virgo.web.enterprise.security.valve:testClasses UP-TO-DATE
:web:org.eclipse.virgo.web.enterprise.security.valve:test UP-TO-DATE
:web:org.eclipse.virgo.web.enterprise.security.valve:check
:web:org.eclipse.virgo.web.enterprise.security.valve:build
:web:org.eclipse.virgo.web.enterprise.services.accessor:assemble
:web:org.eclipse.virgo.web.enterprise.services.accessor:findbugsMain
:web:org.eclipse.virgo.web.enterprise.services.accessor:compileTestJava----------
1. WARNING in /jobs/genie.virgo/gradle-build-with-smoke-test/workspace/web/org.eclipse.virgo.web.enterprise.services.accessor/src/test/java/org/eclipse/virgo/web/enterprise/services/accessor/WebAppBundleClassloaderCustomizerTest.java (at line 94)
	assertTrue(((List<ClassLoaderDelegateHook>) field.get(PluggableDelegatingClassLoaderDelegateHook.getInstance())).contains(webAppBundleClassloaderCustomizer.getWebAppBundleClassLoaderDelegateHook()));
	           ^^^^^^^^^^^^^^^^^^^^^^^^^^^^^^^^^^^^^^^^^^^^^^^^^^^^^^^^^^^^^^^^^^^^^^^^^^^^^^^^^^^^^^^^^^^^^^^^^^^^^
Type safety: Unchecked cast from Object to List<ClassLoaderDelegateHook>
----------
2. WARNING in /jobs/genie.virgo/gradle-build-with-smoke-test/workspace/web/org.eclipse.virgo.web.enterprise.services.accessor/src/test/java/org/eclipse/virgo/web/enterprise/services/accessor/WebAppBundleClassloaderCustomizerTest.java (at line 98)
	assertTrue(((Map<Bundle, Set<String>>) field2.get(webAppBundleClassloaderCustomizer.getWebAppBundleClassLoaderDelegateHook())).containsKey(webBundle));
	           ^^^^^^^^^^^^^^^^^^^^^^^^^^^^^^^^^^^^^^^^^^^^^^^^^^^^^^^^^^^^^^^^^^^^^^^^^^^^^^^^^^^^^^^^^^^^^^^^^^^^^^^^^^^^^^^^^^^
Type safety: Unchecked cast from Object to Map<Bundle,Set<String>>
----------
3. WARNING in /jobs/genie.virgo/gradle-build-with-smoke-test/workspace/web/org.eclipse.virgo.web.enterprise.services.accessor/src/test/java/org/eclipse/virgo/web/enterprise/services/accessor/WebAppBundleClassloaderCustomizerTest.java (at line 104)
	assertTrue(((List<ClassLoaderDelegateHook>) field.get(PluggableDelegatingClassLoaderDelegateHook.getInstance())).isEmpty());
	           ^^^^^^^^^^^^^^^^^^^^^^^^^^^^^^^^^^^^^^^^^^^^^^^^^^^^^^^^^^^^^^^^^^^^^^^^^^^^^^^^^^^^^^^^^^^^^^^^^^^^^
Type safety: Unchecked cast from Object to List<ClassLoaderDelegateHook>
----------
3 problems (3 warnings)

:web:org.eclipse.virgo.web.enterprise.services.accessor:processTestResources UP-TO-DATE
:web:org.eclipse.virgo.web.enterprise.services.accessor:testClasses
:web:org.eclipse.virgo.web.enterprise.services.accessor:test
:web:org.eclipse.virgo.web.enterprise.services.accessor:check
:web:org.eclipse.virgo.web.enterprise.services.accessor:build
:web:org.eclipse.virgo.web.servlet.adapter:assemble
:web:org.eclipse.virgo.web.servlet.adapter:findbugsMain UP-TO-DATE
:web:org.eclipse.virgo.web.servlet.adapter:compileTestJava UP-TO-DATE
:web:org.eclipse.virgo.web.servlet.adapter:processTestResources UP-TO-DATE
:web:org.eclipse.virgo.web.servlet.adapter:testClasses UP-TO-DATE
:web:org.eclipse.virgo.web.servlet.adapter:test UP-TO-DATE
:web:org.eclipse.virgo.web.servlet.adapter:check UP-TO-DATE
:web:org.eclipse.virgo.web.servlet.adapter:build
:web:org.eclipse.virgo.web.spring.integration:assemble
:web:org.eclipse.virgo.web.spring.integration:findbugsMain UP-TO-DATE
:web:org.eclipse.virgo.web.spring.integration:compileTestJava UP-TO-DATE
:web:org.eclipse.virgo.web.spring.integration:processTestResources UP-TO-DATE
:web:org.eclipse.virgo.web.spring.integration:testClasses UP-TO-DATE
:web:org.eclipse.virgo.web.spring.integration:test UP-TO-DATE
:web:org.eclipse.virgo.web.spring.integration:check UP-TO-DATE
:web:org.eclipse.virgo.web.spring.integration:build
:web:org.eclipse.virgo.web.tomcat.support:assemble
:web:org.eclipse.virgo.web.tomcat.support:findbugsMain
:web:org.eclipse.virgo.web.tomcat.support:compileTestJava UP-TO-DATE
:web:org.eclipse.virgo.web.tomcat.support:processTestResources UP-TO-DATE
:web:org.eclipse.virgo.web.tomcat.support:testClasses UP-TO-DATE
:web:org.eclipse.virgo.web.tomcat.support:test UP-TO-DATE
:web:org.eclipse.virgo.web.tomcat.support:check
:web:org.eclipse.virgo.web.tomcat.support:build
:web:org.eclipse.virgo.web.war.deployer:assemble
:web:org.eclipse.virgo.web.war.deployer:findbugsMain
FindBugs rule violations were found. See the report at: file:///jobs/genie.virgo/gradle-build-with-smoke-test/workspace/web/org.eclipse.virgo.web.war.deployer/build/reports/findbugs/main.xml
:web:org.eclipse.virgo.web.war.deployer:compileTestJava
:web:org.eclipse.virgo.web.war.deployer:processTestResources
:web:org.eclipse.virgo.web.war.deployer:testClasses
:web:org.eclipse.virgo.web.war.deployer:test
:web:org.eclipse.virgo.web.war.deployer:check
:web:org.eclipse.virgo.web.war.deployer:build
:packaging:jetty-server:org.eclipse.virgo.jetty.sample.tags:war
:packaging:jetty-server:org.eclipse.virgo.jetty.sample.tags:assemble
:packaging:jetty-server:org.eclipse.virgo.jetty.sample.tags:findbugsMain
:packaging:jetty-server:org.eclipse.virgo.jetty.sample.tags:compileTestJava UP-TO-DATE
:packaging:jetty-server:org.eclipse.virgo.jetty.sample.tags:processTestResources UP-TO-DATE
:packaging:jetty-server:org.eclipse.virgo.jetty.sample.tags:testClasses UP-TO-DATE
:packaging:jetty-server:org.eclipse.virgo.jetty.sample.tags:test UP-TO-DATE
:packaging:jetty-server:org.eclipse.virgo.jetty.sample.tags:check
:packaging:jetty-server:org.eclipse.virgo.jetty.sample.tags:build
:packaging:jetty-server:org.eclipse.virgo.jetty.smoketest:assemble
:packaging:jetty-server:org.eclipse.virgo.jetty.smoketest:findbugsMain UP-TO-DATE
:packaging:jetty-server:org.eclipse.virgo.jetty.smoketest:compileTestJava UP-TO-DATE
:packaging:jetty-server:org.eclipse.virgo.jetty.smoketest:processTestResources UP-TO-DATE
:packaging:jetty-server:org.eclipse.virgo.jetty.smoketest:testClasses UP-TO-DATE
:packaging:jetty-server:org.eclipse.virgo.jetty.smoketest:test UP-TO-DATE
:packaging:jetty-server:org.eclipse.virgo.jetty.smoketest:check UP-TO-DATE
:packaging:jetty-server:org.eclipse.virgo.jetty.smoketest:build
:packaging:kernel:org.eclipse.virgo.kernel.smoketest:assemble
:packaging:kernel:org.eclipse.virgo.kernel.smoketest:findbugsMain UP-TO-DATE
:packaging:kernel:org.eclipse.virgo.kernel.smoketest:compileTestJava UP-TO-DATE
:packaging:kernel:org.eclipse.virgo.kernel.smoketest:processTestResources UP-TO-DATE
:packaging:kernel:org.eclipse.virgo.kernel.smoketest:testClasses UP-TO-DATE
:packaging:kernel:org.eclipse.virgo.kernel.smoketest:test UP-TO-DATE
:packaging:kernel:org.eclipse.virgo.kernel.smoketest:check UP-TO-DATE
:packaging:kernel:org.eclipse.virgo.kernel.smoketest:build
:packaging:nano:org.eclipse.virgo.nano.smoketest:assemble
:packaging:nano:org.eclipse.virgo.nano.smoketest:findbugsMain UP-TO-DATE
:packaging:nano:org.eclipse.virgo.nano.smoketest:compileTestJava UP-TO-DATE
:packaging:nano:org.eclipse.virgo.nano.smoketest:processTestResources UP-TO-DATE
:packaging:nano:org.eclipse.virgo.nano.smoketest:testClasses UP-TO-DATE
:packaging:nano:org.eclipse.virgo.nano.smoketest:test UP-TO-DATE
:packaging:nano:org.eclipse.virgo.nano.smoketest:check UP-TO-DATE
:packaging:nano:org.eclipse.virgo.nano.smoketest:build
:packaging:tomcat-server:org.eclipse.virgo.tomcat.smoketest:assemble
:packaging:tomcat-server:org.eclipse.virgo.tomcat.smoketest:findbugsMain UP-TO-DATE
:packaging:tomcat-server:org.eclipse.virgo.tomcat.smoketest:compileTestJava UP-TO-DATE
:packaging:tomcat-server:org.eclipse.virgo.tomcat.smoketest:processTestResources UP-TO-DATE
:packaging:tomcat-server:org.eclipse.virgo.tomcat.smoketest:testClasses UP-TO-DATE
:packaging:tomcat-server:org.eclipse.virgo.tomcat.smoketest:test UP-TO-DATE
:packaging:tomcat-server:org.eclipse.virgo.tomcat.smoketest:check UP-TO-DATE
:packaging:tomcat-server:org.eclipse.virgo.tomcat.smoketest:build
:packaging:jetty-server:assemble UP-TO-DATE
:packaging:kernel:assemble UP-TO-DATE
:packaging:nano:assemble UP-TO-DATE
:packaging:tomcat-server:assemble UP-TO-DATE
:packaging:jetty-server:packageResourcesAndProducts
Copy the lib artifacts:
org.eclipse.virgo.kernel.equinox.extensions-3.7.0.D-20150612092801.jar
org.eclipse.virgo.nano.authentication-3.7.0.D-20150612092801.jar
org.eclipse.virgo.nano.shutdown-3.7.0.D-20150612092801.jar
org.eclipse.virgo.util.env-3.7.0.D-20150612092801.jar
org.eclipse.equinox.launcher-1.3.0.v20120308-1358.jar
to '/jobs/genie.virgo/gradle-build-with-smoke-test/workspace/packaging/jetty-server/build/common_resources/lib'.
Copy the libPersistence artifacts:
org.eclipse.virgo.web.enterprise.openejb.jpa.integration-3.7.0.D-20150612092801.jar
to '/jobs/genie.virgo/gradle-build-with-smoke-test/workspace/packaging/jetty-server/build/common_resources/lib/persistence'.
Copy the libEndorsed artifacts:
javax.annotation-1.1.0.v201108011116.jar
javax.transaction-1.1.1.v201105210645.jar
to '/jobs/genie.virgo/gradle-build-with-smoke-test/workspace/packaging/jetty-server/build/common_resources/lib/endorsed'.
Copy the pluginsExtras artifacts:
org.eclipse.virgo.kernel.userregion-3.7.0.D-20150612092801.jar
to '/jobs/genie.virgo/gradle-build-with-smoke-test/workspace/packaging/jetty-server/build/common_resources/plugins'.
Copy the repositoryExt artifacts:
org.eclipse.osgi.services-3.3.0.v20120307-2102.jar
osgi.enterprise-4.2.0.v201108120515.jar
org.eclipse.equinox.ds-1.4.0.v20120112-1400.jar
org.eclipse.equinox.util-1.0.300.v20111010-1614.jar
org.eclipse.equinox.region-1.1.0.v20120319-1602.jar
com.springsource.org.aopalliance-1.0.0.jar
org.springframework.aop-3.2.10.RELEASE.jar
org.springframework.beans-3.2.10.RELEASE.jar
org.springframework.context-3.2.10.RELEASE.jar
org.springframework.core-3.2.10.RELEASE.jar
org.springframework.expression-3.2.10.RELEASE.jar
org.eclipse.gemini.blueprint.core-2.0.0.M02.jar
org.eclipse.gemini.blueprint.extender-2.0.0.M02.jar
org.eclipse.gemini.blueprint.io-2.0.0.M02.jar
org.eclipse.gemini.management-1.0.5.RELEASE.jar
org.eclipse.virgo.management.fragment-3.7.0.D-20150612092801.jar
org.eclipse.virgo.kernel.agent.dm-3.7.0.D-20150612092801.jar
org.eclipse.virgo.kernel.deployer.dm-3.7.0.D-20150612092801.jar
org.eclipse.virgo.kernel.dmfragment-3.7.0.D-20150612092801.jar
com.springsource.org.apache.commons.fileupload-1.2.0.v20110525.jar
com.springsource.org.apache.commons.io-1.4.0.jar
org.jolokia.osgi-1.0.2.jar
org.eclipse.virgo.medic-3.7.0.D-20150612092801.jar
org.eclipse.virgo.medic.core-3.7.0.D-20150612092801.jar
org.eclipse.virgo.web.dm-3.7.0.D-20150612092801.jar
javax.jms-1.1.0.v201205091237.jar
org.springframework.aspects-3.2.10.RELEASE.jar
org.springframework.context.support-3.2.10.RELEASE.jar
org.springframework.jdbc-3.2.10.RELEASE.jar
org.springframework.jms-3.2.10.RELEASE.jar
org.springframework.orm-3.2.10.RELEASE.jar
org.springframework.oxm-3.2.10.RELEASE.jar
org.springframework.transaction-3.2.10.RELEASE.jar
org.springframework.web-3.2.10.RELEASE.jar
org.springframework.web.servlet-3.2.10.RELEASE.jar
org.springframework.web.portlet-3.2.10.RELEASE.jar
com.springsource.org.aspectj.weaver-1.6.12.RELEASE.jar
com.springsource.javax.portlet-2.0.0.v20110525.jar
com.springsource.javax.servlet.jsp.jstl-1.2.0.v20110728.jar
org.eclipse.virgo.web.servlet.adapter-3.7.0.D-20150612092801.jar
to '/jobs/genie.virgo/gradle-build-with-smoke-test/workspace/packaging/jetty-server/build/common_resources/repository/ext'.
Copy the pickup artifacts:
org.eclipse.virgo.management.console-3.7.0.D-20150612092801.jar
org.eclipse.virgo.apps.splash-3.7.0.D-20150612092801.jar
to '/jobs/genie.virgo/gradle-build-with-smoke-test/workspace/packaging/jetty-server/build/common_resources/pickup'.
:packaging:kernel:packageResourcesAndProducts
Copy the lib artifacts:
org.eclipse.virgo.kernel.equinox.extensions-3.7.0.D-20150612092801.jar
org.eclipse.virgo.nano.authentication-3.7.0.D-20150612092801.jar
org.eclipse.virgo.nano.shutdown-3.7.0.D-20150612092801.jar
org.eclipse.virgo.util.env-3.7.0.D-20150612092801.jar
org.eclipse.equinox.launcher-1.3.0.v20120308-1358.jar
to '/jobs/genie.virgo/gradle-build-with-smoke-test/workspace/packaging/kernel/build/common_resources/lib'.
Copy the libPersistence artifacts:
org.eclipse.virgo.web.enterprise.openejb.jpa.integration-3.7.0.D-20150612092801.jar
to '/jobs/genie.virgo/gradle-build-with-smoke-test/workspace/packaging/kernel/build/common_resources/lib/persistence'.
Copy the libEndorsed artifacts:
javax.annotation-1.1.0.v201108011116.jar
javax.transaction-1.1.1.v201105210645.jar
to '/jobs/genie.virgo/gradle-build-with-smoke-test/workspace/packaging/kernel/build/common_resources/lib/endorsed'.
Copy the pluginsExtras artifacts:
org.eclipse.virgo.kernel.userregion-3.7.0.D-20150612092801.jar
to '/jobs/genie.virgo/gradle-build-with-smoke-test/workspace/packaging/kernel/build/common_resources/plugins'.
Copy the repositoryExt artifacts:
org.eclipse.osgi.services-3.3.0.v20120307-2102.jar
osgi.enterprise-4.2.0.v201108120515.jar
org.eclipse.equinox.ds-1.4.0.v20120112-1400.jar
org.eclipse.equinox.util-1.0.300.v20111010-1614.jar
org.eclipse.equinox.region-1.1.0.v20120319-1602.jar
com.springsource.org.aopalliance-1.0.0.jar
org.springframework.aop-3.2.10.RELEASE.jar
org.springframework.beans-3.2.10.RELEASE.jar
org.springframework.context-3.2.10.RELEASE.jar
org.springframework.core-3.2.10.RELEASE.jar
org.springframework.expression-3.2.10.RELEASE.jar
org.eclipse.gemini.blueprint.core-2.0.0.M02.jar
org.eclipse.gemini.blueprint.extender-2.0.0.M02.jar
org.eclipse.gemini.blueprint.io-2.0.0.M02.jar
org.eclipse.gemini.management-1.0.5.RELEASE.jar
org.eclipse.virgo.management.fragment-3.7.0.D-20150612092801.jar
org.eclipse.virgo.kernel.agent.dm-3.7.0.D-20150612092801.jar
org.eclipse.virgo.kernel.deployer.dm-3.7.0.D-20150612092801.jar
org.eclipse.virgo.kernel.dmfragment-3.7.0.D-20150612092801.jar
com.springsource.org.apache.commons.fileupload-1.2.0.v20110525.jar
com.springsource.org.apache.commons.io-1.4.0.jar
org.jolokia.osgi-1.0.2.jar
to '/jobs/genie.virgo/gradle-build-with-smoke-test/workspace/packaging/kernel/build/common_resources/repository/ext'.
Copy the pickup artifacts:
org.eclipse.virgo.management.console-3.7.0.D-20150612092801.jar
to '/jobs/genie.virgo/gradle-build-with-smoke-test/workspace/packaging/kernel/build/common_resources/pickup'.
:packaging:nano:generateP2Inf
:packaging:nano:packageResourcesAndProducts
Copy the lib artifacts to '/jobs/genie.virgo/gradle-build-with-smoke-test/workspace/packaging/nano/build/common_resources/lib'.
Adding Virgo module dependency: DefaultProjectDependency{dependencyProject='project ':kernel:org.eclipse.virgo.kernel.equinox.extensions'', configuration='default'}
Adding Virgo module dependency: DefaultProjectDependency{dependencyProject='project ':nano:org.eclipse.virgo.nano.authentication'', configuration='default'}
Adding Virgo module dependency: DefaultProjectDependency{dependencyProject='project ':nano:org.eclipse.virgo.nano.shutdown'', configuration='default'}
Adding Virgo module dependency: DefaultProjectDependency{dependencyProject='project ':util:org.eclipse.virgo.util.env'', configuration='default'}
Adding other dependency: DefaultExternalModuleDependency{group='org.eclipse.virgo.mirrored', name='org.eclipse.equinox.launcher', version='1.3.0.v20120308-1358', configuration='compile'}
Copy the libPersistence artifacts to '/jobs/genie.virgo/gradle-build-with-smoke-test/workspace/packaging/nano/build/common_resources/lib/persistence'.
Adding Virgo module dependency: DefaultProjectDependency{dependencyProject='project ':web:org.eclipse.virgo.web.enterprise.openejb.jpa.integration'', configuration='default'}
Copy the libEndorsed artifacts to '/jobs/genie.virgo/gradle-build-with-smoke-test/workspace/packaging/nano/build/common_resources/lib/endorsed'.
Adding other dependency: DefaultExternalModuleDependency{group='org.eclipse.virgo.mirrored', name='javax.annotation', version='1.1.0.v201108011116', configuration='compile'}
Adding other dependency: DefaultExternalModuleDependency{group='org.eclipse.virgo.mirrored', name='javax.transaction', version='1.1.1.v201105210645', configuration='compile'}
Copy the pickup artifacts to '/jobs/genie.virgo/gradle-build-with-smoke-test/workspace/packaging/nano/build/common_resources/pickup'.
Adding Virgo module dependency: DefaultProjectDependency{dependencyProject='project ':kernel:org.eclipse.virgo.management.console'', configuration='default'}
:packaging:nano:prepareBundlesAndFeatures
Copy the Virgo core runtime artifacts to '/jobs/genie.virgo/gradle-build-with-smoke-test/workspace/packaging/nano/build/assembly/plugins' - a p2 repo will be built around them.
Copy the Virgo Nano runtime artifacts to '/jobs/genie.virgo/gradle-build-with-smoke-test/workspace/packaging/nano/build/assembly/plugins' - a p2 repo will be built around them.
Copy the Virgo enterprise runtime artifacts to '/jobs/genie.virgo/gradle-build-with-smoke-test/workspace/packaging/nano/build/assembly/plugins' - a p2 repo will be built around them.
Copy the RAP bundles from '/jobs/genie.virgo/gradle-build-with-smoke-test/workspace/packaging/nano/rapbundles' into '/jobs/genie.virgo/gradle-build-with-smoke-test/workspace/packaging/nano/build/assembly/plugins'.
Copy features from '/jobs/genie.virgo/gradle-build-with-smoke-test/workspace/packaging/nano/publish_resources/features' into '/jobs/genie.virgo/gradle-build-with-smoke-test/workspace/packaging/nano/build/assembly/features'.
:packaging:nano:publishBundlesAndFeatures
Generating metadata for ..
Generation completed with success [3 seconds].
Published Virgo Server bundles and features to '/jobs/genie.virgo/gradle-build-with-smoke-test/workspace/packaging/nano/build/repository'.
:packaging:nano:publishBase
Generating metadata for ..
Generation completed with success [0 seconds].
Published Virgo /jobs/genie.virgo/gradle-build-with-smoke-test/workspace/packaging/nano/publish_resources/products/base/base.product to '/jobs/genie.virgo/gradle-build-with-smoke-test/workspace/packaging/nano/build/repository'.
:packaging:nano:publishNano
Generating metadata for ..
Generation completed with success [0 seconds].
Published Virgo /jobs/genie.virgo/gradle-build-with-smoke-test/workspace/packaging/nano/publish_resources/products/nano/nano.product to '/jobs/genie.virgo/gradle-build-with-smoke-test/workspace/packaging/nano/build/repository'.
:packaging:nano:publishNanoBase
Generating metadata for ..
Generation completed with success [1 seconds].
Published Virgo /jobs/genie.virgo/gradle-build-with-smoke-test/workspace/packaging/nano/publish_resources/products/nano-base/nano-base.product to '/jobs/genie.virgo/gradle-build-with-smoke-test/workspace/packaging/nano/build/repository'.
:packaging:nano:publishNanoFull
Generating metadata for ..
Generation completed with success [0 seconds].
Published Virgo /jobs/genie.virgo/gradle-build-with-smoke-test/workspace/packaging/nano/publish_resources/products/nano-full/nano-full.product to '/jobs/genie.virgo/gradle-build-with-smoke-test/workspace/packaging/nano/build/repository'.
:packaging:nano:publishNanoRap
Generating metadata for ..
Generation completed with success [0 seconds].
Published Virgo /jobs/genie.virgo/gradle-build-with-smoke-test/workspace/packaging/nano/publish_resources/products/nano-rap/nano-rap.product to '/jobs/genie.virgo/gradle-build-with-smoke-test/workspace/packaging/nano/build/repository'.
:packaging:nano:groupPublish
:packaging:nano:installProductNano
Installing nano.product 1.0.0.
Operation completed in 3043 ms.
Installed Virgo 'nano.product' to '/jobs/genie.virgo/gradle-build-with-smoke-test/workspace/packaging/nano/build/VN/nano'.
:packaging:nano:installProductNanoFull
Installing nano-full.product 1.0.0.
Operation completed in 6817 ms.
Installed Virgo 'nano-full.product' to '/jobs/genie.virgo/gradle-build-with-smoke-test/workspace/packaging/nano/build/VF/nano-full'.
:packaging:nano:installProductNanoRap
Installing nano-rap.product 1.0.0.
Operation completed in 3403 ms.
Installed Virgo 'nano-rap.product' to '/jobs/genie.virgo/gradle-build-with-smoke-test/workspace/packaging/nano/build/VR/nano-rap'.
:packaging:nano:groupInstall
:packaging:nano:distZip
:packaging:tomcat-server:packageResourcesAndProducts
Copy the lib artifacts:
org.eclipse.virgo.kernel.equinox.extensions-3.7.0.D-20150612092801.jar
org.eclipse.virgo.nano.authentication-3.7.0.D-20150612092801.jar
org.eclipse.virgo.nano.shutdown-3.7.0.D-20150612092801.jar
org.eclipse.virgo.util.env-3.7.0.D-20150612092801.jar
org.eclipse.equinox.launcher-1.3.0.v20120308-1358.jar
to '/jobs/genie.virgo/gradle-build-with-smoke-test/workspace/packaging/tomcat-server/build/common_resources/lib'.
Copy the libPersistence artifacts:
org.eclipse.virgo.web.enterprise.openejb.jpa.integration-3.7.0.D-20150612092801.jar
to '/jobs/genie.virgo/gradle-build-with-smoke-test/workspace/packaging/tomcat-server/build/common_resources/lib/persistence'.
Copy the libEndorsed artifacts:
javax.annotation-1.1.0.v201108011116.jar
javax.transaction-1.1.1.v201105210645.jar
to '/jobs/genie.virgo/gradle-build-with-smoke-test/workspace/packaging/tomcat-server/build/common_resources/lib/endorsed'.
Copy the pluginsExtras artifacts:
org.eclipse.virgo.kernel.userregion-3.7.0.D-20150612092801.jar
to '/jobs/genie.virgo/gradle-build-with-smoke-test/workspace/packaging/tomcat-server/build/common_resources/plugins'.
Copy the repositoryExt artifacts:
org.eclipse.osgi.services-3.3.0.v20120307-2102.jar
osgi.enterprise-4.2.0.v201108120515.jar
org.eclipse.equinox.ds-1.4.0.v20120112-1400.jar
org.eclipse.equinox.util-1.0.300.v20111010-1614.jar
org.eclipse.equinox.region-1.1.0.v20120319-1602.jar
com.springsource.org.aopalliance-1.0.0.jar
org.springframework.aop-3.2.10.RELEASE.jar
org.springframework.beans-3.2.10.RELEASE.jar
org.springframework.context-3.2.10.RELEASE.jar
org.springframework.core-3.2.10.RELEASE.jar
org.springframework.expression-3.2.10.RELEASE.jar
org.eclipse.gemini.blueprint.core-2.0.0.M02.jar
org.eclipse.gemini.blueprint.extender-2.0.0.M02.jar
org.eclipse.gemini.blueprint.io-2.0.0.M02.jar
org.eclipse.gemini.management-1.0.5.RELEASE.jar
org.eclipse.virgo.management.fragment-3.7.0.D-20150612092801.jar
org.eclipse.virgo.kernel.agent.dm-3.7.0.D-20150612092801.jar
org.eclipse.virgo.kernel.deployer.dm-3.7.0.D-20150612092801.jar
org.eclipse.virgo.kernel.dmfragment-3.7.0.D-20150612092801.jar
com.springsource.org.apache.commons.fileupload-1.2.0.v20110525.jar
com.springsource.org.apache.commons.io-1.4.0.jar
org.jolokia.osgi-1.0.2.jar
org.eclipse.virgo.medic-3.7.0.D-20150612092801.jar
org.eclipse.virgo.medic.core-3.7.0.D-20150612092801.jar
org.eclipse.virgo.web.dm-3.7.0.D-20150612092801.jar
javax.jms-1.1.0.v201205091237.jar
org.springframework.aspects-3.2.10.RELEASE.jar
org.springframework.context.support-3.2.10.RELEASE.jar
org.springframework.jdbc-3.2.10.RELEASE.jar
org.springframework.jms-3.2.10.RELEASE.jar
org.springframework.orm-3.2.10.RELEASE.jar
org.springframework.oxm-3.2.10.RELEASE.jar
org.springframework.transaction-3.2.10.RELEASE.jar
org.springframework.web-3.2.10.RELEASE.jar
org.springframework.web.servlet-3.2.10.RELEASE.jar
org.springframework.web.portlet-3.2.10.RELEASE.jar
com.springsource.org.aspectj.weaver-1.6.12.RELEASE.jar
com.springsource.javax.portlet-2.0.0.v20110525.jar
com.springsource.javax.servlet.jsp.jstl-1.2.0.v20110728.jar
org.eclipse.virgo.web.core-3.7.0.D-20150612092801.jar
org.eclipse.virgo.web.tomcat.support-3.7.0.D-20150612092801.jar
org.eclipse.virgo.web.servlet.adapter-3.7.0.D-20150612092801.jar
org.eclipse.virgo.web.spring.integration-3.7.0.D-20150612092801.jar
javax.annotation-1.1.0.v201108011116.jar
javax.ejb-3.1.1.v201204261316.jar
javax.el-2.2.0.v201108011116.jar
javax.mail-1.4.0.v201005080615.jar
javax.persistence-2.0.4.v201112161009.jar
javax.servlet-3.0.0.v201112011016.jar
javax.servlet.jsp-2.2.0.v201112011158.jar
javax.xml.rpc-1.1.0.v201005080400.jar
javax.websocket-1.1.0.v201401130840.jar
org.eclipse.equinox.event-1.3.100.v20140115-1647.jar
com.springsource.org.apache.taglibs.standard-1.1.2.v20110517.jar
org.slf4j.api-1.7.2.v20121108-1250.jar
org.slf4j.jcl-1.7.2.v20121108-1250.jar
org.slf4j.jul-1.7.2.v20121108-1250.jar
org.slf4j.log4j-1.7.2.v20121108-1250.jar
org.eclipse.jdt.core.compiler.batch-3.10.0.v20140604-1726.jar
org.apache.catalina-7.0.56.v201412180755.jar
org.apache.catalina.ha-7.0.56.v201412180755.jar
org.apache.catalina.tribes-7.0.56.v201412180755.jar
org.apache.coyote-7.0.56.v201412180755.jar
org.apache.el-7.0.56.v201412180755.jar
org.apache.jasper-7.0.56.v201412180755.jar
org.apache.juli.extras-7.0.56.v201412180755.jar
org.apache.tomcat.api-7.0.56.v201412180755.jar
org.apache.tomcat.util-7.0.56.v201412180755.jar
org.apache.tomcat.websocket-7.0.56.v201412180755.jar
org.eclipse.gemini.web.core-2.2.5.RELEASE.jar
org.eclipse.gemini.web.tomcat-2.2.5.RELEASE.jar
to '/jobs/genie.virgo/gradle-build-with-smoke-test/workspace/packaging/tomcat-server/build/common_resources/repository/ext'.
Copy the pickup artifacts:
org.eclipse.virgo.management.console-3.7.0.D-20150612092801.jar
org.eclipse.virgo.apps.splash-3.7.0.D-20150612092801.jar
to '/jobs/genie.virgo/gradle-build-with-smoke-test/workspace/packaging/tomcat-server/build/common_resources/pickup'.
:packaging:nano:fullDistZip
:packaging:nano:rapDistZip
:packaging:nano:installDist
:packaging:nano:installFullDist
:packaging:nano:installRapDist
:packaging:jetty-server:org.eclipse.virgo.jetty.smoketest:compileSmokeTestJava
:packaging:jetty-server:org.eclipse.virgo.jetty.smoketest:processSmokeTestResources
:packaging:jetty-server:org.eclipse.virgo.jetty.smoketest:smokeTestClasses
:packaging:jetty-server:org.eclipse.virgo.jetty.smoketest:smokeTest

org.eclipse.virgo.server.smoketest.JettyServerSmokeTests > jettyServerShouldBeStarted FAILED
    java.lang.IllegalStateException
    java.lang.IllegalStateException

org.eclipse.virgo.server.smoketest.JettyServerSmokeTests > splashScreenShouldBeAccessable FAILED
    java.lang.IllegalStateException
    java.lang.IllegalStateException

org.eclipse.virgo.server.smoketest.JettyServerSmokeTests > adminScreenShouldBeAccessableWithDefaultCredentials FAILED
    java.lang.IllegalStateException
    java.lang.IllegalStateException

org.eclipse.virgo.server.smoketest.JettyServerSmokeTests > tagLibsScreenShouldBeAccessable FAILED
    java.lang.IllegalStateException
    java.lang.IllegalStateException

4 tests completed, 4 failed
:packaging:jetty-server:org.eclipse.virgo.jetty.smoketest:smokeTest FAILED
:packaging:kernel:org.eclipse.virgo.kernel.smoketest:compileSmokeTestJava
:packaging:kernel:org.eclipse.virgo.kernel.smoketest:processSmokeTestResources UP-TO-DATE
:packaging:kernel:org.eclipse.virgo.kernel.smoketest:smokeTestClasses
:packaging:kernel:org.eclipse.virgo.kernel.smoketest:smokeTest

org.eclipse.virgo.kernel.smoketest.KernelSmokeTests > adminScreenShouldBeAccessableWithDefaultCredentials FAILED
    java.lang.IllegalStateException
    java.lang.IllegalStateException

org.eclipse.virgo.kernel.smoketest.KernelSmokeTests > virgoKernelShouldBeStarted FAILED
    java.lang.IllegalStateException
    java.lang.IllegalStateException

2 tests completed, 2 failed
:packaging:kernel:org.eclipse.virgo.kernel.smoketest:smokeTest FAILED
:packaging:nano:org.eclipse.virgo.nano.smoketest:compileSmokeTestJava
:packaging:nano:org.eclipse.virgo.nano.smoketest:processSmokeTestResources
:packaging:nano:org.eclipse.virgo.nano.smoketest:smokeTestClasses
:packaging:nano:org.eclipse.virgo.nano.smoketest:smokeTest
:packaging:tomcat-server:org.eclipse.virgo.tomcat.smoketest:compileSmokeTestJava
:packaging:tomcat-server:org.eclipse.virgo.tomcat.smoketest:processSmokeTestResources
:packaging:tomcat-server:org.eclipse.virgo.tomcat.smoketest:smokeTestClasses
:packaging:tomcat-server:org.eclipse.virgo.tomcat.smoketest:smokeTest

org.eclipse.virgo.tomcat.smoketest.TomcatServerSmokeTests > tomcatServerShouldBeStarted FAILED
    java.lang.IllegalStateException
    java.lang.IllegalStateException

org.eclipse.virgo.tomcat.smoketest.TomcatServerSmokeTests > splashScreenShouldBeAccessable FAILED
    java.lang.IllegalStateException
    java.lang.IllegalStateException

org.eclipse.virgo.tomcat.smoketest.TomcatServerSmokeTests > adminScreenShouldBeAccessableWithDefaultCredentials FAILED
    java.lang.IllegalStateException
    java.lang.IllegalStateException

org.eclipse.virgo.tomcat.smoketest.TomcatServerSmokeTests > testFormTagsListScreen FAILED
    java.lang.IllegalStateException
    java.lang.IllegalStateException

org.eclipse.virgo.tomcat.smoketest.TomcatServerSmokeTests > testFormTagsFormScreen FAILED
    java.lang.IllegalStateException
    java.lang.IllegalStateException

5 tests completed, 5 failed
:packaging:tomcat-server:org.eclipse.virgo.tomcat.smoketest:smokeTest FAILED

FAILURE: Build completed with 4 failures.

1: Task failed with an exception.
-----------
* Where:
Build file '/jobs/genie.virgo/gradle-build-with-smoke-test/workspace/org.eclipse.virgo.site/build.gradle' line: 318

* What went wrong:
Execution failed for task ':org.eclipse.virgo.site:signBundles'.
> jarsigner returned: 1

* Try:
Run with --info or --debug option to get more log output.

* Exception is:
org.gradle.api.tasks.TaskExecutionException: Execution failed for task ':org.eclipse.virgo.site:signBundles'.
	at org.gradle.api.internal.tasks.execution.ExecuteActionsTaskExecuter.executeActions(ExecuteActionsTaskExecuter.java:69)
	at org.gradle.api.internal.tasks.execution.ExecuteActionsTaskExecuter.execute(ExecuteActionsTaskExecuter.java:46)
	at org.gradle.api.internal.tasks.execution.PostExecutionAnalysisTaskExecuter.execute(PostExecutionAnalysisTaskExecuter.java:35)
	at org.gradle.api.internal.tasks.execution.SkipUpToDateTaskExecuter.execute(SkipUpToDateTaskExecuter.java:64)
	at org.gradle.api.internal.tasks.execution.ValidatingTaskExecuter.execute(ValidatingTaskExecuter.java:58)
	at org.gradle.api.internal.tasks.execution.SkipEmptySourceFilesTaskExecuter.execute(SkipEmptySourceFilesTaskExecuter.java:42)
	at org.gradle.api.internal.tasks.execution.SkipTaskWithNoActionsExecuter.execute(SkipTaskWithNoActionsExecuter.java:52)
	at org.gradle.api.internal.tasks.execution.SkipOnlyIfTaskExecuter.execute(SkipOnlyIfTaskExecuter.java:53)
	at org.gradle.api.internal.tasks.execution.ExecuteAtMostOnceTaskExecuter.execute(ExecuteAtMostOnceTaskExecuter.java:43)
	at org.gradle.api.internal.AbstractTask.executeWithoutThrowingTaskFailure(AbstractTask.java:296)
	at org.gradle.execution.taskgraph.AbstractTaskPlanExecutor$TaskExecutorWorker.executeTask(AbstractTaskPlanExecutor.java:79)
	at org.gradle.execution.taskgraph.AbstractTaskPlanExecutor$TaskExecutorWorker.processTask(AbstractTaskPlanExecutor.java:63)
	at org.gradle.execution.taskgraph.AbstractTaskPlanExecutor$TaskExecutorWorker.run(AbstractTaskPlanExecutor.java:51)
	at org.gradle.execution.taskgraph.DefaultTaskPlanExecutor.process(DefaultTaskPlanExecutor.java:23)
	at org.gradle.execution.taskgraph.DefaultTaskGraphExecuter.execute(DefaultTaskGraphExecuter.java:86)
	at org.gradle.execution.SelectedTaskExecutionAction.execute(SelectedTaskExecutionAction.java:29)
	at org.gradle.execution.DefaultBuildExecuter.execute(DefaultBuildExecuter.java:61)
	at org.gradle.execution.DefaultBuildExecuter.access$200(DefaultBuildExecuter.java:23)
	at org.gradle.execution.DefaultBuildExecuter$2.proceed(DefaultBuildExecuter.java:67)
	at org.gradle.execution.DryRunBuildExecutionAction.execute(DryRunBuildExecutionAction.java:32)
	at org.gradle.execution.DefaultBuildExecuter.execute(DefaultBuildExecuter.java:61)
	at org.gradle.execution.DefaultBuildExecuter.execute(DefaultBuildExecuter.java:54)
	at org.gradle.initialization.DefaultGradleLauncher.doBuildStages(DefaultGradleLauncher.java:148)
	at org.gradle.initialization.DefaultGradleLauncher.doBuild(DefaultGradleLauncher.java:105)
	at org.gradle.initialization.DefaultGradleLauncher.run(DefaultGradleLauncher.java:85)
	at org.gradle.launcher.exec.InProcessBuildActionExecuter$DefaultBuildController.run(InProcessBuildActionExecuter.java:81)
	at org.gradle.launcher.cli.ExecuteBuildAction.run(ExecuteBuildAction.java:33)
	at org.gradle.launcher.cli.ExecuteBuildAction.run(ExecuteBuildAction.java:24)
	at org.gradle.launcher.exec.InProcessBuildActionExecuter.execute(InProcessBuildActionExecuter.java:39)
	at org.gradle.launcher.exec.InProcessBuildActionExecuter.execute(InProcessBuildActionExecuter.java:29)
	at org.gradle.launcher.cli.RunBuildAction.run(RunBuildAction.java:50)
	at org.gradle.internal.Actions$RunnableActionAdapter.execute(Actions.java:171)
	at org.gradle.launcher.cli.CommandLineActionFactory$ParseAndBuildAction.execute(CommandLineActionFactory.java:237)
	at org.gradle.launcher.cli.CommandLineActionFactory$ParseAndBuildAction.execute(CommandLineActionFactory.java:210)
	at org.gradle.launcher.cli.JavaRuntimeValidationAction.execute(JavaRuntimeValidationAction.java:35)
	at org.gradle.launcher.cli.JavaRuntimeValidationAction.execute(JavaRuntimeValidationAction.java:24)
	at org.gradle.launcher.cli.CommandLineActionFactory$WithLogging.execute(CommandLineActionFactory.java:206)
	at org.gradle.launcher.cli.CommandLineActionFactory$WithLogging.execute(CommandLineActionFactory.java:169)
	at org.gradle.launcher.cli.ExceptionReportingAction.execute(ExceptionReportingAction.java:33)
	at org.gradle.launcher.cli.ExceptionReportingAction.execute(ExceptionReportingAction.java:22)
	at org.gradle.launcher.Main.doAction(Main.java:33)
	at org.gradle.launcher.bootstrap.EntryPoint.run(EntryPoint.java:45)
	at org.gradle.launcher.bootstrap.ProcessBootstrap.runNoExit(ProcessBootstrap.java:54)
	at org.gradle.launcher.bootstrap.ProcessBootstrap.run(ProcessBootstrap.java:35)
	at org.gradle.launcher.GradleMain.main(GradleMain.java:23)
	at org.gradle.wrapper.BootstrapMainStarter.start(BootstrapMainStarter.java:30)
	at org.gradle.wrapper.WrapperExecutor.execute(WrapperExecutor.java:127)
	at org.gradle.wrapper.GradleWrapperMain.main(GradleWrapperMain.java:56)
Caused by: : jarsigner returned: 1
	at org.apache.tools.ant.taskdefs.ExecTask.runExecute(ExecTask.java:643)
	at org.apache.tools.ant.taskdefs.ExecTask.runExec(ExecTask.java:669)
	at org.apache.tools.ant.taskdefs.ExecTask.execute(ExecTask.java:495)
	at org.apache.tools.ant.taskdefs.SignJar.signOneJar(SignJar.java:488)
	at org.apache.tools.ant.taskdefs.SignJar.execute(SignJar.java:403)
	at org.apache.tools.ant.UnknownElement.execute(UnknownElement.java:292)
	at org.apache.tools.ant.dispatch.DispatchUtils.execute(DispatchUtils.java:106)
	at org.gradle.api.internal.project.ant.BasicAntBuilder.nodeCompleted(BasicAntBuilder.java:71)
	at org.gradle.api.internal.project.ant.BasicAntBuilder.doInvokeMethod(BasicAntBuilder.java:86)
	at build_67uk91858pdena143q0uqp4jps$_signLocally_closure10.doCall(/jobs/genie.virgo/gradle-build-with-smoke-test/workspace/org.eclipse.virgo.site/build.gradle:318)
	at build_67uk91858pdena143q0uqp4jps.signLocally(/jobs/genie.virgo/gradle-build-with-smoke-test/workspace/org.eclipse.virgo.site/build.gradle:327)
	at build_67uk91858pdena143q0uqp4jps.this$8$signLocally(/jobs/genie.virgo/gradle-build-with-smoke-test/workspace/org.eclipse.virgo.site/build.gradle)
	at build_67uk91858pdena143q0uqp4jps$_run_closure1_closure15.doCall(/jobs/genie.virgo/gradle-build-with-smoke-test/workspace/org.eclipse.virgo.site/build.gradle:24)
	at virgobuild.UpdateSitePlugin$_addTaskSignBundles_closure10_closure24.doCall(UpdateSitePlugin.groovy:212)
	at org.gradle.api.internal.AbstractTask$ClosureTaskAction.execute(AbstractTask.java:539)
	at org.gradle.api.internal.AbstractTask$ClosureTaskAction.execute(AbstractTask.java:520)
	at org.gradle.api.internal.tasks.execution.ExecuteActionsTaskExecuter.executeAction(ExecuteActionsTaskExecuter.java:80)
	at org.gradle.api.internal.tasks.execution.ExecuteActionsTaskExecuter.executeActions(ExecuteActionsTaskExecuter.java:61)
	... 47 more

==============================================================================

2: Task failed with an exception.
-----------
* What went wrong:
Execution failed for task ':packaging:jetty-server:org.eclipse.virgo.jetty.smoketest:smokeTest'.
> There were failing tests. See the report at: file:///jobs/genie.virgo/gradle-build-with-smoke-test/workspace/packaging/jetty-server/org.eclipse.virgo.jetty.smoketest/build/reports/tests/index.html

* Try:
Run with --info or --debug option to get more log output.

* Exception is:
org.gradle.api.tasks.TaskExecutionException: Execution failed for task ':packaging:jetty-server:org.eclipse.virgo.jetty.smoketest:smokeTest'.
	at org.gradle.api.internal.tasks.execution.ExecuteActionsTaskExecuter.executeActions(ExecuteActionsTaskExecuter.java:69)
	at org.gradle.api.internal.tasks.execution.ExecuteActionsTaskExecuter.execute(ExecuteActionsTaskExecuter.java:46)
	at org.gradle.api.internal.tasks.execution.PostExecutionAnalysisTaskExecuter.execute(PostExecutionAnalysisTaskExecuter.java:35)
	at org.gradle.api.internal.tasks.execution.SkipUpToDateTaskExecuter.execute(SkipUpToDateTaskExecuter.java:64)
	at org.gradle.api.internal.tasks.execution.ValidatingTaskExecuter.execute(ValidatingTaskExecuter.java:58)
	at org.gradle.api.internal.tasks.execution.SkipEmptySourceFilesTaskExecuter.execute(SkipEmptySourceFilesTaskExecuter.java:42)
	at org.gradle.api.internal.tasks.execution.SkipTaskWithNoActionsExecuter.execute(SkipTaskWithNoActionsExecuter.java:52)
	at org.gradle.api.internal.tasks.execution.SkipOnlyIfTaskExecuter.execute(SkipOnlyIfTaskExecuter.java:53)
	at org.gradle.api.internal.tasks.execution.ExecuteAtMostOnceTaskExecuter.execute(ExecuteAtMostOnceTaskExecuter.java:43)
	at org.gradle.api.internal.AbstractTask.executeWithoutThrowingTaskFailure(AbstractTask.java:296)
	at org.gradle.execution.taskgraph.AbstractTaskPlanExecutor$TaskExecutorWorker.executeTask(AbstractTaskPlanExecutor.java:79)
	at org.gradle.execution.taskgraph.AbstractTaskPlanExecutor$TaskExecutorWorker.processTask(AbstractTaskPlanExecutor.java:63)
	at org.gradle.execution.taskgraph.AbstractTaskPlanExecutor$TaskExecutorWorker.run(AbstractTaskPlanExecutor.java:51)
	at org.gradle.execution.taskgraph.DefaultTaskPlanExecutor.process(DefaultTaskPlanExecutor.java:23)
	at org.gradle.execution.taskgraph.DefaultTaskGraphExecuter.execute(DefaultTaskGraphExecuter.java:86)
	at org.gradle.execution.SelectedTaskExecutionAction.execute(SelectedTaskExecutionAction.java:29)
	at org.gradle.execution.DefaultBuildExecuter.execute(DefaultBuildExecuter.java:61)
	at org.gradle.execution.DefaultBuildExecuter.access$200(DefaultBuildExecuter.java:23)
	at org.gradle.execution.DefaultBuildExecuter$2.proceed(DefaultBuildExecuter.java:67)
	at org.gradle.execution.DryRunBuildExecutionAction.execute(DryRunBuildExecutionAction.java:32)
	at org.gradle.execution.DefaultBuildExecuter.execute(DefaultBuildExecuter.java:61)
	at org.gradle.execution.DefaultBuildExecuter.execute(DefaultBuildExecuter.java:54)
	at org.gradle.initialization.DefaultGradleLauncher.doBuildStages(DefaultGradleLauncher.java:148)
	at org.gradle.initialization.DefaultGradleLauncher.doBuild(DefaultGradleLauncher.java:105)
	at org.gradle.initialization.DefaultGradleLauncher.run(DefaultGradleLauncher.java:85)
	at org.gradle.launcher.exec.InProcessBuildActionExecuter$DefaultBuildController.run(InProcessBuildActionExecuter.java:81)
	at org.gradle.launcher.cli.ExecuteBuildAction.run(ExecuteBuildAction.java:33)
	at org.gradle.launcher.cli.ExecuteBuildAction.run(ExecuteBuildAction.java:24)
	at org.gradle.launcher.exec.InProcessBuildActionExecuter.execute(InProcessBuildActionExecuter.java:39)
	at org.gradle.launcher.exec.InProcessBuildActionExecuter.execute(InProcessBuildActionExecuter.java:29)
	at org.gradle.launcher.cli.RunBuildAction.run(RunBuildAction.java:50)
	at org.gradle.internal.Actions$RunnableActionAdapter.execute(Actions.java:171)
	at org.gradle.launcher.cli.CommandLineActionFactory$ParseAndBuildAction.execute(CommandLineActionFactory.java:237)
	at org.gradle.launcher.cli.CommandLineActionFactory$ParseAndBuildAction.execute(CommandLineActionFactory.java:210)
	at org.gradle.launcher.cli.JavaRuntimeValidationAction.execute(JavaRuntimeValidationAction.java:35)
	at org.gradle.launcher.cli.JavaRuntimeValidationAction.execute(JavaRuntimeValidationAction.java:24)
	at org.gradle.launcher.cli.CommandLineActionFactory$WithLogging.execute(CommandLineActionFactory.java:206)
	at org.gradle.launcher.cli.CommandLineActionFactory$WithLogging.execute(CommandLineActionFactory.java:169)
	at org.gradle.launcher.cli.ExceptionReportingAction.execute(ExceptionReportingAction.java:33)
	at org.gradle.launcher.cli.ExceptionReportingAction.execute(ExceptionReportingAction.java:22)
	at org.gradle.launcher.Main.doAction(Main.java:33)
	at org.gradle.launcher.bootstrap.EntryPoint.run(EntryPoint.java:45)
	at sun.reflect.NativeMethodAccessorImpl.invoke0(Native Method)
	at sun.reflect.NativeMethodAccessorImpl.invoke(NativeMethodAccessorImpl.java:62)
	at sun.reflect.DelegatingMethodAccessorImpl.invoke(DelegatingMethodAccessorImpl.java:43)
	at java.lang.reflect.Method.invoke(Method.java:497)
	at org.gradle.launcher.bootstrap.ProcessBootstrap.runNoExit(ProcessBootstrap.java:54)
	at org.gradle.launcher.bootstrap.ProcessBootstrap.run(ProcessBootstrap.java:35)
	at org.gradle.launcher.GradleMain.main(GradleMain.java:23)
	at sun.reflect.NativeMethodAccessorImpl.invoke0(Native Method)
	at sun.reflect.NativeMethodAccessorImpl.invoke(NativeMethodAccessorImpl.java:62)
	at sun.reflect.DelegatingMethodAccessorImpl.invoke(DelegatingMethodAccessorImpl.java:43)
	at java.lang.reflect.Method.invoke(Method.java:497)
	at org.gradle.wrapper.BootstrapMainStarter.start(BootstrapMainStarter.java:30)
	at org.gradle.wrapper.WrapperExecutor.execute(WrapperExecutor.java:127)
	at org.gradle.wrapper.GradleWrapperMain.main(GradleWrapperMain.java:56)
Caused by: org.gradle.api.GradleException: There were failing tests. See the report at: file:///jobs/genie.virgo/gradle-build-with-smoke-test/workspace/packaging/jetty-server/org.eclipse.virgo.jetty.smoketest/build/reports/tests/index.html
	at org.gradle.api.tasks.testing.Test.handleTestFailures(Test.java:1111)
	at org.gradle.api.tasks.testing.Test.executeTests(Test.java:542)
	at sun.reflect.GeneratedMethodAccessor518.invoke(Unknown Source)
	at sun.reflect.DelegatingMethodAccessorImpl.invoke(DelegatingMethodAccessorImpl.java:43)
	at java.lang.reflect.Method.invoke(Method.java:497)
	at org.gradle.internal.reflect.JavaMethod.invoke(JavaMethod.java:63)
	at org.gradle.api.internal.project.taskfactory.AnnotationProcessingTaskFactory$StandardTaskAction.doExecute(AnnotationProcessingTaskFactory.java:218)
	at org.gradle.api.internal.project.taskfactory.AnnotationProcessingTaskFactory$StandardTaskAction.execute(AnnotationProcessingTaskFactory.java:211)
	at org.gradle.api.internal.project.taskfactory.AnnotationProcessingTaskFactory$StandardTaskAction.execute(AnnotationProcessingTaskFactory.java:200)
	at org.gradle.api.internal.AbstractTask$TaskActionWrapper.execute(AbstractTask.java:570)
	at org.gradle.api.internal.AbstractTask$TaskActionWrapper.execute(AbstractTask.java:553)
	at org.gradle.api.internal.tasks.execution.ExecuteActionsTaskExecuter.executeAction(ExecuteActionsTaskExecuter.java:80)
	at org.gradle.api.internal.tasks.execution.ExecuteActionsTaskExecuter.executeActions(ExecuteActionsTaskExecuter.java:61)
	... 55 more

==============================================================================

3: Task failed with an exception.
-----------
* What went wrong:
Execution failed for task ':packaging:kernel:org.eclipse.virgo.kernel.smoketest:smokeTest'.
> There were failing tests. See the report at: file:///jobs/genie.virgo/gradle-build-with-smoke-test/workspace/packaging/kernel/org.eclipse.virgo.kernel.smoketest/build/reports/tests/index.html

* Try:
Run with --info or --debug option to get more log output.

* Exception is:
org.gradle.api.tasks.TaskExecutionException: Execution failed for task ':packaging:kernel:org.eclipse.virgo.kernel.smoketest:smokeTest'.
	at org.gradle.api.internal.tasks.execution.ExecuteActionsTaskExecuter.executeActions(ExecuteActionsTaskExecuter.java:69)
	at org.gradle.api.internal.tasks.execution.ExecuteActionsTaskExecuter.execute(ExecuteActionsTaskExecuter.java:46)
	at org.gradle.api.internal.tasks.execution.PostExecutionAnalysisTaskExecuter.execute(PostExecutionAnalysisTaskExecuter.java:35)
	at org.gradle.api.internal.tasks.execution.SkipUpToDateTaskExecuter.execute(SkipUpToDateTaskExecuter.java:64)
	at org.gradle.api.internal.tasks.execution.ValidatingTaskExecuter.execute(ValidatingTaskExecuter.java:58)
	at org.gradle.api.internal.tasks.execution.SkipEmptySourceFilesTaskExecuter.execute(SkipEmptySourceFilesTaskExecuter.java:42)
	at org.gradle.api.internal.tasks.execution.SkipTaskWithNoActionsExecuter.execute(SkipTaskWithNoActionsExecuter.java:52)
	at org.gradle.api.internal.tasks.execution.SkipOnlyIfTaskExecuter.execute(SkipOnlyIfTaskExecuter.java:53)
	at org.gradle.api.internal.tasks.execution.ExecuteAtMostOnceTaskExecuter.execute(ExecuteAtMostOnceTaskExecuter.java:43)
	at org.gradle.api.internal.AbstractTask.executeWithoutThrowingTaskFailure(AbstractTask.java:296)
	at org.gradle.execution.taskgraph.AbstractTaskPlanExecutor$TaskExecutorWorker.executeTask(AbstractTaskPlanExecutor.java:79)
	at org.gradle.execution.taskgraph.AbstractTaskPlanExecutor$TaskExecutorWorker.processTask(AbstractTaskPlanExecutor.java:63)
	at org.gradle.execution.taskgraph.AbstractTaskPlanExecutor$TaskExecutorWorker.run(AbstractTaskPlanExecutor.java:51)
	at org.gradle.execution.taskgraph.DefaultTaskPlanExecutor.process(DefaultTaskPlanExecutor.java:23)
	at org.gradle.execution.taskgraph.DefaultTaskGraphExecuter.execute(DefaultTaskGraphExecuter.java:86)
	at org.gradle.execution.SelectedTaskExecutionAction.execute(SelectedTaskExecutionAction.java:29)
	at org.gradle.execution.DefaultBuildExecuter.execute(DefaultBuildExecuter.java:61)
	at org.gradle.execution.DefaultBuildExecuter.access$200(DefaultBuildExecuter.java:23)
	at org.gradle.execution.DefaultBuildExecuter$2.proceed(DefaultBuildExecuter.java:67)
	at org.gradle.execution.DryRunBuildExecutionAction.execute(DryRunBuildExecutionAction.java:32)
	at org.gradle.execution.DefaultBuildExecuter.execute(DefaultBuildExecuter.java:61)
	at org.gradle.execution.DefaultBuildExecuter.execute(DefaultBuildExecuter.java:54)
	at org.gradle.initialization.DefaultGradleLauncher.doBuildStages(DefaultGradleLauncher.java:148)
	at org.gradle.initialization.DefaultGradleLauncher.doBuild(DefaultGradleLauncher.java:105)
	at org.gradle.initialization.DefaultGradleLauncher.run(DefaultGradleLauncher.java:85)
	at org.gradle.launcher.exec.InProcessBuildActionExecuter$DefaultBuildController.run(InProcessBuildActionExecuter.java:81)
	at org.gradle.launcher.cli.ExecuteBuildAction.run(ExecuteBuildAction.java:33)
	at org.gradle.launcher.cli.ExecuteBuildAction.run(ExecuteBuildAction.java:24)
	at org.gradle.launcher.exec.InProcessBuildActionExecuter.execute(InProcessBuildActionExecuter.java:39)
	at org.gradle.launcher.exec.InProcessBuildActionExecuter.execute(InProcessBuildActionExecuter.java:29)
	at org.gradle.launcher.cli.RunBuildAction.run(RunBuildAction.java:50)
	at org.gradle.internal.Actions$RunnableActionAdapter.execute(Actions.java:171)
	at org.gradle.launcher.cli.CommandLineActionFactory$ParseAndBuildAction.execute(CommandLineActionFactory.java:237)
	at org.gradle.launcher.cli.CommandLineActionFactory$ParseAndBuildAction.execute(CommandLineActionFactory.java:210)
	at org.gradle.launcher.cli.JavaRuntimeValidationAction.execute(JavaRuntimeValidationAction.java:35)
	at org.gradle.launcher.cli.JavaRuntimeValidationAction.execute(JavaRuntimeValidationAction.java:24)
	at org.gradle.launcher.cli.CommandLineActionFactory$WithLogging.execute(CommandLineActionFactory.java:206)
	at org.gradle.launcher.cli.CommandLineActionFactory$WithLogging.execute(CommandLineActionFactory.java:169)
	at org.gradle.launcher.cli.ExceptionReportingAction.execute(ExceptionReportingAction.java:33)
	at org.gradle.launcher.cli.ExceptionReportingAction.execute(ExceptionReportingAction.java:22)
	at org.gradle.launcher.Main.doAction(Main.java:33)
	at org.gradle.launcher.bootstrap.EntryPoint.run(EntryPoint.java:45)
	at sun.reflect.NativeMethodAccessorImpl.invoke0(Native Method)
	at sun.reflect.NativeMethodAccessorImpl.invoke(NativeMethodAccessorImpl.java:62)
	at sun.reflect.DelegatingMethodAccessorImpl.invoke(DelegatingMethodAccessorImpl.java:43)
	at java.lang.reflect.Method.invoke(Method.java:497)
	at org.gradle.launcher.bootstrap.ProcessBootstrap.runNoExit(ProcessBootstrap.java:54)
	at org.gradle.launcher.bootstrap.ProcessBootstrap.run(ProcessBootstrap.java:35)
	at org.gradle.launcher.GradleMain.main(GradleMain.java:23)
	at sun.reflect.NativeMethodAccessorImpl.invoke0(Native Method)
	at sun.reflect.NativeMethodAccessorImpl.invoke(NativeMethodAccessorImpl.java:62)
	at sun.reflect.DelegatingMethodAccessorImpl.invoke(DelegatingMethodAccessorImpl.java:43)
	at java.lang.reflect.Method.invoke(Method.java:497)
	at org.gradle.wrapper.BootstrapMainStarter.start(BootstrapMainStarter.java:30)
	at org.gradle.wrapper.WrapperExecutor.execute(WrapperExecutor.java:127)
	at org.gradle.wrapper.GradleWrapperMain.main(GradleWrapperMain.java:56)
Caused by: org.gradle.api.GradleException: There were failing tests. See the report at: file:///jobs/genie.virgo/gradle-build-with-smoke-test/workspace/packaging/kernel/org.eclipse.virgo.kernel.smoketest/build/reports/tests/index.html
	at org.gradle.api.tasks.testing.Test.handleTestFailures(Test.java:1111)
	at org.gradle.api.tasks.testing.Test.executeTests(Test.java:542)
	at sun.reflect.GeneratedMethodAccessor518.invoke(Unknown Source)
	at sun.reflect.DelegatingMethodAccessorImpl.invoke(DelegatingMethodAccessorImpl.java:43)
	at java.lang.reflect.Method.invoke(Method.java:497)
	at org.gradle.internal.reflect.JavaMethod.invoke(JavaMethod.java:63)
	at org.gradle.api.internal.project.taskfactory.AnnotationProcessingTaskFactory$StandardTaskAction.doExecute(AnnotationProcessingTaskFactory.java:218)
	at org.gradle.api.internal.project.taskfactory.AnnotationProcessingTaskFactory$StandardTaskAction.execute(AnnotationProcessingTaskFactory.java:211)
	at org.gradle.api.internal.project.taskfactory.AnnotationProcessingTaskFactory$StandardTaskAction.execute(AnnotationProcessingTaskFactory.java:200)
	at org.gradle.api.internal.AbstractTask$TaskActionWrapper.execute(AbstractTask.java:570)
	at org.gradle.api.internal.AbstractTask$TaskActionWrapper.execute(AbstractTask.java:553)
	at org.gradle.api.internal.tasks.execution.ExecuteActionsTaskExecuter.executeAction(ExecuteActionsTaskExecuter.java:80)
	at org.gradle.api.internal.tasks.execution.ExecuteActionsTaskExecuter.executeActions(ExecuteActionsTaskExecuter.java:61)
	... 55 more

==============================================================================

4: Task failed with an exception.
-----------
* What went wrong:
Execution failed for task ':packaging:tomcat-server:org.eclipse.virgo.tomcat.smoketest:smokeTest'.
> There were failing tests. See the report at: file:///jobs/genie.virgo/gradle-build-with-smoke-test/workspace/packaging/tomcat-server/org.eclipse.virgo.tomcat.smoketest/build/reports/tests/index.html

* Try:
Run with --info or --debug option to get more log output.

* Exception is:
org.gradle.api.tasks.TaskExecutionException: Execution failed for task ':packaging:tomcat-server:org.eclipse.virgo.tomcat.smoketest:smokeTest'.
	at org.gradle.api.internal.tasks.execution.ExecuteActionsTaskExecuter.executeActions(ExecuteActionsTaskExecuter.java:69)
	at org.gradle.api.internal.tasks.execution.ExecuteActionsTaskExecuter.execute(ExecuteActionsTaskExecuter.java:46)
	at org.gradle.api.internal.tasks.execution.PostExecutionAnalysisTaskExecuter.execute(PostExecutionAnalysisTaskExecuter.java:35)
	at org.gradle.api.internal.tasks.execution.SkipUpToDateTaskExecuter.execute(SkipUpToDateTaskExecuter.java:64)
	at org.gradle.api.internal.tasks.execution.ValidatingTaskExecuter.execute(ValidatingTaskExecuter.java:58)
	at org.gradle.api.internal.tasks.execution.SkipEmptySourceFilesTaskExecuter.execute(SkipEmptySourceFilesTaskExecuter.java:42)
	at org.gradle.api.internal.tasks.execution.SkipTaskWithNoActionsExecuter.execute(SkipTaskWithNoActionsExecuter.java:52)
	at org.gradle.api.internal.tasks.execution.SkipOnlyIfTaskExecuter.execute(SkipOnlyIfTaskExecuter.java:53)
	at org.gradle.api.internal.tasks.execution.ExecuteAtMostOnceTaskExecuter.execute(ExecuteAtMostOnceTaskExecuter.java:43)
	at org.gradle.api.internal.AbstractTask.executeWithoutThrowingTaskFailure(AbstractTask.java:296)
	at org.gradle.execution.taskgraph.AbstractTaskPlanExecutor$TaskExecutorWorker.executeTask(AbstractTaskPlanExecutor.java:79)
	at org.gradle.execution.taskgraph.AbstractTaskPlanExecutor$TaskExecutorWorker.processTask(AbstractTaskPlanExecutor.java:63)
	at org.gradle.execution.taskgraph.AbstractTaskPlanExecutor$TaskExecutorWorker.run(AbstractTaskPlanExecutor.java:51)
	at org.gradle.execution.taskgraph.DefaultTaskPlanExecutor.process(DefaultTaskPlanExecutor.java:23)
	at org.gradle.execution.taskgraph.DefaultTaskGraphExecuter.execute(DefaultTaskGraphExecuter.java:86)
	at org.gradle.execution.SelectedTaskExecutionAction.execute(SelectedTaskExecutionAction.java:29)
	at org.gradle.execution.DefaultBuildExecuter.execute(DefaultBuildExecuter.java:61)
	at org.gradle.execution.DefaultBuildExecuter.access$200(DefaultBuildExecuter.java:23)
	at org.gradle.execution.DefaultBuildExecuter$2.proceed(DefaultBuildExecuter.java:67)
	at org.gradle.execution.DryRunBuildExecutionAction.execute(DryRunBuildExecutionAction.java:32)
	at org.gradle.execution.DefaultBuildExecuter.execute(DefaultBuildExecuter.java:61)
	at org.gradle.execution.DefaultBuildExecuter.execute(DefaultBuildExecuter.java:54)
	at org.gradle.initialization.DefaultGradleLauncher.doBuildStages(DefaultGradleLauncher.java:148)
	at org.gradle.initialization.DefaultGradleLauncher.doBuild(DefaultGradleLauncher.java:105)
	at org.gradle.initialization.DefaultGradleLauncher.run(DefaultGradleLauncher.java:85)
	at org.gradle.launcher.exec.InProcessBuildActionExecuter$DefaultBuildController.run(InProcessBuildActionExecuter.java:81)
	at org.gradle.launcher.cli.ExecuteBuildAction.run(ExecuteBuildAction.java:33)
	at org.gradle.launcher.cli.ExecuteBuildAction.run(ExecuteBuildAction.java:24)
	at org.gradle.launcher.exec.InProcessBuildActionExecuter.execute(InProcessBuildActionExecuter.java:39)
	at org.gradle.launcher.exec.InProcessBuildActionExecuter.execute(InProcessBuildActionExecuter.java:29)
	at org.gradle.launcher.cli.RunBuildAction.run(RunBuildAction.java:50)
	at org.gradle.internal.Actions$RunnableActionAdapter.execute(Actions.java:171)
	at org.gradle.launcher.cli.CommandLineActionFactory$ParseAndBuildAction.execute(CommandLineActionFactory.java:237)
	at org.gradle.launcher.cli.CommandLineActionFactory$ParseAndBuildAction.execute(CommandLineActionFactory.java:210)
	at org.gradle.launcher.cli.JavaRuntimeValidationAction.execute(JavaRuntimeValidationAction.java:35)
	at org.gradle.launcher.cli.JavaRuntimeValidationAction.execute(JavaRuntimeValidationAction.java:24)
	at org.gradle.launcher.cli.CommandLineActionFactory$WithLogging.execute(CommandLineActionFactory.java:206)
	at org.gradle.launcher.cli.CommandLineActionFactory$WithLogging.execute(CommandLineActionFactory.java:169)
	at org.gradle.launcher.cli.ExceptionReportingAction.execute(ExceptionReportingAction.java:33)
	at org.gradle.launcher.cli.ExceptionReportingAction.execute(ExceptionReportingAction.java:22)
	at org.gradle.launcher.Main.doAction(Main.java:33)
	at org.gradle.launcher.bootstrap.EntryPoint.run(EntryPoint.java:45)
	at sun.reflect.NativeMethodAccessorImpl.invoke0(Native Method)
	at sun.reflect.NativeMethodAccessorImpl.invoke(NativeMethodAccessorImpl.java:62)
	at sun.reflect.DelegatingMethodAccessorImpl.invoke(DelegatingMethodAccessorImpl.java:43)
	at java.lang.reflect.Method.invoke(Method.java:497)
	at org.gradle.launcher.bootstrap.ProcessBootstrap.runNoExit(ProcessBootstrap.java:54)
	at org.gradle.launcher.bootstrap.ProcessBootstrap.run(ProcessBootstrap.java:35)
	at org.gradle.launcher.GradleMain.main(GradleMain.java:23)
	at sun.reflect.NativeMethodAccessorImpl.invoke0(Native Method)
	at sun.reflect.NativeMethodAccessorImpl.invoke(NativeMethodAccessorImpl.java:62)
	at sun.reflect.DelegatingMethodAccessorImpl.invoke(DelegatingMethodAccessorImpl.java:43)
	at java.lang.reflect.Method.invoke(Method.java:497)
	at org.gradle.wrapper.BootstrapMainStarter.start(BootstrapMainStarter.java:30)
	at org.gradle.wrapper.WrapperExecutor.execute(WrapperExecutor.java:127)
	at org.gradle.wrapper.GradleWrapperMain.main(GradleWrapperMain.java:56)
Caused by: org.gradle.api.GradleException: There were failing tests. See the report at: file:///jobs/genie.virgo/gradle-build-with-smoke-test/workspace/packaging/tomcat-server/org.eclipse.virgo.tomcat.smoketest/build/reports/tests/index.html
	at org.gradle.api.tasks.testing.Test.handleTestFailures(Test.java:1111)
	at org.gradle.api.tasks.testing.Test.executeTests(Test.java:542)
	at sun.reflect.GeneratedMethodAccessor518.invoke(Unknown Source)
	at sun.reflect.DelegatingMethodAccessorImpl.invoke(DelegatingMethodAccessorImpl.java:43)
	at java.lang.reflect.Method.invoke(Method.java:497)
	at org.gradle.internal.reflect.JavaMethod.invoke(JavaMethod.java:63)
	at org.gradle.api.internal.project.taskfactory.AnnotationProcessingTaskFactory$StandardTaskAction.doExecute(AnnotationProcessingTaskFactory.java:218)
	at org.gradle.api.internal.project.taskfactory.AnnotationProcessingTaskFactory$StandardTaskAction.execute(AnnotationProcessingTaskFactory.java:211)
	at org.gradle.api.internal.project.taskfactory.AnnotationProcessingTaskFactory$StandardTaskAction.execute(AnnotationProcessingTaskFactory.java:200)
	at org.gradle.api.internal.AbstractTask$TaskActionWrapper.execute(AbstractTask.java:570)
	at org.gradle.api.internal.AbstractTask$TaskActionWrapper.execute(AbstractTask.java:553)
	at org.gradle.api.internal.tasks.execution.ExecuteActionsTaskExecuter.executeAction(ExecuteActionsTaskExecuter.java:80)
	at org.gradle.api.internal.tasks.execution.ExecuteActionsTaskExecuter.executeActions(ExecuteActionsTaskExecuter.java:61)
	... 55 more

==============================================================================

BUILD FAILED

Total time: 17 mins 26.058 secs
[locks-and-latches] Releasing all the locks
[locks-and-latches] All the locks released
[FINDBUGS] Skipping publisher since build result is FAILURE
Recording test results
Archiving artifacts
Sending e-mails to: fwaibel@eclipsesource.com
Finished: FAILURE