FailedConsole Output

Skipping 6,090 KB.. Full Log
:web:org.eclipse.virgo.web.enterprise.openejb.fragment.jotm:testClasses UP-TO-DATE
:web:org.eclipse.virgo.web.enterprise.openejb.fragment.jotm:test UP-TO-DATE
:web:org.eclipse.virgo.web.enterprise.openejb.fragment.jotm:check
:web:org.eclipse.virgo.web.enterprise.openejb.fragment.jotm:build
:web:org.eclipse.virgo.web.enterprise.openejb.fragment.jpa:assemble
:web:org.eclipse.virgo.web.enterprise.openejb.fragment.jpa:findbugsMain UP-TO-DATE
:web:org.eclipse.virgo.web.enterprise.openejb.fragment.jpa:compileTestJava UP-TO-DATE
:web:org.eclipse.virgo.web.enterprise.openejb.fragment.jpa:processTestResources UP-TO-DATE
:web:org.eclipse.virgo.web.enterprise.openejb.fragment.jpa:testClasses UP-TO-DATE
:web:org.eclipse.virgo.web.enterprise.openejb.fragment.jpa:test UP-TO-DATE
:web:org.eclipse.virgo.web.enterprise.openejb.fragment.jpa:check UP-TO-DATE
:web:org.eclipse.virgo.web.enterprise.openejb.fragment.jpa:build
:web:org.eclipse.virgo.web.enterprise.openejb.fragment.webbeans:assemble
:web:org.eclipse.virgo.web.enterprise.openejb.fragment.webbeans:findbugsMain UP-TO-DATE
:web:org.eclipse.virgo.web.enterprise.openejb.fragment.webbeans:compileTestJava UP-TO-DATE
:web:org.eclipse.virgo.web.enterprise.openejb.fragment.webbeans:processTestResources UP-TO-DATE
:web:org.eclipse.virgo.web.enterprise.openejb.fragment.webbeans:testClasses UP-TO-DATE
:web:org.eclipse.virgo.web.enterprise.openejb.fragment.webbeans:test UP-TO-DATE
:web:org.eclipse.virgo.web.enterprise.openejb.fragment.webbeans:check UP-TO-DATE
:web:org.eclipse.virgo.web.enterprise.openejb.fragment.webbeans:build
:web:org.eclipse.virgo.web.enterprise.openejb.initialiser:assemble
:web:org.eclipse.virgo.web.enterprise.openejb.initialiser:findbugsMain
:web:org.eclipse.virgo.web.enterprise.openejb.initialiser:compileTestJava UP-TO-DATE
:web:org.eclipse.virgo.web.enterprise.openejb.initialiser:processTestResources UP-TO-DATE
:web:org.eclipse.virgo.web.enterprise.openejb.initialiser:testClasses UP-TO-DATE
:web:org.eclipse.virgo.web.enterprise.openejb.initialiser:test UP-TO-DATE
:web:org.eclipse.virgo.web.enterprise.openejb.initialiser:check
:web:org.eclipse.virgo.web.enterprise.openejb.initialiser:build
:web:org.eclipse.virgo.web.enterprise.openejb.jpa.integration:assemble
:web:org.eclipse.virgo.web.enterprise.openejb.jpa.integration:findbugsMain
FindBugs rule violations were found. See the report at: file:///jobs/genie.virgo/gradle-build-with-smoke-test/workspace/web/org.eclipse.virgo.web.enterprise.openejb.jpa.integration/build/reports/findbugs/main.xml
:web:org.eclipse.virgo.web.enterprise.openejb.jpa.integration:compileTestJava UP-TO-DATE
:web:org.eclipse.virgo.web.enterprise.openejb.jpa.integration:processTestResources UP-TO-DATE
:web:org.eclipse.virgo.web.enterprise.openejb.jpa.integration:testClasses UP-TO-DATE
:web:org.eclipse.virgo.web.enterprise.openejb.jpa.integration:test UP-TO-DATE
:web:org.eclipse.virgo.web.enterprise.openejb.jpa.integration:check
:web:org.eclipse.virgo.web.enterprise.openejb.jpa.integration:build
:web:org.eclipse.virgo.web.enterprise.openejb.tomcat.factory:assemble
:web:org.eclipse.virgo.web.enterprise.openejb.tomcat.factory:findbugsMain
:web:org.eclipse.virgo.web.enterprise.openejb.tomcat.factory:compileTestJava
:web:org.eclipse.virgo.web.enterprise.openejb.tomcat.factory:processTestResources UP-TO-DATE
:web:org.eclipse.virgo.web.enterprise.openejb.tomcat.factory:testClasses
:web:org.eclipse.virgo.web.enterprise.openejb.tomcat.factory:test
:web:org.eclipse.virgo.web.enterprise.openejb.tomcat.factory:check
:web:org.eclipse.virgo.web.enterprise.openejb.tomcat.factory:build
:web:org.eclipse.virgo.web.enterprise.openwebbeans.initialiser:assemble
:web:org.eclipse.virgo.web.enterprise.openwebbeans.initialiser:findbugsMain
:web:org.eclipse.virgo.web.enterprise.openwebbeans.initialiser:compileTestJava UP-TO-DATE
:web:org.eclipse.virgo.web.enterprise.openwebbeans.initialiser:processTestResources UP-TO-DATE
:web:org.eclipse.virgo.web.enterprise.openwebbeans.initialiser:testClasses UP-TO-DATE
:web:org.eclipse.virgo.web.enterprise.openwebbeans.initialiser:test UP-TO-DATE
:web:org.eclipse.virgo.web.enterprise.openwebbeans.initialiser:check
:web:org.eclipse.virgo.web.enterprise.openwebbeans.initialiser:build
:web:org.eclipse.virgo.web.enterprise.persistence.openejb.classloading.hook:assemble
:web:org.eclipse.virgo.web.enterprise.persistence.openejb.classloading.hook:findbugsMain
:web:org.eclipse.virgo.web.enterprise.persistence.openejb.classloading.hook:compileTestJava
:web:org.eclipse.virgo.web.enterprise.persistence.openejb.classloading.hook:processTestResources UP-TO-DATE
:web:org.eclipse.virgo.web.enterprise.persistence.openejb.classloading.hook:testClasses
:web:org.eclipse.virgo.web.enterprise.persistence.openejb.classloading.hook:test
:web:org.eclipse.virgo.web.enterprise.persistence.openejb.classloading.hook:check
:web:org.eclipse.virgo.web.enterprise.persistence.openejb.classloading.hook:build
:web:org.eclipse.virgo.web.enterprise.security:assemble
:web:org.eclipse.virgo.web.enterprise.security:findbugsMain
:web:org.eclipse.virgo.web.enterprise.security:compileTestJava----------
1. WARNING in /jobs/genie.virgo/gradle-build-with-smoke-test/workspace/web/org.eclipse.virgo.web.enterprise.security/src/test/java/org/eclipse/virgo/web/enterprise/security/StandardSecurityServiceTest.java (at line 193)
	ThreadLocal<Wrapper> wrapperLocal = (ThreadLocal<Wrapper>) wrapper; 
	                                    ^^^^^^^^^^^^^^^^^^^^^^^^^^^^^^
Type safety: Unchecked cast from Object to ThreadLocal<Wrapper>
----------
1 problem (1 warning)

:web:org.eclipse.virgo.web.enterprise.security:processTestResources UP-TO-DATE
:web:org.eclipse.virgo.web.enterprise.security:testClasses
:web:org.eclipse.virgo.web.enterprise.security:test
:web:org.eclipse.virgo.web.enterprise.security:check
:web:org.eclipse.virgo.web.enterprise.security:build
:web:org.eclipse.virgo.web.enterprise.security.openejb.classloading.hook:assemble
:web:org.eclipse.virgo.web.enterprise.security.openejb.classloading.hook:findbugsMain
:web:org.eclipse.virgo.web.enterprise.security.openejb.classloading.hook:compileTestJava UP-TO-DATE
:web:org.eclipse.virgo.web.enterprise.security.openejb.classloading.hook:processTestResources UP-TO-DATE
:web:org.eclipse.virgo.web.enterprise.security.openejb.classloading.hook:testClasses UP-TO-DATE
:web:org.eclipse.virgo.web.enterprise.security.openejb.classloading.hook:test UP-TO-DATE
:web:org.eclipse.virgo.web.enterprise.security.openejb.classloading.hook:check
:web:org.eclipse.virgo.web.enterprise.security.openejb.classloading.hook:build
:web:org.eclipse.virgo.web.enterprise.security.valve:assemble
:web:org.eclipse.virgo.web.enterprise.security.valve:findbugsMain
:web:org.eclipse.virgo.web.enterprise.security.valve:compileTestJava UP-TO-DATE
:web:org.eclipse.virgo.web.enterprise.security.valve:processTestResources UP-TO-DATE
:web:org.eclipse.virgo.web.enterprise.security.valve:testClasses UP-TO-DATE
:web:org.eclipse.virgo.web.enterprise.security.valve:test UP-TO-DATE
:web:org.eclipse.virgo.web.enterprise.security.valve:check
:web:org.eclipse.virgo.web.enterprise.security.valve:build
:web:org.eclipse.virgo.web.enterprise.services.accessor:assemble
:web:org.eclipse.virgo.web.enterprise.services.accessor:findbugsMain
:web:org.eclipse.virgo.web.enterprise.services.accessor:compileTestJava----------
1. WARNING in /jobs/genie.virgo/gradle-build-with-smoke-test/workspace/web/org.eclipse.virgo.web.enterprise.services.accessor/src/test/java/org/eclipse/virgo/web/enterprise/services/accessor/WebAppBundleClassloaderCustomizerTest.java (at line 94)
	assertTrue(((List<ClassLoaderDelegateHook>) field.get(PluggableDelegatingClassLoaderDelegateHook.getInstance())).contains(webAppBundleClassloaderCustomizer.getWebAppBundleClassLoaderDelegateHook()));
	           ^^^^^^^^^^^^^^^^^^^^^^^^^^^^^^^^^^^^^^^^^^^^^^^^^^^^^^^^^^^^^^^^^^^^^^^^^^^^^^^^^^^^^^^^^^^^^^^^^^^^^
Type safety: Unchecked cast from Object to List<ClassLoaderDelegateHook>
----------
2. WARNING in /jobs/genie.virgo/gradle-build-with-smoke-test/workspace/web/org.eclipse.virgo.web.enterprise.services.accessor/src/test/java/org/eclipse/virgo/web/enterprise/services/accessor/WebAppBundleClassloaderCustomizerTest.java (at line 98)
	assertTrue(((Map<Bundle, Set<String>>) field2.get(webAppBundleClassloaderCustomizer.getWebAppBundleClassLoaderDelegateHook())).containsKey(webBundle));
	           ^^^^^^^^^^^^^^^^^^^^^^^^^^^^^^^^^^^^^^^^^^^^^^^^^^^^^^^^^^^^^^^^^^^^^^^^^^^^^^^^^^^^^^^^^^^^^^^^^^^^^^^^^^^^^^^^^^^
Type safety: Unchecked cast from Object to Map<Bundle,Set<String>>
----------
3. WARNING in /jobs/genie.virgo/gradle-build-with-smoke-test/workspace/web/org.eclipse.virgo.web.enterprise.services.accessor/src/test/java/org/eclipse/virgo/web/enterprise/services/accessor/WebAppBundleClassloaderCustomizerTest.java (at line 104)
	assertTrue(((List<ClassLoaderDelegateHook>) field.get(PluggableDelegatingClassLoaderDelegateHook.getInstance())).isEmpty());
	           ^^^^^^^^^^^^^^^^^^^^^^^^^^^^^^^^^^^^^^^^^^^^^^^^^^^^^^^^^^^^^^^^^^^^^^^^^^^^^^^^^^^^^^^^^^^^^^^^^^^^^
Type safety: Unchecked cast from Object to List<ClassLoaderDelegateHook>
----------
3 problems (3 warnings)

:web:org.eclipse.virgo.web.enterprise.services.accessor:processTestResources UP-TO-DATE
:web:org.eclipse.virgo.web.enterprise.services.accessor:testClasses
:web:org.eclipse.virgo.web.enterprise.services.accessor:test
:web:org.eclipse.virgo.web.enterprise.services.accessor:check
:web:org.eclipse.virgo.web.enterprise.services.accessor:build
:web:org.eclipse.virgo.web.servlet.adapter:assemble
:web:org.eclipse.virgo.web.servlet.adapter:findbugsMain UP-TO-DATE
:web:org.eclipse.virgo.web.servlet.adapter:compileTestJava UP-TO-DATE
:web:org.eclipse.virgo.web.servlet.adapter:processTestResources UP-TO-DATE
:web:org.eclipse.virgo.web.servlet.adapter:testClasses UP-TO-DATE
:web:org.eclipse.virgo.web.servlet.adapter:test UP-TO-DATE
:web:org.eclipse.virgo.web.servlet.adapter:check UP-TO-DATE
:web:org.eclipse.virgo.web.servlet.adapter:build
:web:org.eclipse.virgo.web.spring.integration:assemble
:web:org.eclipse.virgo.web.spring.integration:findbugsMain UP-TO-DATE
:web:org.eclipse.virgo.web.spring.integration:compileTestJava UP-TO-DATE
:web:org.eclipse.virgo.web.spring.integration:processTestResources UP-TO-DATE
:web:org.eclipse.virgo.web.spring.integration:testClasses UP-TO-DATE
:web:org.eclipse.virgo.web.spring.integration:test UP-TO-DATE
:web:org.eclipse.virgo.web.spring.integration:check UP-TO-DATE
:web:org.eclipse.virgo.web.spring.integration:build
:web:org.eclipse.virgo.web.tomcat.support:assemble
:web:org.eclipse.virgo.web.tomcat.support:findbugsMain
:web:org.eclipse.virgo.web.tomcat.support:compileTestJava UP-TO-DATE
:web:org.eclipse.virgo.web.tomcat.support:processTestResources UP-TO-DATE
:web:org.eclipse.virgo.web.tomcat.support:testClasses UP-TO-DATE
:web:org.eclipse.virgo.web.tomcat.support:test UP-TO-DATE
:web:org.eclipse.virgo.web.tomcat.support:check
:web:org.eclipse.virgo.web.tomcat.support:build
:web:org.eclipse.virgo.web.war.deployer:assemble
:web:org.eclipse.virgo.web.war.deployer:findbugsMain
FindBugs rule violations were found. See the report at: file:///jobs/genie.virgo/gradle-build-with-smoke-test/workspace/web/org.eclipse.virgo.web.war.deployer/build/reports/findbugs/main.xml
:web:org.eclipse.virgo.web.war.deployer:compileTestJava
:web:org.eclipse.virgo.web.war.deployer:processTestResources
:web:org.eclipse.virgo.web.war.deployer:testClasses
:web:org.eclipse.virgo.web.war.deployer:test
:web:org.eclipse.virgo.web.war.deployer:check
:web:org.eclipse.virgo.web.war.deployer:build
:packaging:jetty-server:org.eclipse.virgo.jetty.sample.tags:war
:packaging:jetty-server:org.eclipse.virgo.jetty.sample.tags:assemble
:packaging:jetty-server:org.eclipse.virgo.jetty.sample.tags:findbugsMain
:packaging:jetty-server:org.eclipse.virgo.jetty.sample.tags:compileTestJava UP-TO-DATE
:packaging:jetty-server:org.eclipse.virgo.jetty.sample.tags:processTestResources UP-TO-DATE
:packaging:jetty-server:org.eclipse.virgo.jetty.sample.tags:testClasses UP-TO-DATE
:packaging:jetty-server:org.eclipse.virgo.jetty.sample.tags:test UP-TO-DATE
:packaging:jetty-server:org.eclipse.virgo.jetty.sample.tags:check
:packaging:jetty-server:org.eclipse.virgo.jetty.sample.tags:build
:packaging:jetty-server:org.eclipse.virgo.jetty.smoketest:assemble
:packaging:jetty-server:org.eclipse.virgo.jetty.smoketest:findbugsMain UP-TO-DATE
:packaging:jetty-server:org.eclipse.virgo.jetty.smoketest:compileTestJava UP-TO-DATE
:packaging:jetty-server:org.eclipse.virgo.jetty.smoketest:processTestResources UP-TO-DATE
:packaging:jetty-server:org.eclipse.virgo.jetty.smoketest:testClasses UP-TO-DATE
:packaging:jetty-server:org.eclipse.virgo.jetty.smoketest:test UP-TO-DATE
:packaging:jetty-server:org.eclipse.virgo.jetty.smoketest:check UP-TO-DATE
:packaging:jetty-server:org.eclipse.virgo.jetty.smoketest:build
:packaging:kernel:org.eclipse.virgo.kernel.smoketest:assemble
:packaging:kernel:org.eclipse.virgo.kernel.smoketest:findbugsMain UP-TO-DATE
:packaging:kernel:org.eclipse.virgo.kernel.smoketest:compileTestJava UP-TO-DATE
:packaging:kernel:org.eclipse.virgo.kernel.smoketest:processTestResources UP-TO-DATE
:packaging:kernel:org.eclipse.virgo.kernel.smoketest:testClasses UP-TO-DATE
:packaging:kernel:org.eclipse.virgo.kernel.smoketest:test UP-TO-DATE
:packaging:kernel:org.eclipse.virgo.kernel.smoketest:check UP-TO-DATE
:packaging:kernel:org.eclipse.virgo.kernel.smoketest:build
:packaging:nano:org.eclipse.virgo.nano.smoketest:assemble
:packaging:nano:org.eclipse.virgo.nano.smoketest:findbugsMain UP-TO-DATE
:packaging:nano:org.eclipse.virgo.nano.smoketest:compileTestJava UP-TO-DATE
:packaging:nano:org.eclipse.virgo.nano.smoketest:processTestResources UP-TO-DATE
:packaging:nano:org.eclipse.virgo.nano.smoketest:testClasses UP-TO-DATE
:packaging:nano:org.eclipse.virgo.nano.smoketest:test UP-TO-DATE
:packaging:nano:org.eclipse.virgo.nano.smoketest:check UP-TO-DATE
:packaging:nano:org.eclipse.virgo.nano.smoketest:build
:packaging:tomcat-server:org.eclipse.virgo.tomcat.smoketest:assemble
:packaging:tomcat-server:org.eclipse.virgo.tomcat.smoketest:findbugsMain UP-TO-DATE
:packaging:tomcat-server:org.eclipse.virgo.tomcat.smoketest:compileTestJava UP-TO-DATE
:packaging:tomcat-server:org.eclipse.virgo.tomcat.smoketest:processTestResources UP-TO-DATE
:packaging:tomcat-server:org.eclipse.virgo.tomcat.smoketest:testClasses UP-TO-DATE
:packaging:tomcat-server:org.eclipse.virgo.tomcat.smoketest:test UP-TO-DATE
:packaging:tomcat-server:org.eclipse.virgo.tomcat.smoketest:check UP-TO-DATE
:packaging:tomcat-server:org.eclipse.virgo.tomcat.smoketest:build
:packaging:jetty-server:assemble UP-TO-DATE
:packaging:kernel:assemble UP-TO-DATE
:packaging:nano:assemble UP-TO-DATE
:packaging:tomcat-server:assemble UP-TO-DATE
:downloadVirgoBuildTools UP-TO-DATE
:packaging:jetty-server:generateP2Inf
:packaging:jetty-server:packageResourcesAndProducts
Copy the lib artifacts:
org.eclipse.virgo.kernel.equinox.extensions-3.7.0.D-20150608154128.jar
org.eclipse.virgo.nano.authentication-3.7.0.D-20150608154128.jar
org.eclipse.virgo.nano.shutdown-3.7.0.D-20150608154128.jar
org.eclipse.virgo.util.env-3.7.0.D-20150608154128.jar
org.eclipse.equinox.launcher-1.3.0.v20120308-1358.jar
to '/jobs/genie.virgo/gradle-build-with-smoke-test/workspace/packaging/jetty-server/build/common_resources/lib'.
Copy the libPersistence artifacts:
org.eclipse.virgo.web.enterprise.openejb.jpa.integration-3.7.0.D-20150608154128.jar
to '/jobs/genie.virgo/gradle-build-with-smoke-test/workspace/packaging/jetty-server/build/common_resources/lib/persistence'.
Copy the libEndorsed artifacts:
javax.annotation-1.1.0.v201108011116.jar
javax.transaction-1.1.1.v201105210645.jar
to '/jobs/genie.virgo/gradle-build-with-smoke-test/workspace/packaging/jetty-server/build/common_resources/lib/endorsed'.
Copy the pickup artifacts:
org.eclipse.virgo.management.console-3.7.0.D-20150608154128.jar
org.eclipse.virgo.apps.splash-3.7.0.D-20150608154128.jar
to '/jobs/genie.virgo/gradle-build-with-smoke-test/workspace/packaging/jetty-server/build/common_resources/pickup'.
:packaging:jetty-server:prepareBundlesAndFeatures
Copy the virgoCoreRuntime artifacts:
org.eclipse.osgi-3.8.1.v20120830-144521.jar
org.eclipse.osgi.services-3.3.0.v20120307-2102.jar
org.eclipse.equinox.cm-1.0.400.v20120319-2029.jar
org.eclipse.equinox.common-3.6.100.v20120509-1351.jar
org.eclipse.equinox.ds-1.4.0.v20120112-1400.jar
org.eclipse.equinox.event-1.3.100.v20140115-1647.jar
org.eclipse.equinox.util-1.0.300.v20111010-1614.jar
org.slf4j.api-1.7.2.v20121108-1250.jar
org.slf4j.jul-1.7.2.v20121108-1250.jar
org.eclipse.virgo.util.common-3.7.0.D-20150608154128.jar
org.eclipse.virgo.util.io-3.7.0.D-20150608154128.jar
org.eclipse.virgo.util.jmx-3.7.0.D-20150608154128.jar
org.eclipse.virgo.util.math-3.7.0.D-20150608154128.jar
org.eclipse.virgo.util.osgi-3.7.0.D-20150608154128.jar
org.eclipse.virgo.util.osgi.manifest-3.7.0.D-20150608154128.jar
org.eclipse.virgo.util.parser.manifest-3.7.0.D-20150608154128.jar
ch.qos.logback.core-1.0.7.v20121108-1250.jar
ch.qos.logback.classic-1.0.7.v20121108-1250.jar
ch.qos.logback.slf4j-1.0.7.v20121108-1250.jar
org.eclipse.virgo.medic-3.7.0.D-20150608154128.jar
org.eclipse.virgo.medic.core-3.7.0.D-20150608154128.jar
org.eclipse.virgo.medic.logbackcorefragment-3.7.0.D-20150608154128.jar
org.eclipse.virgo.medic.logbackclassicfragment-3.7.0.D-20150608154128.jar
com.springsource.org.aspectj.weaver-1.6.12.RELEASE.jar
org.eclipse.virgo.nano.core-3.7.0.D-20150608154128.jar
org.eclipse.virgo.nano.deployer.api-3.7.0.D-20150608154128.jar
org.eclipse.virgo.nano.deployer.hot-3.7.0.D-20150608154128.jar
org.eclipse.virgo.nano.management-3.7.0.D-20150608154128.jar
org.eclipse.equinox.console-1.0.100.v20121001-124408.jar
org.eclipse.equinox.console.ssh-1.0.0.v20120430-1356.jar
org.apache.mina.core-2.0.2.v201108120515.jar
org.apache.sshd.core-0.5.0.v201108120515.jar
org.apache.felix.gogo.command-0.10.0.v201209301215.jar
org.apache.felix.gogo.runtime-0.10.0.v201209301036.jar
org.apache.felix.gogo.shell-0.10.0.v201211091412.jar
org.eclipse.equinox.simpleconfigurator-1.0.300.v20110815-1744.jar
org.eclipse.equinox.simpleconfigurator.manipulator-2.0.0.v20110808-1657.jar
org.eclipse.equinox.region-1.1.0.v20120319-1602.jar
javax.servlet-3.0.0.v201112011016.jar
osgi.enterprise-4.2.0.v201108120515.jar
org.eclipse.gemini.management-1.0.5.RELEASE.jar
org.eclipse.virgo.management.fragment-3.7.0.D-20150608154128.jar
to '/jobs/genie.virgo/gradle-build-with-smoke-test/workspace/packaging/jetty-server/build/assembly/plugins'.
Copy the kernelBaseRuntime artifacts:
com.springsource.org.apache.commons.codec-1.3.0.jar
com.springsource.org.apache.commons.httpclient-3.1.0.jar
org.eclipse.virgo.repository-3.7.0.D-20150608154128.jar
com.springsource.org.aopalliance-1.0.0.jar
org.slf4j.jcl-1.7.2.v20121108-1250.jar
org.springframework.aop-3.2.10.RELEASE.jar
org.springframework.beans-3.2.10.RELEASE.jar
org.springframework.context-3.2.10.RELEASE.jar
org.springframework.core-3.2.10.RELEASE.jar
org.springframework.expression-3.2.10.RELEASE.jar
org.eclipse.gemini.blueprint.core-2.0.0.M02.jar
org.eclipse.gemini.blueprint.extender-2.0.0.M02.jar
org.eclipse.gemini.blueprint.io-2.0.0.M02.jar
org.eclipse.virgo.util.parser.launcher-3.7.0.D-20150608154128.jar
org.eclipse.virgo.kernel.agent.dm-3.7.0.D-20150608154128.jar
org.eclipse.virgo.kernel.artifact-3.7.0.D-20150608154128.jar
org.eclipse.virgo.kernel.deployer-3.7.0.D-20150608154128.jar
org.eclipse.virgo.kernel.deployer.dm-3.7.0.D-20150608154128.jar
org.eclipse.virgo.kernel.dmfragment-3.7.0.D-20150608154128.jar
org.eclipse.virgo.kernel.equinox.extensions-3.7.0.D-20150608154128.jar
org.eclipse.virgo.kernel.kerneldmfragment-3.7.0.D-20150608154128.jar
org.eclipse.virgo.kernel.model-3.7.0.D-20150608154128.jar
org.eclipse.virgo.kernel.osgi-3.7.0.D-20150608154128.jar
org.eclipse.virgo.kernel.services-3.7.0.D-20150608154128.jar
org.eclipse.virgo.kernel.userregion-3.7.0.D-20150608154128.jar
org.eclipse.virgo.kernel.userregionfactory-3.7.0.D-20150608154128.jar
org.eclipse.virgo.shell.command-3.7.0.D-20150608154128.jar
to '/jobs/genie.virgo/gradle-build-with-smoke-test/workspace/packaging/jetty-server/build/assembly/plugins'.
Copy the kernelRuntime artifacts:
to '/jobs/genie.virgo/gradle-build-with-smoke-test/workspace/packaging/jetty-server/build/assembly/plugins'.
Copy the repositoryExt artifacts:
org.eclipse.osgi.services-3.3.0.v20120307-2102.jar
osgi.enterprise-4.2.0.v201108120515.jar
org.eclipse.equinox.ds-1.4.0.v20120112-1400.jar
org.eclipse.equinox.util-1.0.300.v20111010-1614.jar
org.eclipse.equinox.region-1.1.0.v20120319-1602.jar
com.springsource.org.aopalliance-1.0.0.jar
org.springframework.aop-3.2.10.RELEASE.jar
org.springframework.beans-3.2.10.RELEASE.jar
org.springframework.context-3.2.10.RELEASE.jar
org.springframework.core-3.2.10.RELEASE.jar
org.springframework.expression-3.2.10.RELEASE.jar
org.eclipse.gemini.blueprint.core-2.0.0.M02.jar
org.eclipse.gemini.blueprint.extender-2.0.0.M02.jar
org.eclipse.gemini.blueprint.io-2.0.0.M02.jar
org.eclipse.gemini.management-1.0.5.RELEASE.jar
org.eclipse.virgo.management.fragment-3.7.0.D-20150608154128.jar
org.eclipse.virgo.kernel.agent.dm-3.7.0.D-20150608154128.jar
org.eclipse.virgo.kernel.deployer.dm-3.7.0.D-20150608154128.jar
org.eclipse.virgo.kernel.dmfragment-3.7.0.D-20150608154128.jar
com.springsource.org.apache.commons.fileupload-1.2.0.v20110525.jar
com.springsource.org.apache.commons.io-1.4.0.jar
org.jolokia.osgi-1.0.2.jar
org.eclipse.virgo.medic-3.7.0.D-20150608154128.jar
org.eclipse.virgo.medic.core-3.7.0.D-20150608154128.jar
org.eclipse.virgo.web.dm-3.7.0.D-20150608154128.jar
javax.jms-1.1.0.v201205091237.jar
org.springframework.aspects-3.2.10.RELEASE.jar
org.springframework.context.support-3.2.10.RELEASE.jar
org.springframework.jdbc-3.2.10.RELEASE.jar
org.springframework.jms-3.2.10.RELEASE.jar
org.springframework.orm-3.2.10.RELEASE.jar
org.springframework.oxm-3.2.10.RELEASE.jar
org.springframework.transaction-3.2.10.RELEASE.jar
org.springframework.web-3.2.10.RELEASE.jar
org.springframework.web.servlet-3.2.10.RELEASE.jar
org.springframework.web.portlet-3.2.10.RELEASE.jar
com.springsource.org.aspectj.weaver-1.6.12.RELEASE.jar
com.springsource.javax.portlet-2.0.0.v20110525.jar
com.springsource.javax.servlet.jsp.jstl-1.2.0.v20110728.jar
org.eclipse.virgo.web.servlet.adapter-3.7.0.D-20150608154128.jar
to '/jobs/genie.virgo/gradle-build-with-smoke-test/workspace/packaging/jetty-server/build/repository/ext'.
Copy the pluginsExtras artifacts:
org.eclipse.virgo.kernel.userregion-3.7.0.D-20150608154128.jar
to '/jobs/genie.virgo/gradle-build-with-smoke-test/workspace/packaging/jetty-server/build/plugins'.
Copy features from '/jobs/genie.virgo/gradle-build-with-smoke-test/workspace/packaging/jetty-server/publish_resources/features' into '/jobs/genie.virgo/gradle-build-with-smoke-test/workspace/packaging/jetty-server/build/assembly/features'.
:packaging:jetty-server:publishBundlesAndFeatures
Generating metadata for ..
Status ERROR: org.eclipse.equinox.p2.artifact.repository code=0  java.lang.IllegalArgumentException

Product publishing ended with the following exception:
java.lang.IllegalArgumentException
	at org.eclipse.equinox.internal.p2.metadata.VersionParser.parse(VersionParser.java:93)
	at org.eclipse.equinox.p2.metadata.Version.create(Version.java:79)
	at org.eclipse.equinox.p2.metadata.Version.parseVersion(Version.java:141)
	at org.eclipse.equinox.p2.publisher.eclipse.FeatureEntry.<init>(FeatureEntry.java:63)
	at org.eclipse.equinox.internal.p2.publisher.eclipse.FeatureManifestParser.processPlugin(FeatureManifestParser.java:236)
	at org.eclipse.equinox.internal.p2.publisher.eclipse.FeatureManifestParser.startElement(FeatureManifestParser.java:270)
	at com.sun.org.apache.xerces.internal.parsers.AbstractSAXParser.startElement(AbstractSAXParser.java:509)
	at com.sun.org.apache.xerces.internal.parsers.AbstractXMLDocumentParser.emptyElement(AbstractXMLDocumentParser.java:182)
	at com.sun.org.apache.xerces.internal.impl.XMLNSDocumentScannerImpl.scanStartElement(XMLNSDocumentScannerImpl.java:356)
	at com.sun.org.apache.xerces.internal.impl.XMLDocumentFragmentScannerImpl$FragmentContentDriver.next(XMLDocumentFragmentScannerImpl.java:2786)
	at com.sun.org.apache.xerces.internal.impl.XMLDocumentScannerImpl.next(XMLDocumentScannerImpl.java:606)
	at com.sun.org.apache.xerces.internal.impl.XMLNSDocumentScannerImpl.next(XMLNSDocumentScannerImpl.java:117)
	at com.sun.org.apache.xerces.internal.impl.XMLDocumentFragmentScannerImpl.scanDocument(XMLDocumentFragmentScannerImpl.java:510)
	at com.sun.org.apache.xerces.internal.parsers.XML11Configuration.parse(XML11Configuration.java:848)
	at com.sun.org.apache.xerces.internal.parsers.XML11Configuration.parse(XML11Configuration.java:777)
	at com.sun.org.apache.xerces.internal.parsers.XMLParser.parse(XMLParser.java:141)
	at com.sun.org.apache.xerces.internal.parsers.AbstractSAXParser.parse(AbstractSAXParser.java:1213)
	at com.sun.org.apache.xerces.internal.jaxp.SAXParserImpl$JAXPSAXParser.parse(SAXParserImpl.java:649)
	at com.sun.org.apache.xerces.internal.jaxp.SAXParserImpl.parse(SAXParserImpl.java:333)
	at org.eclipse.equinox.internal.p2.publisher.eclipse.FeatureManifestParser.parse(FeatureManifestParser.java:126)
	at org.eclipse.equinox.internal.p2.publisher.eclipse.FeatureParser.parse(FeatureParser.java:60)
	at org.eclipse.equinox.p2.publisher.eclipse.FeaturesAction.getFeatures(FeaturesAction.java:518)
	at org.eclipse.equinox.p2.publisher.eclipse.FeaturesAction.perform(FeaturesAction.java:604)
	at org.eclipse.equinox.p2.publisher.Publisher$ArtifactProcess.run(Publisher.java:207)
	at org.eclipse.equinox.internal.p2.artifact.repository.simple.SimpleArtifactRepository.executeBatch(SimpleArtifactRepository.java:1339)
	at org.eclipse.equinox.p2.publisher.Publisher.publish(Publisher.java:231)
	at org.eclipse.equinox.p2.publisher.AbstractPublisherApplication.run(AbstractPublisherApplication.java:283)
	at org.eclipse.equinox.p2.publisher.AbstractPublisherApplication.run(AbstractPublisherApplication.java:253)
	at org.eclipse.equinox.p2.publisher.AbstractPublisherApplication.start(AbstractPublisherApplication.java:317)
	at org.eclipse.equinox.internal.app.EclipseAppHandle.run(EclipseAppHandle.java:196)
	at org.eclipse.equinox.internal.app.AnyThreadAppLauncher.run(AnyThreadAppLauncher.java:26)
	at java.lang.Thread.run(Thread.java:745)

Product publisher application was executed with the following arguments:
-metadataRepository
file:/jobs/genie.virgo/gradle-build-with-smoke-test/workspace/packaging/jetty-server/build/repository
-artifactRepository
file:/jobs/genie.virgo/gradle-build-with-smoke-test/workspace/packaging/jetty-server/build/repository
-source
/jobs/genie.virgo/gradle-build-with-smoke-test/workspace/packaging/jetty-server/build/assembly
-append
-compress
-publishArtifacts
:packaging:jetty-server:publishBundlesAndFeatures FAILED
:packaging:kernel:generateP2Inf
:packaging:kernel:packageResourcesAndProducts
Copy the lib artifacts:
org.eclipse.virgo.kernel.equinox.extensions-3.7.0.D-20150608154128.jar
org.eclipse.virgo.nano.authentication-3.7.0.D-20150608154128.jar
org.eclipse.virgo.nano.shutdown-3.7.0.D-20150608154128.jar
org.eclipse.virgo.util.env-3.7.0.D-20150608154128.jar
org.eclipse.equinox.launcher-1.3.0.v20120308-1358.jar
to '/jobs/genie.virgo/gradle-build-with-smoke-test/workspace/packaging/kernel/build/common_resources/lib'.
Copy the libPersistence artifacts:
org.eclipse.virgo.web.enterprise.openejb.jpa.integration-3.7.0.D-20150608154128.jar
to '/jobs/genie.virgo/gradle-build-with-smoke-test/workspace/packaging/kernel/build/common_resources/lib/persistence'.
Copy the libEndorsed artifacts:
javax.annotation-1.1.0.v201108011116.jar
javax.transaction-1.1.1.v201105210645.jar
to '/jobs/genie.virgo/gradle-build-with-smoke-test/workspace/packaging/kernel/build/common_resources/lib/endorsed'.
Copy the pickup artifacts:
org.eclipse.virgo.management.console-3.7.0.D-20150608154128.jar
to '/jobs/genie.virgo/gradle-build-with-smoke-test/workspace/packaging/kernel/build/common_resources/pickup'.
:packaging:kernel:prepareBundlesAndFeatures
Copy the Virgo core runtime artifacts to '/jobs/genie.virgo/gradle-build-with-smoke-test/workspace/packaging/kernel/build/assembly/plugins' - a p2 repo will be built around them.
Copy the virgoCoreRuntime artifacts:
org.eclipse.osgi-3.8.1.v20120830-144521.jar
org.eclipse.osgi.services-3.3.0.v20120307-2102.jar
org.eclipse.equinox.cm-1.0.400.v20120319-2029.jar
org.eclipse.equinox.common-3.6.100.v20120509-1351.jar
org.eclipse.equinox.ds-1.4.0.v20120112-1400.jar
org.eclipse.equinox.event-1.3.100.v20140115-1647.jar
org.eclipse.equinox.util-1.0.300.v20111010-1614.jar
org.slf4j.api-1.7.2.v20121108-1250.jar
org.slf4j.jul-1.7.2.v20121108-1250.jar
org.eclipse.virgo.util.common-3.7.0.D-20150608154128.jar
org.eclipse.virgo.util.io-3.7.0.D-20150608154128.jar
org.eclipse.virgo.util.jmx-3.7.0.D-20150608154128.jar
org.eclipse.virgo.util.math-3.7.0.D-20150608154128.jar
org.eclipse.virgo.util.osgi-3.7.0.D-20150608154128.jar
org.eclipse.virgo.util.osgi.manifest-3.7.0.D-20150608154128.jar
org.eclipse.virgo.util.parser.manifest-3.7.0.D-20150608154128.jar
ch.qos.logback.core-1.0.7.v20121108-1250.jar
ch.qos.logback.classic-1.0.7.v20121108-1250.jar
ch.qos.logback.slf4j-1.0.7.v20121108-1250.jar
org.eclipse.virgo.medic-3.7.0.D-20150608154128.jar
org.eclipse.virgo.medic.core-3.7.0.D-20150608154128.jar
org.eclipse.virgo.medic.logbackcorefragment-3.7.0.D-20150608154128.jar
org.eclipse.virgo.medic.logbackclassicfragment-3.7.0.D-20150608154128.jar
com.springsource.org.aspectj.weaver-1.6.12.RELEASE.jar
org.eclipse.virgo.nano.core-3.7.0.D-20150608154128.jar
org.eclipse.virgo.nano.deployer.api-3.7.0.D-20150608154128.jar
org.eclipse.virgo.nano.deployer.hot-3.7.0.D-20150608154128.jar
org.eclipse.virgo.nano.management-3.7.0.D-20150608154128.jar
org.eclipse.equinox.console-1.0.100.v20121001-124408.jar
org.eclipse.equinox.console.ssh-1.0.0.v20120430-1356.jar
org.apache.mina.core-2.0.2.v201108120515.jar
org.apache.sshd.core-0.5.0.v201108120515.jar
org.apache.felix.gogo.command-0.10.0.v201209301215.jar
org.apache.felix.gogo.runtime-0.10.0.v201209301036.jar
org.apache.felix.gogo.shell-0.10.0.v201211091412.jar
org.eclipse.equinox.simpleconfigurator-1.0.300.v20110815-1744.jar
org.eclipse.equinox.simpleconfigurator.manipulator-2.0.0.v20110808-1657.jar
org.eclipse.equinox.region-1.1.0.v20120319-1602.jar
javax.servlet-3.0.0.v201112011016.jar
osgi.enterprise-4.2.0.v201108120515.jar
org.eclipse.gemini.management-1.0.5.RELEASE.jar
org.eclipse.virgo.management.fragment-3.7.0.D-20150608154128.jar
to '/jobs/genie.virgo/gradle-build-with-smoke-test/workspace/packaging/kernel/build/assembly/plugins'.
Copy the kernelBaseRuntime artifacts:
com.springsource.org.apache.commons.codec-1.3.0.jar
com.springsource.org.apache.commons.httpclient-3.1.0.jar
org.eclipse.virgo.repository-3.7.0.D-20150608154128.jar
com.springsource.org.aopalliance-1.0.0.jar
org.slf4j.jcl-1.7.2.v20121108-1250.jar
org.springframework.aop-3.2.10.RELEASE.jar
org.springframework.beans-3.2.10.RELEASE.jar
org.springframework.context-3.2.10.RELEASE.jar
org.springframework.core-3.2.10.RELEASE.jar
org.springframework.expression-3.2.10.RELEASE.jar
org.eclipse.gemini.blueprint.core-2.0.0.M02.jar
org.eclipse.gemini.blueprint.extender-2.0.0.M02.jar
org.eclipse.gemini.blueprint.io-2.0.0.M02.jar
org.eclipse.virgo.util.parser.launcher-3.7.0.D-20150608154128.jar
org.eclipse.virgo.kernel.agent.dm-3.7.0.D-20150608154128.jar
org.eclipse.virgo.kernel.artifact-3.7.0.D-20150608154128.jar
org.eclipse.virgo.kernel.deployer-3.7.0.D-20150608154128.jar
org.eclipse.virgo.kernel.deployer.dm-3.7.0.D-20150608154128.jar
org.eclipse.virgo.kernel.dmfragment-3.7.0.D-20150608154128.jar
org.eclipse.virgo.kernel.equinox.extensions-3.7.0.D-20150608154128.jar
org.eclipse.virgo.kernel.kerneldmfragment-3.7.0.D-20150608154128.jar
org.eclipse.virgo.kernel.model-3.7.0.D-20150608154128.jar
org.eclipse.virgo.kernel.osgi-3.7.0.D-20150608154128.jar
org.eclipse.virgo.kernel.services-3.7.0.D-20150608154128.jar
org.eclipse.virgo.kernel.userregion-3.7.0.D-20150608154128.jar
org.eclipse.virgo.kernel.userregionfactory-3.7.0.D-20150608154128.jar
org.eclipse.virgo.shell.command-3.7.0.D-20150608154128.jar
to '/jobs/genie.virgo/gradle-build-with-smoke-test/workspace/packaging/kernel/build/assembly/plugins'.
Copy the kernelRuntime artifacts:
org.eclipse.equinox.http-1.0.500.v20110413.jar
to '/jobs/genie.virgo/gradle-build-with-smoke-test/workspace/packaging/kernel/build/assembly/plugins'.
Copy the repositoryExt artifacts:
org.eclipse.osgi.services-3.3.0.v20120307-2102.jar
osgi.enterprise-4.2.0.v201108120515.jar
org.eclipse.equinox.ds-1.4.0.v20120112-1400.jar
org.eclipse.equinox.util-1.0.300.v20111010-1614.jar
org.eclipse.equinox.region-1.1.0.v20120319-1602.jar
com.springsource.org.aopalliance-1.0.0.jar
org.springframework.aop-3.2.10.RELEASE.jar
org.springframework.beans-3.2.10.RELEASE.jar
org.springframework.context-3.2.10.RELEASE.jar
org.springframework.core-3.2.10.RELEASE.jar
org.springframework.expression-3.2.10.RELEASE.jar
org.eclipse.gemini.blueprint.core-2.0.0.M02.jar
org.eclipse.gemini.blueprint.extender-2.0.0.M02.jar
org.eclipse.gemini.blueprint.io-2.0.0.M02.jar
org.eclipse.gemini.management-1.0.5.RELEASE.jar
org.eclipse.virgo.management.fragment-3.7.0.D-20150608154128.jar
org.eclipse.virgo.kernel.agent.dm-3.7.0.D-20150608154128.jar
org.eclipse.virgo.kernel.deployer.dm-3.7.0.D-20150608154128.jar
org.eclipse.virgo.kernel.dmfragment-3.7.0.D-20150608154128.jar
com.springsource.org.apache.commons.fileupload-1.2.0.v20110525.jar
com.springsource.org.apache.commons.io-1.4.0.jar
org.jolokia.osgi-1.0.2.jar
to '/jobs/genie.virgo/gradle-build-with-smoke-test/workspace/packaging/kernel/build/repository/ext'.
Copy the pluginsExtras artifacts:
org.eclipse.virgo.kernel.userregion-3.7.0.D-20150608154128.jar
to '/jobs/genie.virgo/gradle-build-with-smoke-test/workspace/packaging/kernel/build/plugins'.
Copy features from '/jobs/genie.virgo/gradle-build-with-smoke-test/workspace/packaging/kernel/publish_resources/features' into '/jobs/genie.virgo/gradle-build-with-smoke-test/workspace/packaging/kernel/build/assembly/features'.
:packaging:kernel:publishBundlesAndFeatures
Generating metadata for ..
Status ERROR: org.eclipse.equinox.p2.artifact.repository code=0  java.lang.IllegalArgumentException

Product publishing ended with the following exception:
java.lang.IllegalArgumentException
	at org.eclipse.equinox.internal.p2.metadata.VersionParser.parse(VersionParser.java:93)
	at org.eclipse.equinox.p2.metadata.Version.create(Version.java:79)
	at org.eclipse.equinox.p2.metadata.Version.parseVersion(Version.java:141)
	at org.eclipse.equinox.p2.publisher.eclipse.FeatureEntry.<init>(FeatureEntry.java:63)
	at org.eclipse.equinox.internal.p2.publisher.eclipse.FeatureManifestParser.processPlugin(FeatureManifestParser.java:236)
	at org.eclipse.equinox.internal.p2.publisher.eclipse.FeatureManifestParser.startElement(FeatureManifestParser.java:270)
	at com.sun.org.apache.xerces.internal.parsers.AbstractSAXParser.startElement(AbstractSAXParser.java:509)
	at com.sun.org.apache.xerces.internal.parsers.AbstractXMLDocumentParser.emptyElement(AbstractXMLDocumentParser.java:182)
	at com.sun.org.apache.xerces.internal.impl.XMLNSDocumentScannerImpl.scanStartElement(XMLNSDocumentScannerImpl.java:356)
	at com.sun.org.apache.xerces.internal.impl.XMLDocumentFragmentScannerImpl$FragmentContentDriver.next(XMLDocumentFragmentScannerImpl.java:2786)
	at com.sun.org.apache.xerces.internal.impl.XMLDocumentScannerImpl.next(XMLDocumentScannerImpl.java:606)
	at com.sun.org.apache.xerces.internal.impl.XMLNSDocumentScannerImpl.next(XMLNSDocumentScannerImpl.java:117)
	at com.sun.org.apache.xerces.internal.impl.XMLDocumentFragmentScannerImpl.scanDocument(XMLDocumentFragmentScannerImpl.java:510)
	at com.sun.org.apache.xerces.internal.parsers.XML11Configuration.parse(XML11Configuration.java:848)
	at com.sun.org.apache.xerces.internal.parsers.XML11Configuration.parse(XML11Configuration.java:777)
	at com.sun.org.apache.xerces.internal.parsers.XMLParser.parse(XMLParser.java:141)
	at com.sun.org.apache.xerces.internal.parsers.AbstractSAXParser.parse(AbstractSAXParser.java:1213)
	at com.sun.org.apache.xerces.internal.jaxp.SAXParserImpl$JAXPSAXParser.parse(SAXParserImpl.java:649)
	at com.sun.org.apache.xerces.internal.jaxp.SAXParserImpl.parse(SAXParserImpl.java:333)
	at org.eclipse.equinox.internal.p2.publisher.eclipse.FeatureManifestParser.parse(FeatureManifestParser.java:126)
	at org.eclipse.equinox.internal.p2.publisher.eclipse.FeatureParser.parse(FeatureParser.java:60)
	at org.eclipse.equinox.p2.publisher.eclipse.FeaturesAction.getFeatures(FeaturesAction.java:518)
	at org.eclipse.equinox.p2.publisher.eclipse.FeaturesAction.perform(FeaturesAction.java:604)
	at org.eclipse.equinox.p2.publisher.Publisher$ArtifactProcess.run(Publisher.java:207)
	at org.eclipse.equinox.internal.p2.artifact.repository.simple.SimpleArtifactRepository.executeBatch(SimpleArtifactRepository.java:1339)
	at org.eclipse.equinox.p2.publisher.Publisher.publish(Publisher.java:231)
	at org.eclipse.equinox.p2.publisher.AbstractPublisherApplication.run(AbstractPublisherApplication.java:283)
	at org.eclipse.equinox.p2.publisher.AbstractPublisherApplication.run(AbstractPublisherApplication.java:253)
	at org.eclipse.equinox.p2.publisher.AbstractPublisherApplication.start(AbstractPublisherApplication.java:317)
	at org.eclipse.equinox.internal.app.EclipseAppHandle.run(EclipseAppHandle.java:196)
	at org.eclipse.equinox.internal.app.AnyThreadAppLauncher.run(AnyThreadAppLauncher.java:26)
	at java.lang.Thread.run(Thread.java:745)

Product publisher application was executed with the following arguments:
-metadataRepository
file:/jobs/genie.virgo/gradle-build-with-smoke-test/workspace/packaging/kernel/build/repository
-artifactRepository
file:/jobs/genie.virgo/gradle-build-with-smoke-test/workspace/packaging/kernel/build/repository
-source
/jobs/genie.virgo/gradle-build-with-smoke-test/workspace/packaging/kernel/build/assembly
-append
-compress
-publishArtifacts
:packaging:kernel:publishBundlesAndFeatures FAILED
:packaging:nano:generateP2Inf
:packaging:nano:packageResourcesAndProducts
Copy the lib artifacts to '/jobs/genie.virgo/gradle-build-with-smoke-test/workspace/packaging/nano/build/common_resources/lib'.
Adding Virgo module dependency: DefaultProjectDependency{dependencyProject='project ':kernel:org.eclipse.virgo.kernel.equinox.extensions'', configuration='default'}
Adding Virgo module dependency: DefaultProjectDependency{dependencyProject='project ':nano:org.eclipse.virgo.nano.authentication'', configuration='default'}
Adding Virgo module dependency: DefaultProjectDependency{dependencyProject='project ':nano:org.eclipse.virgo.nano.shutdown'', configuration='default'}
Adding Virgo module dependency: DefaultProjectDependency{dependencyProject='project ':util:org.eclipse.virgo.util.env'', configuration='default'}
Adding other dependency: DefaultExternalModuleDependency{group='org.eclipse.virgo.mirrored', name='org.eclipse.equinox.launcher', version='1.3.0.v20120308-1358', configuration='compile'}
Copy the libPersistence artifacts to '/jobs/genie.virgo/gradle-build-with-smoke-test/workspace/packaging/nano/build/common_resources/lib/persistence'.
Adding Virgo module dependency: DefaultProjectDependency{dependencyProject='project ':web:org.eclipse.virgo.web.enterprise.openejb.jpa.integration'', configuration='default'}
Copy the libEndorsed artifacts to '/jobs/genie.virgo/gradle-build-with-smoke-test/workspace/packaging/nano/build/common_resources/lib/endorsed'.
Adding other dependency: DefaultExternalModuleDependency{group='org.eclipse.virgo.mirrored', name='javax.annotation', version='1.1.0.v201108011116', configuration='compile'}
Adding other dependency: DefaultExternalModuleDependency{group='org.eclipse.virgo.mirrored', name='javax.transaction', version='1.1.1.v201105210645', configuration='compile'}
Copy the pickup artifacts to '/jobs/genie.virgo/gradle-build-with-smoke-test/workspace/packaging/nano/build/common_resources/pickup'.
Adding Virgo module dependency: DefaultProjectDependency{dependencyProject='project ':kernel:org.eclipse.virgo.management.console'', configuration='default'}
:packaging:nano:prepareBundlesAndFeatures
Copy the Virgo core runtime artifacts to '/jobs/genie.virgo/gradle-build-with-smoke-test/workspace/packaging/nano/build/assembly/plugins' - a p2 repo will be built around them.
Copy the Virgo Nano runtime artifacts to '/jobs/genie.virgo/gradle-build-with-smoke-test/workspace/packaging/nano/build/assembly/plugins' - a p2 repo will be built around them.
Copy the Virgo enterprise runtime artifacts to '/jobs/genie.virgo/gradle-build-with-smoke-test/workspace/packaging/nano/build/assembly/plugins' - a p2 repo will be built around them.
Copy the RAP bundles from '/jobs/genie.virgo/gradle-build-with-smoke-test/workspace/packaging/nano/rapbundles' into '/jobs/genie.virgo/gradle-build-with-smoke-test/workspace/packaging/nano/build/assembly/plugins'.
Copy features from '/jobs/genie.virgo/gradle-build-with-smoke-test/workspace/packaging/nano/publish_resources/features' into '/jobs/genie.virgo/gradle-build-with-smoke-test/workspace/packaging/nano/build/assembly/features'.
:packaging:nano:publishBundlesAndFeatures
Generating metadata for ..
Status ERROR: org.eclipse.equinox.p2.artifact.repository code=0  java.lang.IllegalArgumentException

Product publishing ended with the following exception:
java.lang.IllegalArgumentException
	at org.eclipse.equinox.internal.p2.metadata.VersionParser.parse(VersionParser.java:93)
	at org.eclipse.equinox.p2.metadata.Version.create(Version.java:79)
	at org.eclipse.equinox.p2.metadata.Version.parseVersion(Version.java:141)
	at org.eclipse.equinox.p2.publisher.eclipse.FeatureEntry.<init>(FeatureEntry.java:63)
	at org.eclipse.equinox.internal.p2.publisher.eclipse.FeatureManifestParser.processPlugin(FeatureManifestParser.java:236)
	at org.eclipse.equinox.internal.p2.publisher.eclipse.FeatureManifestParser.startElement(FeatureManifestParser.java:270)
	at com.sun.org.apache.xerces.internal.parsers.AbstractSAXParser.startElement(AbstractSAXParser.java:509)
	at com.sun.org.apache.xerces.internal.parsers.AbstractXMLDocumentParser.emptyElement(AbstractXMLDocumentParser.java:182)
	at com.sun.org.apache.xerces.internal.impl.XMLNSDocumentScannerImpl.scanStartElement(XMLNSDocumentScannerImpl.java:356)
	at com.sun.org.apache.xerces.internal.impl.XMLDocumentFragmentScannerImpl$FragmentContentDriver.next(XMLDocumentFragmentScannerImpl.java:2786)
	at com.sun.org.apache.xerces.internal.impl.XMLDocumentScannerImpl.next(XMLDocumentScannerImpl.java:606)
	at com.sun.org.apache.xerces.internal.impl.XMLNSDocumentScannerImpl.next(XMLNSDocumentScannerImpl.java:117)
	at com.sun.org.apache.xerces.internal.impl.XMLDocumentFragmentScannerImpl.scanDocument(XMLDocumentFragmentScannerImpl.java:510)
	at com.sun.org.apache.xerces.internal.parsers.XML11Configuration.parse(XML11Configuration.java:848)
	at com.sun.org.apache.xerces.internal.parsers.XML11Configuration.parse(XML11Configuration.java:777)
	at com.sun.org.apache.xerces.internal.parsers.XMLParser.parse(XMLParser.java:141)
	at com.sun.org.apache.xerces.internal.parsers.AbstractSAXParser.parse(AbstractSAXParser.java:1213)
	at com.sun.org.apache.xerces.internal.jaxp.SAXParserImpl$JAXPSAXParser.parse(SAXParserImpl.java:649)
	at com.sun.org.apache.xerces.internal.jaxp.SAXParserImpl.parse(SAXParserImpl.java:333)
	at org.eclipse.equinox.internal.p2.publisher.eclipse.FeatureManifestParser.parse(FeatureManifestParser.java:126)
	at org.eclipse.equinox.internal.p2.publisher.eclipse.FeatureParser.parse(FeatureParser.java:60)
	at org.eclipse.equinox.p2.publisher.eclipse.FeaturesAction.getFeatures(FeaturesAction.java:518)
	at org.eclipse.equinox.p2.publisher.eclipse.FeaturesAction.perform(FeaturesAction.java:604)
	at org.eclipse.equinox.p2.publisher.Publisher$ArtifactProcess.run(Publisher.java:207)
	at org.eclipse.equinox.internal.p2.artifact.repository.simple.SimpleArtifactRepository.executeBatch(SimpleArtifactRepository.java:1339)
	at org.eclipse.equinox.p2.publisher.Publisher.publish(Publisher.java:231)
	at org.eclipse.equinox.p2.publisher.AbstractPublisherApplication.run(AbstractPublisherApplication.java:283)
	at org.eclipse.equinox.p2.publisher.AbstractPublisherApplication.run(AbstractPublisherApplication.java:253)
	at org.eclipse.equinox.p2.publisher.AbstractPublisherApplication.start(AbstractPublisherApplication.java:317)
	at org.eclipse.equinox.internal.app.EclipseAppHandle.run(EclipseAppHandle.java:196)
	at org.eclipse.equinox.internal.app.AnyThreadAppLauncher.run(AnyThreadAppLauncher.java:26)
	at java.lang.Thread.run(Thread.java:745)

Product publisher application was executed with the following arguments:
-metadataRepository
file:/jobs/genie.virgo/gradle-build-with-smoke-test/workspace/packaging/nano/build/repository
-artifactRepository
file:/jobs/genie.virgo/gradle-build-with-smoke-test/workspace/packaging/nano/build/repository
-source
/jobs/genie.virgo/gradle-build-with-smoke-test/workspace/packaging/nano/build/assembly
-append
-compress
-publishArtifacts
:packaging:nano:publishBundlesAndFeatures FAILED
:packaging:tomcat-server:generateP2Inf
:packaging:tomcat-server:packageResourcesAndProducts
Copy the lib artifacts:
org.eclipse.virgo.kernel.equinox.extensions-3.7.0.D-20150608154128.jar
org.eclipse.virgo.nano.authentication-3.7.0.D-20150608154128.jar
org.eclipse.virgo.nano.shutdown-3.7.0.D-20150608154128.jar
org.eclipse.virgo.util.env-3.7.0.D-20150608154128.jar
org.eclipse.equinox.launcher-1.3.0.v20120308-1358.jar
to '/jobs/genie.virgo/gradle-build-with-smoke-test/workspace/packaging/tomcat-server/build/common_resources/lib'.
Copy the libPersistence artifacts:
org.eclipse.virgo.web.enterprise.openejb.jpa.integration-3.7.0.D-20150608154128.jar
to '/jobs/genie.virgo/gradle-build-with-smoke-test/workspace/packaging/tomcat-server/build/common_resources/lib/persistence'.
Copy the libEndorsed artifacts:
javax.annotation-1.1.0.v201108011116.jar
javax.transaction-1.1.1.v201105210645.jar
to '/jobs/genie.virgo/gradle-build-with-smoke-test/workspace/packaging/tomcat-server/build/common_resources/lib/endorsed'.
Copy the pickup artifacts:
org.eclipse.virgo.management.console-3.7.0.D-20150608154128.jar
org.eclipse.virgo.apps.splash-3.7.0.D-20150608154128.jar
to '/jobs/genie.virgo/gradle-build-with-smoke-test/workspace/packaging/tomcat-server/build/common_resources/pickup'.
:packaging:tomcat-server:prepareBundlesAndFeatures
Copy the virgoCoreRuntime artifacts:
org.eclipse.osgi-3.8.1.v20120830-144521.jar
org.eclipse.osgi.services-3.3.0.v20120307-2102.jar
org.eclipse.equinox.cm-1.0.400.v20120319-2029.jar
org.eclipse.equinox.common-3.6.100.v20120509-1351.jar
org.eclipse.equinox.ds-1.4.0.v20120112-1400.jar
org.eclipse.equinox.event-1.3.100.v20140115-1647.jar
org.eclipse.equinox.util-1.0.300.v20111010-1614.jar
org.slf4j.api-1.7.2.v20121108-1250.jar
org.slf4j.jul-1.7.2.v20121108-1250.jar
org.eclipse.virgo.util.common-3.7.0.D-20150608154128.jar
org.eclipse.virgo.util.io-3.7.0.D-20150608154128.jar
org.eclipse.virgo.util.jmx-3.7.0.D-20150608154128.jar
org.eclipse.virgo.util.math-3.7.0.D-20150608154128.jar
org.eclipse.virgo.util.osgi-3.7.0.D-20150608154128.jar
org.eclipse.virgo.util.osgi.manifest-3.7.0.D-20150608154128.jar
org.eclipse.virgo.util.parser.manifest-3.7.0.D-20150608154128.jar
ch.qos.logback.core-1.0.7.v20121108-1250.jar
ch.qos.logback.classic-1.0.7.v20121108-1250.jar
ch.qos.logback.slf4j-1.0.7.v20121108-1250.jar
org.eclipse.virgo.medic-3.7.0.D-20150608154128.jar
org.eclipse.virgo.medic.core-3.7.0.D-20150608154128.jar
org.eclipse.virgo.medic.logbackcorefragment-3.7.0.D-20150608154128.jar
org.eclipse.virgo.medic.logbackclassicfragment-3.7.0.D-20150608154128.jar
com.springsource.org.aspectj.weaver-1.6.12.RELEASE.jar
org.eclipse.virgo.nano.core-3.7.0.D-20150608154128.jar
org.eclipse.virgo.nano.deployer.api-3.7.0.D-20150608154128.jar
org.eclipse.virgo.nano.deployer.hot-3.7.0.D-20150608154128.jar
org.eclipse.virgo.nano.management-3.7.0.D-20150608154128.jar
org.eclipse.equinox.console-1.0.100.v20121001-124408.jar
org.eclipse.equinox.console.ssh-1.0.0.v20120430-1356.jar
org.apache.mina.core-2.0.2.v201108120515.jar
org.apache.sshd.core-0.5.0.v201108120515.jar
org.apache.felix.gogo.command-0.10.0.v201209301215.jar
org.apache.felix.gogo.runtime-0.10.0.v201209301036.jar
org.apache.felix.gogo.shell-0.10.0.v201211091412.jar
org.eclipse.equinox.simpleconfigurator-1.0.300.v20110815-1744.jar
org.eclipse.equinox.simpleconfigurator.manipulator-2.0.0.v20110808-1657.jar
org.eclipse.equinox.region-1.1.0.v20120319-1602.jar
javax.servlet-3.0.0.v201112011016.jar
osgi.enterprise-4.2.0.v201108120515.jar
org.eclipse.gemini.management-1.0.5.RELEASE.jar
org.eclipse.virgo.management.fragment-3.7.0.D-20150608154128.jar
to '/jobs/genie.virgo/gradle-build-with-smoke-test/workspace/packaging/tomcat-server/build/assembly/plugins'.
Copy the kernelBaseRuntime artifacts:
com.springsource.org.apache.commons.codec-1.3.0.jar
com.springsource.org.apache.commons.httpclient-3.1.0.jar
org.eclipse.virgo.repository-3.7.0.D-20150608154128.jar
com.springsource.org.aopalliance-1.0.0.jar
org.slf4j.jcl-1.7.2.v20121108-1250.jar
org.springframework.aop-3.2.10.RELEASE.jar
org.springframework.beans-3.2.10.RELEASE.jar
org.springframework.context-3.2.10.RELEASE.jar
org.springframework.core-3.2.10.RELEASE.jar
org.springframework.expression-3.2.10.RELEASE.jar
org.eclipse.gemini.blueprint.core-2.0.0.M02.jar
org.eclipse.gemini.blueprint.extender-2.0.0.M02.jar
org.eclipse.gemini.blueprint.io-2.0.0.M02.jar
org.eclipse.virgo.util.parser.launcher-3.7.0.D-20150608154128.jar
org.eclipse.virgo.kernel.agent.dm-3.7.0.D-20150608154128.jar
org.eclipse.virgo.kernel.artifact-3.7.0.D-20150608154128.jar
org.eclipse.virgo.kernel.deployer-3.7.0.D-20150608154128.jar
org.eclipse.virgo.kernel.deployer.dm-3.7.0.D-20150608154128.jar
org.eclipse.virgo.kernel.dmfragment-3.7.0.D-20150608154128.jar
org.eclipse.virgo.kernel.equinox.extensions-3.7.0.D-20150608154128.jar
org.eclipse.virgo.kernel.kerneldmfragment-3.7.0.D-20150608154128.jar
org.eclipse.virgo.kernel.model-3.7.0.D-20150608154128.jar
org.eclipse.virgo.kernel.osgi-3.7.0.D-20150608154128.jar
org.eclipse.virgo.kernel.services-3.7.0.D-20150608154128.jar
org.eclipse.virgo.kernel.userregion-3.7.0.D-20150608154128.jar
org.eclipse.virgo.kernel.userregionfactory-3.7.0.D-20150608154128.jar
org.eclipse.virgo.shell.command-3.7.0.D-20150608154128.jar
to '/jobs/genie.virgo/gradle-build-with-smoke-test/workspace/packaging/tomcat-server/build/assembly/plugins'.
Copy the kernelRuntime artifacts:
to '/jobs/genie.virgo/gradle-build-with-smoke-test/workspace/packaging/tomcat-server/build/assembly/plugins'.
Copy the repositoryExt artifacts:
org.eclipse.osgi.services-3.3.0.v20120307-2102.jar
osgi.enterprise-4.2.0.v201108120515.jar
org.eclipse.equinox.ds-1.4.0.v20120112-1400.jar
org.eclipse.equinox.util-1.0.300.v20111010-1614.jar
org.eclipse.equinox.region-1.1.0.v20120319-1602.jar
com.springsource.org.aopalliance-1.0.0.jar
org.springframework.aop-3.2.10.RELEASE.jar
org.springframework.beans-3.2.10.RELEASE.jar
org.springframework.context-3.2.10.RELEASE.jar
org.springframework.core-3.2.10.RELEASE.jar
org.springframework.expression-3.2.10.RELEASE.jar
org.eclipse.gemini.blueprint.core-2.0.0.M02.jar
org.eclipse.gemini.blueprint.extender-2.0.0.M02.jar
org.eclipse.gemini.blueprint.io-2.0.0.M02.jar
org.eclipse.gemini.management-1.0.5.RELEASE.jar
org.eclipse.virgo.management.fragment-3.7.0.D-20150608154128.jar
org.eclipse.virgo.kernel.agent.dm-3.7.0.D-20150608154128.jar
org.eclipse.virgo.kernel.deployer.dm-3.7.0.D-20150608154128.jar
org.eclipse.virgo.kernel.dmfragment-3.7.0.D-20150608154128.jar
com.springsource.org.apache.commons.fileupload-1.2.0.v20110525.jar
com.springsource.org.apache.commons.io-1.4.0.jar
org.jolokia.osgi-1.0.2.jar
org.eclipse.virgo.medic-3.7.0.D-20150608154128.jar
org.eclipse.virgo.medic.core-3.7.0.D-20150608154128.jar
org.eclipse.virgo.web.dm-3.7.0.D-20150608154128.jar
javax.jms-1.1.0.v201205091237.jar
org.springframework.aspects-3.2.10.RELEASE.jar
org.springframework.context.support-3.2.10.RELEASE.jar
org.springframework.jdbc-3.2.10.RELEASE.jar
org.springframework.jms-3.2.10.RELEASE.jar
org.springframework.orm-3.2.10.RELEASE.jar
org.springframework.oxm-3.2.10.RELEASE.jar
org.springframework.transaction-3.2.10.RELEASE.jar
org.springframework.web-3.2.10.RELEASE.jar
org.springframework.web.servlet-3.2.10.RELEASE.jar
org.springframework.web.portlet-3.2.10.RELEASE.jar
com.springsource.org.aspectj.weaver-1.6.12.RELEASE.jar
com.springsource.javax.portlet-2.0.0.v20110525.jar
com.springsource.javax.servlet.jsp.jstl-1.2.0.v20110728.jar
org.eclipse.virgo.web.core-3.7.0.D-20150608154128.jar
org.eclipse.virgo.web.tomcat.support-3.7.0.D-20150608154128.jar
org.eclipse.virgo.web.servlet.adapter-3.7.0.D-20150608154128.jar
org.eclipse.virgo.web.spring.integration-3.7.0.D-20150608154128.jar
javax.annotation-1.1.0.v201108011116.jar
javax.ejb-3.1.1.v201204261316.jar
javax.el-2.2.0.v201108011116.jar
javax.mail-1.4.0.v201005080615.jar
javax.persistence-2.0.4.v201112161009.jar
javax.servlet-3.0.0.v201112011016.jar
javax.servlet.jsp-2.2.0.v201112011158.jar
javax.xml.rpc-1.1.0.v201005080400.jar
javax.websocket-1.1.0.v201401130840.jar
org.eclipse.equinox.event-1.3.100.v20140115-1647.jar
com.springsource.org.apache.taglibs.standard-1.1.2.v20110517.jar
org.slf4j.api-1.7.2.v20121108-1250.jar
org.slf4j.jcl-1.7.2.v20121108-1250.jar
org.slf4j.jul-1.7.2.v20121108-1250.jar
org.slf4j.log4j-1.7.2.v20121108-1250.jar
org.eclipse.jdt.core.compiler.batch-3.10.0.v20140604-1726.jar
org.apache.catalina-7.0.56.v201412180755.jar
org.apache.catalina.ha-7.0.56.v201412180755.jar
org.apache.catalina.tribes-7.0.56.v201412180755.jar
org.apache.coyote-7.0.56.v201412180755.jar
org.apache.el-7.0.56.v201412180755.jar
org.apache.jasper-7.0.56.v201412180755.jar
org.apache.juli.extras-7.0.56.v201412180755.jar
org.apache.tomcat.api-7.0.56.v201412180755.jar
org.apache.tomcat.util-7.0.56.v201412180755.jar
org.apache.tomcat.websocket-7.0.56.v201412180755.jar
org.eclipse.gemini.web.core-2.2.5.RELEASE.jar
org.eclipse.gemini.web.tomcat-2.2.5.RELEASE.jar
to '/jobs/genie.virgo/gradle-build-with-smoke-test/workspace/packaging/tomcat-server/build/repository/ext'.
Copy the pluginsExtras artifacts:
org.eclipse.virgo.kernel.userregion-3.7.0.D-20150608154128.jar
to '/jobs/genie.virgo/gradle-build-with-smoke-test/workspace/packaging/tomcat-server/build/plugins'.
Copy features from '/jobs/genie.virgo/gradle-build-with-smoke-test/workspace/packaging/tomcat-server/publish_resources/features' into '/jobs/genie.virgo/gradle-build-with-smoke-test/workspace/packaging/tomcat-server/build/assembly/features'.
:packaging:tomcat-server:publishBundlesAndFeatures
Generating metadata for ..
Status ERROR: org.eclipse.equinox.p2.artifact.repository code=0  java.lang.IllegalArgumentException

Product publishing ended with the following exception:
java.lang.IllegalArgumentException
	at org.eclipse.equinox.internal.p2.metadata.VersionParser.parse(VersionParser.java:93)
	at org.eclipse.equinox.p2.metadata.Version.create(Version.java:79)
	at org.eclipse.equinox.p2.metadata.Version.parseVersion(Version.java:141)
	at org.eclipse.equinox.p2.publisher.eclipse.FeatureEntry.<init>(FeatureEntry.java:63)
	at org.eclipse.equinox.internal.p2.publisher.eclipse.FeatureManifestParser.processPlugin(FeatureManifestParser.java:236)
	at org.eclipse.equinox.internal.p2.publisher.eclipse.FeatureManifestParser.startElement(FeatureManifestParser.java:270)
	at com.sun.org.apache.xerces.internal.parsers.AbstractSAXParser.startElement(AbstractSAXParser.java:509)
	at com.sun.org.apache.xerces.internal.parsers.AbstractXMLDocumentParser.emptyElement(AbstractXMLDocumentParser.java:182)
	at com.sun.org.apache.xerces.internal.impl.XMLNSDocumentScannerImpl.scanStartElement(XMLNSDocumentScannerImpl.java:356)
	at com.sun.org.apache.xerces.internal.impl.XMLDocumentFragmentScannerImpl$FragmentContentDriver.next(XMLDocumentFragmentScannerImpl.java:2786)
	at com.sun.org.apache.xerces.internal.impl.XMLDocumentScannerImpl.next(XMLDocumentScannerImpl.java:606)
	at com.sun.org.apache.xerces.internal.impl.XMLNSDocumentScannerImpl.next(XMLNSDocumentScannerImpl.java:117)
	at com.sun.org.apache.xerces.internal.impl.XMLDocumentFragmentScannerImpl.scanDocument(XMLDocumentFragmentScannerImpl.java:510)
	at com.sun.org.apache.xerces.internal.parsers.XML11Configuration.parse(XML11Configuration.java:848)
	at com.sun.org.apache.xerces.internal.parsers.XML11Configuration.parse(XML11Configuration.java:777)
	at com.sun.org.apache.xerces.internal.parsers.XMLParser.parse(XMLParser.java:141)
	at com.sun.org.apache.xerces.internal.parsers.AbstractSAXParser.parse(AbstractSAXParser.java:1213)
	at com.sun.org.apache.xerces.internal.jaxp.SAXParserImpl$JAXPSAXParser.parse(SAXParserImpl.java:649)
	at com.sun.org.apache.xerces.internal.jaxp.SAXParserImpl.parse(SAXParserImpl.java:333)
	at org.eclipse.equinox.internal.p2.publisher.eclipse.FeatureManifestParser.parse(FeatureManifestParser.java:126)
	at org.eclipse.equinox.internal.p2.publisher.eclipse.FeatureParser.parse(FeatureParser.java:60)
	at org.eclipse.equinox.p2.publisher.eclipse.FeaturesAction.getFeatures(FeaturesAction.java:518)
	at org.eclipse.equinox.p2.publisher.eclipse.FeaturesAction.perform(FeaturesAction.java:604)
	at org.eclipse.equinox.p2.publisher.Publisher$ArtifactProcess.run(Publisher.java:207)
	at org.eclipse.equinox.internal.p2.artifact.repository.simple.SimpleArtifactRepository.executeBatch(SimpleArtifactRepository.java:1339)
	at org.eclipse.equinox.p2.publisher.Publisher.publish(Publisher.java:231)
	at org.eclipse.equinox.p2.publisher.AbstractPublisherApplication.run(AbstractPublisherApplication.java:283)
	at org.eclipse.equinox.p2.publisher.AbstractPublisherApplication.run(AbstractPublisherApplication.java:253)
	at org.eclipse.equinox.p2.publisher.AbstractPublisherApplication.start(AbstractPublisherApplication.java:317)
	at org.eclipse.equinox.internal.app.EclipseAppHandle.run(EclipseAppHandle.java:196)
	at org.eclipse.equinox.internal.app.AnyThreadAppLauncher.run(AnyThreadAppLauncher.java:26)
	at java.lang.Thread.run(Thread.java:745)

Product publisher application was executed with the following arguments:
-metadataRepository
file:/jobs/genie.virgo/gradle-build-with-smoke-test/workspace/packaging/tomcat-server/build/repository
-artifactRepository
file:/jobs/genie.virgo/gradle-build-with-smoke-test/workspace/packaging/tomcat-server/build/repository
-source
/jobs/genie.virgo/gradle-build-with-smoke-test/workspace/packaging/tomcat-server/build/assembly
-append
-compress
-publishArtifacts
:packaging:tomcat-server:publishBundlesAndFeatures FAILED
:packaging:jetty-server:installDist
:packaging:kernel:installDist
:packaging:nano:installDist
:packaging:tomcat-server:installDist
:packaging:nano:installFullDist
:packaging:nano:installRapDist
:packaging:jetty-server:org.eclipse.virgo.jetty.smoketest:compileSmokeTestJava
:packaging:jetty-server:org.eclipse.virgo.jetty.smoketest:processSmokeTestResources
:packaging:jetty-server:org.eclipse.virgo.jetty.smoketest:smokeTestClasses
:packaging:jetty-server:org.eclipse.virgo.jetty.smoketest:smokeTest

org.eclipse.virgo.server.smoketest.JettyServerSmokeTests > splashScreenShouldBeAccessable FAILED
    java.lang.AssertionError

org.eclipse.virgo.server.smoketest.JettyServerSmokeTests > adminScreenShouldBeAccessableWithDefaultCredentials FAILED
    java.lang.AssertionError

org.eclipse.virgo.server.smoketest.JettyServerSmokeTests > testTagLibsScreen FAILED
    java.lang.AssertionError

org.eclipse.virgo.server.smoketest.JettyServerSmokeTests > jettyServerShouldBeStarted FAILED
    java.lang.AssertionError

4 tests completed, 4 failed
:packaging:jetty-server:org.eclipse.virgo.jetty.smoketest:smokeTest FAILED
:packaging:kernel:org.eclipse.virgo.kernel.smoketest:compileSmokeTestJava
:packaging:kernel:org.eclipse.virgo.kernel.smoketest:processSmokeTestResources UP-TO-DATE
:packaging:kernel:org.eclipse.virgo.kernel.smoketest:smokeTestClasses
:packaging:kernel:org.eclipse.virgo.kernel.smoketest:smokeTest

org.eclipse.virgo.kernel.smoketest.KernelSmokeTests > adminScreenShouldBeAccessableWithDefaultCredentials FAILED
    java.lang.AssertionError

org.eclipse.virgo.kernel.smoketest.KernelSmokeTests > virgoKernelShouldBeStarted FAILED
    java.lang.AssertionError

2 tests completed, 2 failed
:packaging:kernel:org.eclipse.virgo.kernel.smoketest:smokeTest FAILED
:packaging:nano:org.eclipse.virgo.nano.smoketest:compileSmokeTestJava
:packaging:nano:org.eclipse.virgo.nano.smoketest:processSmokeTestResources
:packaging:nano:org.eclipse.virgo.nano.smoketest:smokeTestClasses
:packaging:nano:org.eclipse.virgo.nano.smoketest:smokeTest

org.eclipse.virgo.nano.smoketest.NanoSmokeTests > virgoNanoShouldBeStarted FAILED
    java.lang.AssertionError at NanoSmokeTests.java:56

org.eclipse.virgo.nano.smoketest.NanoSmokeTests > testNanoJavaProfileSetCorrectly FAILED
    java.lang.AssertionError at NanoSmokeTests.java:56

org.eclipse.virgo.nano.smoketest.NanoSmokeTests > adminScreenShouldBeDeniedWithWrongCredentials FAILED
    java.lang.AssertionError at NanoSmokeTests.java:56

org.eclipse.virgo.nano.smoketest.NanoSmokeTests > adminScreenShouldBeAccessableWithDefaultCredentials FAILED
    java.lang.AssertionError at NanoSmokeTests.java:56

5 tests completed, 4 failed, 1 skipped
:packaging:nano:org.eclipse.virgo.nano.smoketest:smokeTest FAILED
:packaging:tomcat-server:org.eclipse.virgo.tomcat.smoketest:compileSmokeTestJava
:packaging:tomcat-server:org.eclipse.virgo.tomcat.smoketest:processSmokeTestResources
:packaging:tomcat-server:org.eclipse.virgo.tomcat.smoketest:smokeTestClasses
:packaging:tomcat-server:org.eclipse.virgo.tomcat.smoketest:smokeTest

org.eclipse.virgo.tomcat.smoketest.TomcatServerSmokeTests > tomcatServerShouldBeStarted FAILED
    java.lang.AssertionError

org.eclipse.virgo.tomcat.smoketest.TomcatServerSmokeTests > splashScreenShouldBeAccessable FAILED
    java.lang.AssertionError

org.eclipse.virgo.tomcat.smoketest.TomcatServerSmokeTests > adminScreenShouldBeAccessableWithDefaultCredentials FAILED
    java.lang.AssertionError

org.eclipse.virgo.tomcat.smoketest.TomcatServerSmokeTests > testFormTagsListScreen FAILED
    java.lang.AssertionError

org.eclipse.virgo.tomcat.smoketest.TomcatServerSmokeTests > testFormTagsFormScreen FAILED
    java.lang.AssertionError

5 tests completed, 5 failed
:packaging:tomcat-server:org.eclipse.virgo.tomcat.smoketest:smokeTest FAILED

FAILURE: Build completed with 8 failures.

1: Task failed with an exception.
-----------
* What went wrong:
Execution failed for task ':packaging:jetty-server:publishBundlesAndFeatures'.
> Process 'command '/opt/public/common/jdk1.8.0_40/bin/java'' finished with non-zero exit value 1

* Try:
Run with --info or --debug option to get more log output.

* Exception is:
org.gradle.api.tasks.TaskExecutionException: Execution failed for task ':packaging:jetty-server:publishBundlesAndFeatures'.
	at org.gradle.api.internal.tasks.execution.ExecuteActionsTaskExecuter.executeActions(ExecuteActionsTaskExecuter.java:69)
	at org.gradle.api.internal.tasks.execution.ExecuteActionsTaskExecuter.execute(ExecuteActionsTaskExecuter.java:46)
	at org.gradle.api.internal.tasks.execution.PostExecutionAnalysisTaskExecuter.execute(PostExecutionAnalysisTaskExecuter.java:35)
	at org.gradle.api.internal.tasks.execution.SkipUpToDateTaskExecuter.execute(SkipUpToDateTaskExecuter.java:64)
	at org.gradle.api.internal.tasks.execution.ValidatingTaskExecuter.execute(ValidatingTaskExecuter.java:58)
	at org.gradle.api.internal.tasks.execution.SkipEmptySourceFilesTaskExecuter.execute(SkipEmptySourceFilesTaskExecuter.java:42)
	at org.gradle.api.internal.tasks.execution.SkipTaskWithNoActionsExecuter.execute(SkipTaskWithNoActionsExecuter.java:52)
	at org.gradle.api.internal.tasks.execution.SkipOnlyIfTaskExecuter.execute(SkipOnlyIfTaskExecuter.java:53)
	at org.gradle.api.internal.tasks.execution.ExecuteAtMostOnceTaskExecuter.execute(ExecuteAtMostOnceTaskExecuter.java:43)
	at org.gradle.api.internal.AbstractTask.executeWithoutThrowingTaskFailure(AbstractTask.java:296)
	at org.gradle.execution.taskgraph.AbstractTaskPlanExecutor$TaskExecutorWorker.executeTask(AbstractTaskPlanExecutor.java:79)
	at org.gradle.execution.taskgraph.AbstractTaskPlanExecutor$TaskExecutorWorker.processTask(AbstractTaskPlanExecutor.java:63)
	at org.gradle.execution.taskgraph.AbstractTaskPlanExecutor$TaskExecutorWorker.run(AbstractTaskPlanExecutor.java:51)
	at org.gradle.execution.taskgraph.DefaultTaskPlanExecutor.process(DefaultTaskPlanExecutor.java:23)
	at org.gradle.execution.taskgraph.DefaultTaskGraphExecuter.execute(DefaultTaskGraphExecuter.java:86)
	at org.gradle.execution.SelectedTaskExecutionAction.execute(SelectedTaskExecutionAction.java:29)
	at org.gradle.execution.DefaultBuildExecuter.execute(DefaultBuildExecuter.java:61)
	at org.gradle.execution.DefaultBuildExecuter.access$200(DefaultBuildExecuter.java:23)
	at org.gradle.execution.DefaultBuildExecuter$2.proceed(DefaultBuildExecuter.java:67)
	at org.gradle.execution.DryRunBuildExecutionAction.execute(DryRunBuildExecutionAction.java:32)
	at org.gradle.execution.DefaultBuildExecuter.execute(DefaultBuildExecuter.java:61)
	at org.gradle.execution.DefaultBuildExecuter.execute(DefaultBuildExecuter.java:54)
	at org.gradle.initialization.DefaultGradleLauncher.doBuildStages(DefaultGradleLauncher.java:148)
	at org.gradle.initialization.DefaultGradleLauncher.doBuild(DefaultGradleLauncher.java:105)
	at org.gradle.initialization.DefaultGradleLauncher.run(DefaultGradleLauncher.java:85)
	at org.gradle.launcher.exec.InProcessBuildActionExecuter$DefaultBuildController.run(InProcessBuildActionExecuter.java:81)
	at org.gradle.launcher.cli.ExecuteBuildAction.run(ExecuteBuildAction.java:33)
	at org.gradle.launcher.cli.ExecuteBuildAction.run(ExecuteBuildAction.java:24)
	at org.gradle.launcher.exec.InProcessBuildActionExecuter.execute(InProcessBuildActionExecuter.java:39)
	at org.gradle.launcher.exec.InProcessBuildActionExecuter.execute(InProcessBuildActionExecuter.java:29)
	at org.gradle.launcher.cli.RunBuildAction.run(RunBuildAction.java:50)
	at org.gradle.internal.Actions$RunnableActionAdapter.execute(Actions.java:171)
	at org.gradle.launcher.cli.CommandLineActionFactory$ParseAndBuildAction.execute(CommandLineActionFactory.java:237)
	at org.gradle.launcher.cli.CommandLineActionFactory$ParseAndBuildAction.execute(CommandLineActionFactory.java:210)
	at org.gradle.launcher.cli.JavaRuntimeValidationAction.execute(JavaRuntimeValidationAction.java:35)
	at org.gradle.launcher.cli.JavaRuntimeValidationAction.execute(JavaRuntimeValidationAction.java:24)
	at org.gradle.launcher.cli.CommandLineActionFactory$WithLogging.execute(CommandLineActionFactory.java:206)
	at org.gradle.launcher.cli.CommandLineActionFactory$WithLogging.execute(CommandLineActionFactory.java:169)
	at org.gradle.launcher.cli.ExceptionReportingAction.execute(ExceptionReportingAction.java:33)
	at org.gradle.launcher.cli.ExceptionReportingAction.execute(ExceptionReportingAction.java:22)
	at org.gradle.launcher.Main.doAction(Main.java:33)
	at org.gradle.launcher.bootstrap.EntryPoint.run(EntryPoint.java:45)
	at org.gradle.launcher.bootstrap.ProcessBootstrap.runNoExit(ProcessBootstrap.java:54)
	at org.gradle.launcher.bootstrap.ProcessBootstrap.run(ProcessBootstrap.java:35)
	at org.gradle.launcher.GradleMain.main(GradleMain.java:23)
	at org.gradle.wrapper.BootstrapMainStarter.start(BootstrapMainStarter.java:30)
	at org.gradle.wrapper.WrapperExecutor.execute(WrapperExecutor.java:127)
	at org.gradle.wrapper.GradleWrapperMain.main(GradleWrapperMain.java:56)
Caused by: org.gradle.process.internal.ExecException: Process 'command '/opt/public/common/jdk1.8.0_40/bin/java'' finished with non-zero exit value 1
	at org.gradle.process.internal.DefaultExecHandle$ExecResultImpl.assertNormalExitValue(DefaultExecHandle.java:365)
	at org.gradle.process.internal.DefaultJavaExecAction.execute(DefaultJavaExecAction.java:31)
	at org.gradle.api.tasks.JavaExec.exec(JavaExec.java:60)
	at org.gradle.internal.reflect.JavaMethod.invoke(JavaMethod.java:63)
	at org.gradle.api.internal.project.taskfactory.AnnotationProcessingTaskFactory$StandardTaskAction.doExecute(AnnotationProcessingTaskFactory.java:218)
	at org.gradle.api.internal.project.taskfactory.AnnotationProcessingTaskFactory$StandardTaskAction.execute(AnnotationProcessingTaskFactory.java:211)
	at org.gradle.api.internal.project.taskfactory.AnnotationProcessingTaskFactory$StandardTaskAction.execute(AnnotationProcessingTaskFactory.java:200)
	at org.gradle.api.internal.AbstractTask$TaskActionWrapper.execute(AbstractTask.java:570)
	at org.gradle.api.internal.AbstractTask$TaskActionWrapper.execute(AbstractTask.java:553)
	at org.gradle.api.internal.tasks.execution.ExecuteActionsTaskExecuter.executeAction(ExecuteActionsTaskExecuter.java:80)
	at org.gradle.api.internal.tasks.execution.ExecuteActionsTaskExecuter.executeActions(ExecuteActionsTaskExecuter.java:61)
	... 47 more

==============================================================================

2: Task failed with an exception.
-----------
* What went wrong:
Execution failed for task ':packaging:kernel:publishBundlesAndFeatures'.
> Process 'command '/opt/public/common/jdk1.8.0_40/bin/java'' finished with non-zero exit value 1

* Try:
Run with --info or --debug option to get more log output.

* Exception is:
org.gradle.api.tasks.TaskExecutionException: Execution failed for task ':packaging:kernel:publishBundlesAndFeatures'.
	at org.gradle.api.internal.tasks.execution.ExecuteActionsTaskExecuter.executeActions(ExecuteActionsTaskExecuter.java:69)
	at org.gradle.api.internal.tasks.execution.ExecuteActionsTaskExecuter.execute(ExecuteActionsTaskExecuter.java:46)
	at org.gradle.api.internal.tasks.execution.PostExecutionAnalysisTaskExecuter.execute(PostExecutionAnalysisTaskExecuter.java:35)
	at org.gradle.api.internal.tasks.execution.SkipUpToDateTaskExecuter.execute(SkipUpToDateTaskExecuter.java:64)
	at org.gradle.api.internal.tasks.execution.ValidatingTaskExecuter.execute(ValidatingTaskExecuter.java:58)
	at org.gradle.api.internal.tasks.execution.SkipEmptySourceFilesTaskExecuter.execute(SkipEmptySourceFilesTaskExecuter.java:42)
	at org.gradle.api.internal.tasks.execution.SkipTaskWithNoActionsExecuter.execute(SkipTaskWithNoActionsExecuter.java:52)
	at org.gradle.api.internal.tasks.execution.SkipOnlyIfTaskExecuter.execute(SkipOnlyIfTaskExecuter.java:53)
	at org.gradle.api.internal.tasks.execution.ExecuteAtMostOnceTaskExecuter.execute(ExecuteAtMostOnceTaskExecuter.java:43)
	at org.gradle.api.internal.AbstractTask.executeWithoutThrowingTaskFailure(AbstractTask.java:296)
	at org.gradle.execution.taskgraph.AbstractTaskPlanExecutor$TaskExecutorWorker.executeTask(AbstractTaskPlanExecutor.java:79)
	at org.gradle.execution.taskgraph.AbstractTaskPlanExecutor$TaskExecutorWorker.processTask(AbstractTaskPlanExecutor.java:63)
	at org.gradle.execution.taskgraph.AbstractTaskPlanExecutor$TaskExecutorWorker.run(AbstractTaskPlanExecutor.java:51)
	at org.gradle.execution.taskgraph.DefaultTaskPlanExecutor.process(DefaultTaskPlanExecutor.java:23)
	at org.gradle.execution.taskgraph.DefaultTaskGraphExecuter.execute(DefaultTaskGraphExecuter.java:86)
	at org.gradle.execution.SelectedTaskExecutionAction.execute(SelectedTaskExecutionAction.java:29)
	at org.gradle.execution.DefaultBuildExecuter.execute(DefaultBuildExecuter.java:61)
	at org.gradle.execution.DefaultBuildExecuter.access$200(DefaultBuildExecuter.java:23)
	at org.gradle.execution.DefaultBuildExecuter$2.proceed(DefaultBuildExecuter.java:67)
	at org.gradle.execution.DryRunBuildExecutionAction.execute(DryRunBuildExecutionAction.java:32)
	at org.gradle.execution.DefaultBuildExecuter.execute(DefaultBuildExecuter.java:61)
	at org.gradle.execution.DefaultBuildExecuter.execute(DefaultBuildExecuter.java:54)
	at org.gradle.initialization.DefaultGradleLauncher.doBuildStages(DefaultGradleLauncher.java:148)
	at org.gradle.initialization.DefaultGradleLauncher.doBuild(DefaultGradleLauncher.java:105)
	at org.gradle.initialization.DefaultGradleLauncher.run(DefaultGradleLauncher.java:85)
	at org.gradle.launcher.exec.InProcessBuildActionExecuter$DefaultBuildController.run(InProcessBuildActionExecuter.java:81)
	at org.gradle.launcher.cli.ExecuteBuildAction.run(ExecuteBuildAction.java:33)
	at org.gradle.launcher.cli.ExecuteBuildAction.run(ExecuteBuildAction.java:24)
	at org.gradle.launcher.exec.InProcessBuildActionExecuter.execute(InProcessBuildActionExecuter.java:39)
	at org.gradle.launcher.exec.InProcessBuildActionExecuter.execute(InProcessBuildActionExecuter.java:29)
	at org.gradle.launcher.cli.RunBuildAction.run(RunBuildAction.java:50)
	at org.gradle.internal.Actions$RunnableActionAdapter.execute(Actions.java:171)
	at org.gradle.launcher.cli.CommandLineActionFactory$ParseAndBuildAction.execute(CommandLineActionFactory.java:237)
	at org.gradle.launcher.cli.CommandLineActionFactory$ParseAndBuildAction.execute(CommandLineActionFactory.java:210)
	at org.gradle.launcher.cli.JavaRuntimeValidationAction.execute(JavaRuntimeValidationAction.java:35)
	at org.gradle.launcher.cli.JavaRuntimeValidationAction.execute(JavaRuntimeValidationAction.java:24)
	at org.gradle.launcher.cli.CommandLineActionFactory$WithLogging.execute(CommandLineActionFactory.java:206)
	at org.gradle.launcher.cli.CommandLineActionFactory$WithLogging.execute(CommandLineActionFactory.java:169)
	at org.gradle.launcher.cli.ExceptionReportingAction.execute(ExceptionReportingAction.java:33)
	at org.gradle.launcher.cli.ExceptionReportingAction.execute(ExceptionReportingAction.java:22)
	at org.gradle.launcher.Main.doAction(Main.java:33)
	at org.gradle.launcher.bootstrap.EntryPoint.run(EntryPoint.java:45)
	at sun.reflect.NativeMethodAccessorImpl.invoke0(Native Method)
	at sun.reflect.NativeMethodAccessorImpl.invoke(NativeMethodAccessorImpl.java:62)
	at sun.reflect.DelegatingMethodAccessorImpl.invoke(DelegatingMethodAccessorImpl.java:43)
	at java.lang.reflect.Method.invoke(Method.java:497)
	at org.gradle.launcher.bootstrap.ProcessBootstrap.runNoExit(ProcessBootstrap.java:54)
	at org.gradle.launcher.bootstrap.ProcessBootstrap.run(ProcessBootstrap.java:35)
	at org.gradle.launcher.GradleMain.main(GradleMain.java:23)
	at sun.reflect.NativeMethodAccessorImpl.invoke0(Native Method)
	at sun.reflect.NativeMethodAccessorImpl.invoke(NativeMethodAccessorImpl.java:62)
	at sun.reflect.DelegatingMethodAccessorImpl.invoke(DelegatingMethodAccessorImpl.java:43)
	at java.lang.reflect.Method.invoke(Method.java:497)
	at org.gradle.wrapper.BootstrapMainStarter.start(BootstrapMainStarter.java:30)
	at org.gradle.wrapper.WrapperExecutor.execute(WrapperExecutor.java:127)
	at org.gradle.wrapper.GradleWrapperMain.main(GradleWrapperMain.java:56)
Caused by: org.gradle.process.internal.ExecException: Process 'command '/opt/public/common/jdk1.8.0_40/bin/java'' finished with non-zero exit value 1
	at org.gradle.process.internal.DefaultExecHandle$ExecResultImpl.assertNormalExitValue(DefaultExecHandle.java:365)
	at org.gradle.process.internal.DefaultJavaExecAction.execute(DefaultJavaExecAction.java:31)
	at org.gradle.api.tasks.JavaExec.exec(JavaExec.java:60)
	at sun.reflect.NativeMethodAccessorImpl.invoke0(Native Method)
	at sun.reflect.NativeMethodAccessorImpl.invoke(NativeMethodAccessorImpl.java:62)
	at sun.reflect.DelegatingMethodAccessorImpl.invoke(DelegatingMethodAccessorImpl.java:43)
	at java.lang.reflect.Method.invoke(Method.java:497)
	at org.gradle.internal.reflect.JavaMethod.invoke(JavaMethod.java:63)
	at org.gradle.api.internal.project.taskfactory.AnnotationProcessingTaskFactory$StandardTaskAction.doExecute(AnnotationProcessingTaskFactory.java:218)
	at org.gradle.api.internal.project.taskfactory.AnnotationProcessingTaskFactory$StandardTaskAction.execute(AnnotationProcessingTaskFactory.java:211)
	at org.gradle.api.internal.project.taskfactory.AnnotationProcessingTaskFactory$StandardTaskAction.execute(AnnotationProcessingTaskFactory.java:200)
	at org.gradle.api.internal.AbstractTask$TaskActionWrapper.execute(AbstractTask.java:570)
	at org.gradle.api.internal.AbstractTask$TaskActionWrapper.execute(AbstractTask.java:553)
	at org.gradle.api.internal.tasks.execution.ExecuteActionsTaskExecuter.executeAction(ExecuteActionsTaskExecuter.java:80)
	at org.gradle.api.internal.tasks.execution.ExecuteActionsTaskExecuter.executeActions(ExecuteActionsTaskExecuter.java:61)
	... 55 more

==============================================================================

3: Task failed with an exception.
-----------
* What went wrong:
Execution failed for task ':packaging:nano:publishBundlesAndFeatures'.
> Process 'command '/opt/public/common/jdk1.8.0_40/bin/java'' finished with non-zero exit value 1

* Try:
Run with --info or --debug option to get more log output.

* Exception is:
org.gradle.api.tasks.TaskExecutionException: Execution failed for task ':packaging:nano:publishBundlesAndFeatures'.
	at org.gradle.api.internal.tasks.execution.ExecuteActionsTaskExecuter.executeActions(ExecuteActionsTaskExecuter.java:69)
	at org.gradle.api.internal.tasks.execution.ExecuteActionsTaskExecuter.execute(ExecuteActionsTaskExecuter.java:46)
	at org.gradle.api.internal.tasks.execution.PostExecutionAnalysisTaskExecuter.execute(PostExecutionAnalysisTaskExecuter.java:35)
	at org.gradle.api.internal.tasks.execution.SkipUpToDateTaskExecuter.execute(SkipUpToDateTaskExecuter.java:64)
	at org.gradle.api.internal.tasks.execution.ValidatingTaskExecuter.execute(ValidatingTaskExecuter.java:58)
	at org.gradle.api.internal.tasks.execution.SkipEmptySourceFilesTaskExecuter.execute(SkipEmptySourceFilesTaskExecuter.java:42)
	at org.gradle.api.internal.tasks.execution.SkipTaskWithNoActionsExecuter.execute(SkipTaskWithNoActionsExecuter.java:52)
	at org.gradle.api.internal.tasks.execution.SkipOnlyIfTaskExecuter.execute(SkipOnlyIfTaskExecuter.java:53)
	at org.gradle.api.internal.tasks.execution.ExecuteAtMostOnceTaskExecuter.execute(ExecuteAtMostOnceTaskExecuter.java:43)
	at org.gradle.api.internal.AbstractTask.executeWithoutThrowingTaskFailure(AbstractTask.java:296)
	at org.gradle.execution.taskgraph.AbstractTaskPlanExecutor$TaskExecutorWorker.executeTask(AbstractTaskPlanExecutor.java:79)
	at org.gradle.execution.taskgraph.AbstractTaskPlanExecutor$TaskExecutorWorker.processTask(AbstractTaskPlanExecutor.java:63)
	at org.gradle.execution.taskgraph.AbstractTaskPlanExecutor$TaskExecutorWorker.run(AbstractTaskPlanExecutor.java:51)
	at org.gradle.execution.taskgraph.DefaultTaskPlanExecutor.process(DefaultTaskPlanExecutor.java:23)
	at org.gradle.execution.taskgraph.DefaultTaskGraphExecuter.execute(DefaultTaskGraphExecuter.java:86)
	at org.gradle.execution.SelectedTaskExecutionAction.execute(SelectedTaskExecutionAction.java:29)
	at org.gradle.execution.DefaultBuildExecuter.execute(DefaultBuildExecuter.java:61)
	at org.gradle.execution.DefaultBuildExecuter.access$200(DefaultBuildExecuter.java:23)
	at org.gradle.execution.DefaultBuildExecuter$2.proceed(DefaultBuildExecuter.java:67)
	at org.gradle.execution.DryRunBuildExecutionAction.execute(DryRunBuildExecutionAction.java:32)
	at org.gradle.execution.DefaultBuildExecuter.execute(DefaultBuildExecuter.java:61)
	at org.gradle.execution.DefaultBuildExecuter.execute(DefaultBuildExecuter.java:54)
	at org.gradle.initialization.DefaultGradleLauncher.doBuildStages(DefaultGradleLauncher.java:148)
	at org.gradle.initialization.DefaultGradleLauncher.doBuild(DefaultGradleLauncher.java:105)
	at org.gradle.initialization.DefaultGradleLauncher.run(DefaultGradleLauncher.java:85)
	at org.gradle.launcher.exec.InProcessBuildActionExecuter$DefaultBuildController.run(InProcessBuildActionExecuter.java:81)
	at org.gradle.launcher.cli.ExecuteBuildAction.run(ExecuteBuildAction.java:33)
	at org.gradle.launcher.cli.ExecuteBuildAction.run(ExecuteBuildAction.java:24)
	at org.gradle.launcher.exec.InProcessBuildActionExecuter.execute(InProcessBuildActionExecuter.java:39)
	at org.gradle.launcher.exec.InProcessBuildActionExecuter.execute(InProcessBuildActionExecuter.java:29)
	at org.gradle.launcher.cli.RunBuildAction.run(RunBuildAction.java:50)
	at org.gradle.internal.Actions$RunnableActionAdapter.execute(Actions.java:171)
	at org.gradle.launcher.cli.CommandLineActionFactory$ParseAndBuildAction.execute(CommandLineActionFactory.java:237)
	at org.gradle.launcher.cli.CommandLineActionFactory$ParseAndBuildAction.execute(CommandLineActionFactory.java:210)
	at org.gradle.launcher.cli.JavaRuntimeValidationAction.execute(JavaRuntimeValidationAction.java:35)
	at org.gradle.launcher.cli.JavaRuntimeValidationAction.execute(JavaRuntimeValidationAction.java:24)
	at org.gradle.launcher.cli.CommandLineActionFactory$WithLogging.execute(CommandLineActionFactory.java:206)
	at org.gradle.launcher.cli.CommandLineActionFactory$WithLogging.execute(CommandLineActionFactory.java:169)
	at org.gradle.launcher.cli.ExceptionReportingAction.execute(ExceptionReportingAction.java:33)
	at org.gradle.launcher.cli.ExceptionReportingAction.execute(ExceptionReportingAction.java:22)
	at org.gradle.launcher.Main.doAction(Main.java:33)
	at org.gradle.launcher.bootstrap.EntryPoint.run(EntryPoint.java:45)
	at sun.reflect.NativeMethodAccessorImpl.invoke0(Native Method)
	at sun.reflect.NativeMethodAccessorImpl.invoke(NativeMethodAccessorImpl.java:62)
	at sun.reflect.DelegatingMethodAccessorImpl.invoke(DelegatingMethodAccessorImpl.java:43)
	at java.lang.reflect.Method.invoke(Method.java:497)
	at org.gradle.launcher.bootstrap.ProcessBootstrap.runNoExit(ProcessBootstrap.java:54)
	at org.gradle.launcher.bootstrap.ProcessBootstrap.run(ProcessBootstrap.java:35)
	at org.gradle.launcher.GradleMain.main(GradleMain.java:23)
	at sun.reflect.NativeMethodAccessorImpl.invoke0(Native Method)
	at sun.reflect.NativeMethodAccessorImpl.invoke(NativeMethodAccessorImpl.java:62)
	at sun.reflect.DelegatingMethodAccessorImpl.invoke(DelegatingMethodAccessorImpl.java:43)
	at java.lang.reflect.Method.invoke(Method.java:497)
	at org.gradle.wrapper.BootstrapMainStarter.start(BootstrapMainStarter.java:30)
	at org.gradle.wrapper.WrapperExecutor.execute(WrapperExecutor.java:127)
	at org.gradle.wrapper.GradleWrapperMain.main(GradleWrapperMain.java:56)
Caused by: org.gradle.process.internal.ExecException: Process 'command '/opt/public/common/jdk1.8.0_40/bin/java'' finished with non-zero exit value 1
	at org.gradle.process.internal.DefaultExecHandle$ExecResultImpl.assertNormalExitValue(DefaultExecHandle.java:365)
	at org.gradle.process.internal.DefaultJavaExecAction.execute(DefaultJavaExecAction.java:31)
	at org.gradle.api.tasks.JavaExec.exec(JavaExec.java:60)
	at sun.reflect.NativeMethodAccessorImpl.invoke0(Native Method)
	at sun.reflect.NativeMethodAccessorImpl.invoke(NativeMethodAccessorImpl.java:62)
	at sun.reflect.DelegatingMethodAccessorImpl.invoke(DelegatingMethodAccessorImpl.java:43)
	at java.lang.reflect.Method.invoke(Method.java:497)
	at org.gradle.internal.reflect.JavaMethod.invoke(JavaMethod.java:63)
	at org.gradle.api.internal.project.taskfactory.AnnotationProcessingTaskFactory$StandardTaskAction.doExecute(AnnotationProcessingTaskFactory.java:218)
	at org.gradle.api.internal.project.taskfactory.AnnotationProcessingTaskFactory$StandardTaskAction.execute(AnnotationProcessingTaskFactory.java:211)
	at org.gradle.api.internal.project.taskfactory.AnnotationProcessingTaskFactory$StandardTaskAction.execute(AnnotationProcessingTaskFactory.java:200)
	at org.gradle.api.internal.AbstractTask$TaskActionWrapper.execute(AbstractTask.java:570)
	at org.gradle.api.internal.AbstractTask$TaskActionWrapper.execute(AbstractTask.java:553)
	at org.gradle.api.internal.tasks.execution.ExecuteActionsTaskExecuter.executeAction(ExecuteActionsTaskExecuter.java:80)
	at org.gradle.api.internal.tasks.execution.ExecuteActionsTaskExecuter.executeActions(ExecuteActionsTaskExecuter.java:61)
	... 55 more

==============================================================================

4: Task failed with an exception.
-----------
* What went wrong:
Execution failed for task ':packaging:tomcat-server:publishBundlesAndFeatures'.
> Process 'command '/opt/public/common/jdk1.8.0_40/bin/java'' finished with non-zero exit value 1

* Try:
Run with --info or --debug option to get more log output.

* Exception is:
org.gradle.api.tasks.TaskExecutionException: Execution failed for task ':packaging:tomcat-server:publishBundlesAndFeatures'.
	at org.gradle.api.internal.tasks.execution.ExecuteActionsTaskExecuter.executeActions(ExecuteActionsTaskExecuter.java:69)
	at org.gradle.api.internal.tasks.execution.ExecuteActionsTaskExecuter.execute(ExecuteActionsTaskExecuter.java:46)
	at org.gradle.api.internal.tasks.execution.PostExecutionAnalysisTaskExecuter.execute(PostExecutionAnalysisTaskExecuter.java:35)
	at org.gradle.api.internal.tasks.execution.SkipUpToDateTaskExecuter.execute(SkipUpToDateTaskExecuter.java:64)
	at org.gradle.api.internal.tasks.execution.ValidatingTaskExecuter.execute(ValidatingTaskExecuter.java:58)
	at org.gradle.api.internal.tasks.execution.SkipEmptySourceFilesTaskExecuter.execute(SkipEmptySourceFilesTaskExecuter.java:42)
	at org.gradle.api.internal.tasks.execution.SkipTaskWithNoActionsExecuter.execute(SkipTaskWithNoActionsExecuter.java:52)
	at org.gradle.api.internal.tasks.execution.SkipOnlyIfTaskExecuter.execute(SkipOnlyIfTaskExecuter.java:53)
	at org.gradle.api.internal.tasks.execution.ExecuteAtMostOnceTaskExecuter.execute(ExecuteAtMostOnceTaskExecuter.java:43)
	at org.gradle.api.internal.AbstractTask.executeWithoutThrowingTaskFailure(AbstractTask.java:296)
	at org.gradle.execution.taskgraph.AbstractTaskPlanExecutor$TaskExecutorWorker.executeTask(AbstractTaskPlanExecutor.java:79)
	at org.gradle.execution.taskgraph.AbstractTaskPlanExecutor$TaskExecutorWorker.processTask(AbstractTaskPlanExecutor.java:63)
	at org.gradle.execution.taskgraph.AbstractTaskPlanExecutor$TaskExecutorWorker.run(AbstractTaskPlanExecutor.java:51)
	at org.gradle.execution.taskgraph.DefaultTaskPlanExecutor.process(DefaultTaskPlanExecutor.java:23)
	at org.gradle.execution.taskgraph.DefaultTaskGraphExecuter.execute(DefaultTaskGraphExecuter.java:86)
	at org.gradle.execution.SelectedTaskExecutionAction.execute(SelectedTaskExecutionAction.java:29)
	at org.gradle.execution.DefaultBuildExecuter.execute(DefaultBuildExecuter.java:61)
	at org.gradle.execution.DefaultBuildExecuter.access$200(DefaultBuildExecuter.java:23)
	at org.gradle.execution.DefaultBuildExecuter$2.proceed(DefaultBuildExecuter.java:67)
	at org.gradle.execution.DryRunBuildExecutionAction.execute(DryRunBuildExecutionAction.java:32)
	at org.gradle.execution.DefaultBuildExecuter.execute(DefaultBuildExecuter.java:61)
	at org.gradle.execution.DefaultBuildExecuter.execute(DefaultBuildExecuter.java:54)
	at org.gradle.initialization.DefaultGradleLauncher.doBuildStages(DefaultGradleLauncher.java:148)
	at org.gradle.initialization.DefaultGradleLauncher.doBuild(DefaultGradleLauncher.java:105)
	at org.gradle.initialization.DefaultGradleLauncher.run(DefaultGradleLauncher.java:85)
	at org.gradle.launcher.exec.InProcessBuildActionExecuter$DefaultBuildController.run(InProcessBuildActionExecuter.java:81)
	at org.gradle.launcher.cli.ExecuteBuildAction.run(ExecuteBuildAction.java:33)
	at org.gradle.launcher.cli.ExecuteBuildAction.run(ExecuteBuildAction.java:24)
	at org.gradle.launcher.exec.InProcessBuildActionExecuter.execute(InProcessBuildActionExecuter.java:39)
	at org.gradle.launcher.exec.InProcessBuildActionExecuter.execute(InProcessBuildActionExecuter.java:29)
	at org.gradle.launcher.cli.RunBuildAction.run(RunBuildAction.java:50)
	at org.gradle.internal.Actions$RunnableActionAdapter.execute(Actions.java:171)
	at org.gradle.launcher.cli.CommandLineActionFactory$ParseAndBuildAction.execute(CommandLineActionFactory.java:237)
	at org.gradle.launcher.cli.CommandLineActionFactory$ParseAndBuildAction.execute(CommandLineActionFactory.java:210)
	at org.gradle.launcher.cli.JavaRuntimeValidationAction.execute(JavaRuntimeValidationAction.java:35)
	at org.gradle.launcher.cli.JavaRuntimeValidationAction.execute(JavaRuntimeValidationAction.java:24)
	at org.gradle.launcher.cli.CommandLineActionFactory$WithLogging.execute(CommandLineActionFactory.java:206)
	at org.gradle.launcher.cli.CommandLineActionFactory$WithLogging.execute(CommandLineActionFactory.java:169)
	at org.gradle.launcher.cli.ExceptionReportingAction.execute(ExceptionReportingAction.java:33)
	at org.gradle.launcher.cli.ExceptionReportingAction.execute(ExceptionReportingAction.java:22)
	at org.gradle.launcher.Main.doAction(Main.java:33)
	at org.gradle.launcher.bootstrap.EntryPoint.run(EntryPoint.java:45)
	at sun.reflect.NativeMethodAccessorImpl.invoke0(Native Method)
	at sun.reflect.NativeMethodAccessorImpl.invoke(NativeMethodAccessorImpl.java:62)
	at sun.reflect.DelegatingMethodAccessorImpl.invoke(DelegatingMethodAccessorImpl.java:43)
	at java.lang.reflect.Method.invoke(Method.java:497)
	at org.gradle.launcher.bootstrap.ProcessBootstrap.runNoExit(ProcessBootstrap.java:54)
	at org.gradle.launcher.bootstrap.ProcessBootstrap.run(ProcessBootstrap.java:35)
	at org.gradle.launcher.GradleMain.main(GradleMain.java:23)
	at sun.reflect.NativeMethodAccessorImpl.invoke0(Native Method)
	at sun.reflect.NativeMethodAccessorImpl.invoke(NativeMethodAccessorImpl.java:62)
	at sun.reflect.DelegatingMethodAccessorImpl.invoke(DelegatingMethodAccessorImpl.java:43)
	at java.lang.reflect.Method.invoke(Method.java:497)
	at org.gradle.wrapper.BootstrapMainStarter.start(BootstrapMainStarter.java:30)
	at org.gradle.wrapper.WrapperExecutor.execute(WrapperExecutor.java:127)
	at org.gradle.wrapper.GradleWrapperMain.main(GradleWrapperMain.java:56)
Caused by: org.gradle.process.internal.ExecException: Process 'command '/opt/public/common/jdk1.8.0_40/bin/java'' finished with non-zero exit value 1
	at org.gradle.process.internal.DefaultExecHandle$ExecResultImpl.assertNormalExitValue(DefaultExecHandle.java:365)
	at org.gradle.process.internal.DefaultJavaExecAction.execute(DefaultJavaExecAction.java:31)
	at org.gradle.api.tasks.JavaExec.exec(JavaExec.java:60)
	at sun.reflect.NativeMethodAccessorImpl.invoke0(Native Method)
	at sun.reflect.NativeMethodAccessorImpl.invoke(NativeMethodAccessorImpl.java:62)
	at sun.reflect.DelegatingMethodAccessorImpl.invoke(DelegatingMethodAccessorImpl.java:43)
	at java.lang.reflect.Method.invoke(Method.java:497)
	at org.gradle.internal.reflect.JavaMethod.invoke(JavaMethod.java:63)
	at org.gradle.api.internal.project.taskfactory.AnnotationProcessingTaskFactory$StandardTaskAction.doExecute(AnnotationProcessingTaskFactory.java:218)
	at org.gradle.api.internal.project.taskfactory.AnnotationProcessingTaskFactory$StandardTaskAction.execute(AnnotationProcessingTaskFactory.java:211)
	at org.gradle.api.internal.project.taskfactory.AnnotationProcessingTaskFactory$StandardTaskAction.execute(AnnotationProcessingTaskFactory.java:200)
	at org.gradle.api.internal.AbstractTask$TaskActionWrapper.execute(AbstractTask.java:570)
	at org.gradle.api.internal.AbstractTask$TaskActionWrapper.execute(AbstractTask.java:553)
	at org.gradle.api.internal.tasks.execution.ExecuteActionsTaskExecuter.executeAction(ExecuteActionsTaskExecuter.java:80)
	at org.gradle.api.internal.tasks.execution.ExecuteActionsTaskExecuter.executeActions(ExecuteActionsTaskExecuter.java:61)
	... 55 more

==============================================================================

5: Task failed with an exception.
-----------
* What went wrong:
Execution failed for task ':packaging:jetty-server:org.eclipse.virgo.jetty.smoketest:smokeTest'.
> There were failing tests. See the report at: file:///jobs/genie.virgo/gradle-build-with-smoke-test/workspace/packaging/jetty-server/org.eclipse.virgo.jetty.smoketest/build/reports/tests/index.html

* Try:
Run with --info or --debug option to get more log output.

* Exception is:
org.gradle.api.tasks.TaskExecutionException: Execution failed for task ':packaging:jetty-server:org.eclipse.virgo.jetty.smoketest:smokeTest'.
	at org.gradle.api.internal.tasks.execution.ExecuteActionsTaskExecuter.executeActions(ExecuteActionsTaskExecuter.java:69)
	at org.gradle.api.internal.tasks.execution.ExecuteActionsTaskExecuter.execute(ExecuteActionsTaskExecuter.java:46)
	at org.gradle.api.internal.tasks.execution.PostExecutionAnalysisTaskExecuter.execute(PostExecutionAnalysisTaskExecuter.java:35)
	at org.gradle.api.internal.tasks.execution.SkipUpToDateTaskExecuter.execute(SkipUpToDateTaskExecuter.java:64)
	at org.gradle.api.internal.tasks.execution.ValidatingTaskExecuter.execute(ValidatingTaskExecuter.java:58)
	at org.gradle.api.internal.tasks.execution.SkipEmptySourceFilesTaskExecuter.execute(SkipEmptySourceFilesTaskExecuter.java:42)
	at org.gradle.api.internal.tasks.execution.SkipTaskWithNoActionsExecuter.execute(SkipTaskWithNoActionsExecuter.java:52)
	at org.gradle.api.internal.tasks.execution.SkipOnlyIfTaskExecuter.execute(SkipOnlyIfTaskExecuter.java:53)
	at org.gradle.api.internal.tasks.execution.ExecuteAtMostOnceTaskExecuter.execute(ExecuteAtMostOnceTaskExecuter.java:43)
	at org.gradle.api.internal.AbstractTask.executeWithoutThrowingTaskFailure(AbstractTask.java:296)
	at org.gradle.execution.taskgraph.AbstractTaskPlanExecutor$TaskExecutorWorker.executeTask(AbstractTaskPlanExecutor.java:79)
	at org.gradle.execution.taskgraph.AbstractTaskPlanExecutor$TaskExecutorWorker.processTask(AbstractTaskPlanExecutor.java:63)
	at org.gradle.execution.taskgraph.AbstractTaskPlanExecutor$TaskExecutorWorker.run(AbstractTaskPlanExecutor.java:51)
	at org.gradle.execution.taskgraph.DefaultTaskPlanExecutor.process(DefaultTaskPlanExecutor.java:23)
	at org.gradle.execution.taskgraph.DefaultTaskGraphExecuter.execute(DefaultTaskGraphExecuter.java:86)
	at org.gradle.execution.SelectedTaskExecutionAction.execute(SelectedTaskExecutionAction.java:29)
	at org.gradle.execution.DefaultBuildExecuter.execute(DefaultBuildExecuter.java:61)
	at org.gradle.execution.DefaultBuildExecuter.access$200(DefaultBuildExecuter.java:23)
	at org.gradle.execution.DefaultBuildExecuter$2.proceed(DefaultBuildExecuter.java:67)
	at org.gradle.execution.DryRunBuildExecutionAction.execute(DryRunBuildExecutionAction.java:32)
	at org.gradle.execution.DefaultBuildExecuter.execute(DefaultBuildExecuter.java:61)
	at org.gradle.execution.DefaultBuildExecuter.execute(DefaultBuildExecuter.java:54)
	at org.gradle.initialization.DefaultGradleLauncher.doBuildStages(DefaultGradleLauncher.java:148)
	at org.gradle.initialization.DefaultGradleLauncher.doBuild(DefaultGradleLauncher.java:105)
	at org.gradle.initialization.DefaultGradleLauncher.run(DefaultGradleLauncher.java:85)
	at org.gradle.launcher.exec.InProcessBuildActionExecuter$DefaultBuildController.run(InProcessBuildActionExecuter.java:81)
	at org.gradle.launcher.cli.ExecuteBuildAction.run(ExecuteBuildAction.java:33)
	at org.gradle.launcher.cli.ExecuteBuildAction.run(ExecuteBuildAction.java:24)
	at org.gradle.launcher.exec.InProcessBuildActionExecuter.execute(InProcessBuildActionExecuter.java:39)
	at org.gradle.launcher.exec.InProcessBuildActionExecuter.execute(InProcessBuildActionExecuter.java:29)
	at org.gradle.launcher.cli.RunBuildAction.run(RunBuildAction.java:50)
	at org.gradle.internal.Actions$RunnableActionAdapter.execute(Actions.java:171)
	at org.gradle.launcher.cli.CommandLineActionFactory$ParseAndBuildAction.execute(CommandLineActionFactory.java:237)
	at org.gradle.launcher.cli.CommandLineActionFactory$ParseAndBuildAction.execute(CommandLineActionFactory.java:210)
	at org.gradle.launcher.cli.JavaRuntimeValidationAction.execute(JavaRuntimeValidationAction.java:35)
	at org.gradle.launcher.cli.JavaRuntimeValidationAction.execute(JavaRuntimeValidationAction.java:24)
	at org.gradle.launcher.cli.CommandLineActionFactory$WithLogging.execute(CommandLineActionFactory.java:206)
	at org.gradle.launcher.cli.CommandLineActionFactory$WithLogging.execute(CommandLineActionFactory.java:169)
	at org.gradle.launcher.cli.ExceptionReportingAction.execute(ExceptionReportingAction.java:33)
	at org.gradle.launcher.cli.ExceptionReportingAction.execute(ExceptionReportingAction.java:22)
	at org.gradle.launcher.Main.doAction(Main.java:33)
	at org.gradle.launcher.bootstrap.EntryPoint.run(EntryPoint.java:45)
	at sun.reflect.NativeMethodAccessorImpl.invoke0(Native Method)
	at sun.reflect.NativeMethodAccessorImpl.invoke(NativeMethodAccessorImpl.java:62)
	at sun.reflect.DelegatingMethodAccessorImpl.invoke(DelegatingMethodAccessorImpl.java:43)
	at java.lang.reflect.Method.invoke(Method.java:497)
	at org.gradle.launcher.bootstrap.ProcessBootstrap.runNoExit(ProcessBootstrap.java:54)
	at org.gradle.launcher.bootstrap.ProcessBootstrap.run(ProcessBootstrap.java:35)
	at org.gradle.launcher.GradleMain.main(GradleMain.java:23)
	at sun.reflect.NativeMethodAccessorImpl.invoke0(Native Method)
	at sun.reflect.NativeMethodAccessorImpl.invoke(NativeMethodAccessorImpl.java:62)
	at sun.reflect.DelegatingMethodAccessorImpl.invoke(DelegatingMethodAccessorImpl.java:43)
	at java.lang.reflect.Method.invoke(Method.java:497)
	at org.gradle.wrapper.BootstrapMainStarter.start(BootstrapMainStarter.java:30)
	at org.gradle.wrapper.WrapperExecutor.execute(WrapperExecutor.java:127)
	at org.gradle.wrapper.GradleWrapperMain.main(GradleWrapperMain.java:56)
Caused by: org.gradle.api.GradleException: There were failing tests. See the report at: file:///jobs/genie.virgo/gradle-build-with-smoke-test/workspace/packaging/jetty-server/org.eclipse.virgo.jetty.smoketest/build/reports/tests/index.html
	at org.gradle.api.tasks.testing.Test.handleTestFailures(Test.java:1111)
	at org.gradle.api.tasks.testing.Test.executeTests(Test.java:542)
	at sun.reflect.GeneratedMethodAccessor523.invoke(Unknown Source)
	at sun.reflect.DelegatingMethodAccessorImpl.invoke(DelegatingMethodAccessorImpl.java:43)
	at java.lang.reflect.Method.invoke(Method.java:497)
	at org.gradle.internal.reflect.JavaMethod.invoke(JavaMethod.java:63)
	at org.gradle.api.internal.project.taskfactory.AnnotationProcessingTaskFactory$StandardTaskAction.doExecute(AnnotationProcessingTaskFactory.java:218)
	at org.gradle.api.internal.project.taskfactory.AnnotationProcessingTaskFactory$StandardTaskAction.execute(AnnotationProcessingTaskFactory.java:211)
	at org.gradle.api.internal.project.taskfactory.AnnotationProcessingTaskFactory$StandardTaskAction.execute(AnnotationProcessingTaskFactory.java:200)
	at org.gradle.api.internal.AbstractTask$TaskActionWrapper.execute(AbstractTask.java:570)
	at org.gradle.api.internal.AbstractTask$TaskActionWrapper.execute(AbstractTask.java:553)
	at org.gradle.api.internal.tasks.execution.ExecuteActionsTaskExecuter.executeAction(ExecuteActionsTaskExecuter.java:80)
	at org.gradle.api.internal.tasks.execution.ExecuteActionsTaskExecuter.executeActions(ExecuteActionsTaskExecuter.java:61)
	... 55 more

==============================================================================

6: Task failed with an exception.
-----------
* What went wrong:
Execution failed for task ':packaging:kernel:org.eclipse.virgo.kernel.smoketest:smokeTest'.
> There were failing tests. See the report at: file:///jobs/genie.virgo/gradle-build-with-smoke-test/workspace/packaging/kernel/org.eclipse.virgo.kernel.smoketest/build/reports/tests/index.html

* Try:
Run with --info or --debug option to get more log output.

* Exception is:
org.gradle.api.tasks.TaskExecutionException: Execution failed for task ':packaging:kernel:org.eclipse.virgo.kernel.smoketest:smokeTest'.
	at org.gradle.api.internal.tasks.execution.ExecuteActionsTaskExecuter.executeActions(ExecuteActionsTaskExecuter.java:69)
	at org.gradle.api.internal.tasks.execution.ExecuteActionsTaskExecuter.execute(ExecuteActionsTaskExecuter.java:46)
	at org.gradle.api.internal.tasks.execution.PostExecutionAnalysisTaskExecuter.execute(PostExecutionAnalysisTaskExecuter.java:35)
	at org.gradle.api.internal.tasks.execution.SkipUpToDateTaskExecuter.execute(SkipUpToDateTaskExecuter.java:64)
	at org.gradle.api.internal.tasks.execution.ValidatingTaskExecuter.execute(ValidatingTaskExecuter.java:58)
	at org.gradle.api.internal.tasks.execution.SkipEmptySourceFilesTaskExecuter.execute(SkipEmptySourceFilesTaskExecuter.java:42)
	at org.gradle.api.internal.tasks.execution.SkipTaskWithNoActionsExecuter.execute(SkipTaskWithNoActionsExecuter.java:52)
	at org.gradle.api.internal.tasks.execution.SkipOnlyIfTaskExecuter.execute(SkipOnlyIfTaskExecuter.java:53)
	at org.gradle.api.internal.tasks.execution.ExecuteAtMostOnceTaskExecuter.execute(ExecuteAtMostOnceTaskExecuter.java:43)
	at org.gradle.api.internal.AbstractTask.executeWithoutThrowingTaskFailure(AbstractTask.java:296)
	at org.gradle.execution.taskgraph.AbstractTaskPlanExecutor$TaskExecutorWorker.executeTask(AbstractTaskPlanExecutor.java:79)
	at org.gradle.execution.taskgraph.AbstractTaskPlanExecutor$TaskExecutorWorker.processTask(AbstractTaskPlanExecutor.java:63)
	at org.gradle.execution.taskgraph.AbstractTaskPlanExecutor$TaskExecutorWorker.run(AbstractTaskPlanExecutor.java:51)
	at org.gradle.execution.taskgraph.DefaultTaskPlanExecutor.process(DefaultTaskPlanExecutor.java:23)
	at org.gradle.execution.taskgraph.DefaultTaskGraphExecuter.execute(DefaultTaskGraphExecuter.java:86)
	at org.gradle.execution.SelectedTaskExecutionAction.execute(SelectedTaskExecutionAction.java:29)
	at org.gradle.execution.DefaultBuildExecuter.execute(DefaultBuildExecuter.java:61)
	at org.gradle.execution.DefaultBuildExecuter.access$200(DefaultBuildExecuter.java:23)
	at org.gradle.execution.DefaultBuildExecuter$2.proceed(DefaultBuildExecuter.java:67)
	at org.gradle.execution.DryRunBuildExecutionAction.execute(DryRunBuildExecutionAction.java:32)
	at org.gradle.execution.DefaultBuildExecuter.execute(DefaultBuildExecuter.java:61)
	at org.gradle.execution.DefaultBuildExecuter.execute(DefaultBuildExecuter.java:54)
	at org.gradle.initialization.DefaultGradleLauncher.doBuildStages(DefaultGradleLauncher.java:148)
	at org.gradle.initialization.DefaultGradleLauncher.doBuild(DefaultGradleLauncher.java:105)
	at org.gradle.initialization.DefaultGradleLauncher.run(DefaultGradleLauncher.java:85)
	at org.gradle.launcher.exec.InProcessBuildActionExecuter$DefaultBuildController.run(InProcessBuildActionExecuter.java:81)
	at org.gradle.launcher.cli.ExecuteBuildAction.run(ExecuteBuildAction.java:33)
	at org.gradle.launcher.cli.ExecuteBuildAction.run(ExecuteBuildAction.java:24)
	at org.gradle.launcher.exec.InProcessBuildActionExecuter.execute(InProcessBuildActionExecuter.java:39)
	at org.gradle.launcher.exec.InProcessBuildActionExecuter.execute(InProcessBuildActionExecuter.java:29)
	at org.gradle.launcher.cli.RunBuildAction.run(RunBuildAction.java:50)
	at org.gradle.internal.Actions$RunnableActionAdapter.execute(Actions.java:171)
	at org.gradle.launcher.cli.CommandLineActionFactory$ParseAndBuildAction.execute(CommandLineActionFactory.java:237)
	at org.gradle.launcher.cli.CommandLineActionFactory$ParseAndBuildAction.execute(CommandLineActionFactory.java:210)
	at org.gradle.launcher.cli.JavaRuntimeValidationAction.execute(JavaRuntimeValidationAction.java:35)
	at org.gradle.launcher.cli.JavaRuntimeValidationAction.execute(JavaRuntimeValidationAction.java:24)
	at org.gradle.launcher.cli.CommandLineActionFactory$WithLogging.execute(CommandLineActionFactory.java:206)
	at org.gradle.launcher.cli.CommandLineActionFactory$WithLogging.execute(CommandLineActionFactory.java:169)
	at org.gradle.launcher.cli.ExceptionReportingAction.execute(ExceptionReportingAction.java:33)
	at org.gradle.launcher.cli.ExceptionReportingAction.execute(ExceptionReportingAction.java:22)
	at org.gradle.launcher.Main.doAction(Main.java:33)
	at org.gradle.launcher.bootstrap.EntryPoint.run(EntryPoint.java:45)
	at sun.reflect.NativeMethodAccessorImpl.invoke0(Native Method)
	at sun.reflect.NativeMethodAccessorImpl.invoke(NativeMethodAccessorImpl.java:62)
	at sun.reflect.DelegatingMethodAccessorImpl.invoke(DelegatingMethodAccessorImpl.java:43)
	at java.lang.reflect.Method.invoke(Method.java:497)
	at org.gradle.launcher.bootstrap.ProcessBootstrap.runNoExit(ProcessBootstrap.java:54)
	at org.gradle.launcher.bootstrap.ProcessBootstrap.run(ProcessBootstrap.java:35)
	at org.gradle.launcher.GradleMain.main(GradleMain.java:23)
	at sun.reflect.NativeMethodAccessorImpl.invoke0(Native Method)
	at sun.reflect.NativeMethodAccessorImpl.invoke(NativeMethodAccessorImpl.java:62)
	at sun.reflect.DelegatingMethodAccessorImpl.invoke(DelegatingMethodAccessorImpl.java:43)
	at java.lang.reflect.Method.invoke(Method.java:497)
	at org.gradle.wrapper.BootstrapMainStarter.start(BootstrapMainStarter.java:30)
	at org.gradle.wrapper.WrapperExecutor.execute(WrapperExecutor.java:127)
	at org.gradle.wrapper.GradleWrapperMain.main(GradleWrapperMain.java:56)
Caused by: org.gradle.api.GradleException: There were failing tests. See the report at: file:///jobs/genie.virgo/gradle-build-with-smoke-test/workspace/packaging/kernel/org.eclipse.virgo.kernel.smoketest/build/reports/tests/index.html
	at org.gradle.api.tasks.testing.Test.handleTestFailures(Test.java:1111)
	at org.gradle.api.tasks.testing.Test.executeTests(Test.java:542)
	at sun.reflect.GeneratedMethodAccessor523.invoke(Unknown Source)
	at sun.reflect.DelegatingMethodAccessorImpl.invoke(DelegatingMethodAccessorImpl.java:43)
	at java.lang.reflect.Method.invoke(Method.java:497)
	at org.gradle.internal.reflect.JavaMethod.invoke(JavaMethod.java:63)
	at org.gradle.api.internal.project.taskfactory.AnnotationProcessingTaskFactory$StandardTaskAction.doExecute(AnnotationProcessingTaskFactory.java:218)
	at org.gradle.api.internal.project.taskfactory.AnnotationProcessingTaskFactory$StandardTaskAction.execute(AnnotationProcessingTaskFactory.java:211)
	at org.gradle.api.internal.project.taskfactory.AnnotationProcessingTaskFactory$StandardTaskAction.execute(AnnotationProcessingTaskFactory.java:200)
	at org.gradle.api.internal.AbstractTask$TaskActionWrapper.execute(AbstractTask.java:570)
	at org.gradle.api.internal.AbstractTask$TaskActionWrapper.execute(AbstractTask.java:553)
	at org.gradle.api.internal.tasks.execution.ExecuteActionsTaskExecuter.executeAction(ExecuteActionsTaskExecuter.java:80)
	at org.gradle.api.internal.tasks.execution.ExecuteActionsTaskExecuter.executeActions(ExecuteActionsTaskExecuter.java:61)
	... 55 more

==============================================================================

7: Task failed with an exception.
-----------
* What went wrong:
Execution failed for task ':packaging:nano:org.eclipse.virgo.nano.smoketest:smokeTest'.
> There were failing tests. See the report at: file:///jobs/genie.virgo/gradle-build-with-smoke-test/workspace/packaging/nano/org.eclipse.virgo.nano.smoketest/build/reports/tests/index.html

* Try:
Run with --info or --debug option to get more log output.

* Exception is:
org.gradle.api.tasks.TaskExecutionException: Execution failed for task ':packaging:nano:org.eclipse.virgo.nano.smoketest:smokeTest'.
	at org.gradle.api.internal.tasks.execution.ExecuteActionsTaskExecuter.executeActions(ExecuteActionsTaskExecuter.java:69)
	at org.gradle.api.internal.tasks.execution.ExecuteActionsTaskExecuter.execute(ExecuteActionsTaskExecuter.java:46)
	at org.gradle.api.internal.tasks.execution.PostExecutionAnalysisTaskExecuter.execute(PostExecutionAnalysisTaskExecuter.java:35)
	at org.gradle.api.internal.tasks.execution.SkipUpToDateTaskExecuter.execute(SkipUpToDateTaskExecuter.java:64)
	at org.gradle.api.internal.tasks.execution.ValidatingTaskExecuter.execute(ValidatingTaskExecuter.java:58)
	at org.gradle.api.internal.tasks.execution.SkipEmptySourceFilesTaskExecuter.execute(SkipEmptySourceFilesTaskExecuter.java:42)
	at org.gradle.api.internal.tasks.execution.SkipTaskWithNoActionsExecuter.execute(SkipTaskWithNoActionsExecuter.java:52)
	at org.gradle.api.internal.tasks.execution.SkipOnlyIfTaskExecuter.execute(SkipOnlyIfTaskExecuter.java:53)
	at org.gradle.api.internal.tasks.execution.ExecuteAtMostOnceTaskExecuter.execute(ExecuteAtMostOnceTaskExecuter.java:43)
	at org.gradle.api.internal.AbstractTask.executeWithoutThrowingTaskFailure(AbstractTask.java:296)
	at org.gradle.execution.taskgraph.AbstractTaskPlanExecutor$TaskExecutorWorker.executeTask(AbstractTaskPlanExecutor.java:79)
	at org.gradle.execution.taskgraph.AbstractTaskPlanExecutor$TaskExecutorWorker.processTask(AbstractTaskPlanExecutor.java:63)
	at org.gradle.execution.taskgraph.AbstractTaskPlanExecutor$TaskExecutorWorker.run(AbstractTaskPlanExecutor.java:51)
	at org.gradle.execution.taskgraph.DefaultTaskPlanExecutor.process(DefaultTaskPlanExecutor.java:23)
	at org.gradle.execution.taskgraph.DefaultTaskGraphExecuter.execute(DefaultTaskGraphExecuter.java:86)
	at org.gradle.execution.SelectedTaskExecutionAction.execute(SelectedTaskExecutionAction.java:29)
	at org.gradle.execution.DefaultBuildExecuter.execute(DefaultBuildExecuter.java:61)
	at org.gradle.execution.DefaultBuildExecuter.access$200(DefaultBuildExecuter.java:23)
	at org.gradle.execution.DefaultBuildExecuter$2.proceed(DefaultBuildExecuter.java:67)
	at org.gradle.execution.DryRunBuildExecutionAction.execute(DryRunBuildExecutionAction.java:32)
	at org.gradle.execution.DefaultBuildExecuter.execute(DefaultBuildExecuter.java:61)
	at org.gradle.execution.DefaultBuildExecuter.execute(DefaultBuildExecuter.java:54)
	at org.gradle.initialization.DefaultGradleLauncher.doBuildStages(DefaultGradleLauncher.java:148)
	at org.gradle.initialization.DefaultGradleLauncher.doBuild(DefaultGradleLauncher.java:105)
	at org.gradle.initialization.DefaultGradleLauncher.run(DefaultGradleLauncher.java:85)
	at org.gradle.launcher.exec.InProcessBuildActionExecuter$DefaultBuildController.run(InProcessBuildActionExecuter.java:81)
	at org.gradle.launcher.cli.ExecuteBuildAction.run(ExecuteBuildAction.java:33)
	at org.gradle.launcher.cli.ExecuteBuildAction.run(ExecuteBuildAction.java:24)
	at org.gradle.launcher.exec.InProcessBuildActionExecuter.execute(InProcessBuildActionExecuter.java:39)
	at org.gradle.launcher.exec.InProcessBuildActionExecuter.execute(InProcessBuildActionExecuter.java:29)
	at org.gradle.launcher.cli.RunBuildAction.run(RunBuildAction.java:50)
	at org.gradle.internal.Actions$RunnableActionAdapter.execute(Actions.java:171)
	at org.gradle.launcher.cli.CommandLineActionFactory$ParseAndBuildAction.execute(CommandLineActionFactory.java:237)
	at org.gradle.launcher.cli.CommandLineActionFactory$ParseAndBuildAction.execute(CommandLineActionFactory.java:210)
	at org.gradle.launcher.cli.JavaRuntimeValidationAction.execute(JavaRuntimeValidationAction.java:35)
	at org.gradle.launcher.cli.JavaRuntimeValidationAction.execute(JavaRuntimeValidationAction.java:24)
	at org.gradle.launcher.cli.CommandLineActionFactory$WithLogging.execute(CommandLineActionFactory.java:206)
	at org.gradle.launcher.cli.CommandLineActionFactory$WithLogging.execute(CommandLineActionFactory.java:169)
	at org.gradle.launcher.cli.ExceptionReportingAction.execute(ExceptionReportingAction.java:33)
	at org.gradle.launcher.cli.ExceptionReportingAction.execute(ExceptionReportingAction.java:22)
	at org.gradle.launcher.Main.doAction(Main.java:33)
	at org.gradle.launcher.bootstrap.EntryPoint.run(EntryPoint.java:45)
	at sun.reflect.NativeMethodAccessorImpl.invoke0(Native Method)
	at sun.reflect.NativeMethodAccessorImpl.invoke(NativeMethodAccessorImpl.java:62)
	at sun.reflect.DelegatingMethodAccessorImpl.invoke(DelegatingMethodAccessorImpl.java:43)
	at java.lang.reflect.Method.invoke(Method.java:497)
	at org.gradle.launcher.bootstrap.ProcessBootstrap.runNoExit(ProcessBootstrap.java:54)
	at org.gradle.launcher.bootstrap.ProcessBootstrap.run(ProcessBootstrap.java:35)
	at org.gradle.launcher.GradleMain.main(GradleMain.java:23)
	at sun.reflect.NativeMethodAccessorImpl.invoke0(Native Method)
	at sun.reflect.NativeMethodAccessorImpl.invoke(NativeMethodAccessorImpl.java:62)
	at sun.reflect.DelegatingMethodAccessorImpl.invoke(DelegatingMethodAccessorImpl.java:43)
	at java.lang.reflect.Method.invoke(Method.java:497)
	at org.gradle.wrapper.BootstrapMainStarter.start(BootstrapMainStarter.java:30)
	at org.gradle.wrapper.WrapperExecutor.execute(WrapperExecutor.java:127)
	at org.gradle.wrapper.GradleWrapperMain.main(GradleWrapperMain.java:56)
Caused by: org.gradle.api.GradleException: There were failing tests. See the report at: file:///jobs/genie.virgo/gradle-build-with-smoke-test/workspace/packaging/nano/org.eclipse.virgo.nano.smoketest/build/reports/tests/index.html
	at org.gradle.api.tasks.testing.Test.handleTestFailures(Test.java:1111)
	at org.gradle.api.tasks.testing.Test.executeTests(Test.java:542)
	at sun.reflect.GeneratedMethodAccessor523.invoke(Unknown Source)
	at sun.reflect.DelegatingMethodAccessorImpl.invoke(DelegatingMethodAccessorImpl.java:43)
	at java.lang.reflect.Method.invoke(Method.java:497)
	at org.gradle.internal.reflect.JavaMethod.invoke(JavaMethod.java:63)
	at org.gradle.api.internal.project.taskfactory.AnnotationProcessingTaskFactory$StandardTaskAction.doExecute(AnnotationProcessingTaskFactory.java:218)
	at org.gradle.api.internal.project.taskfactory.AnnotationProcessingTaskFactory$StandardTaskAction.execute(AnnotationProcessingTaskFactory.java:211)
	at org.gradle.api.internal.project.taskfactory.AnnotationProcessingTaskFactory$StandardTaskAction.execute(AnnotationProcessingTaskFactory.java:200)
	at org.gradle.api.internal.AbstractTask$TaskActionWrapper.execute(AbstractTask.java:570)
	at org.gradle.api.internal.AbstractTask$TaskActionWrapper.execute(AbstractTask.java:553)
	at org.gradle.api.internal.tasks.execution.ExecuteActionsTaskExecuter.executeAction(ExecuteActionsTaskExecuter.java:80)
	at org.gradle.api.internal.tasks.execution.ExecuteActionsTaskExecuter.executeActions(ExecuteActionsTaskExecuter.java:61)
	... 55 more

==============================================================================

8: Task failed with an exception.
-----------
* What went wrong:
Execution failed for task ':packaging:tomcat-server:org.eclipse.virgo.tomcat.smoketest:smokeTest'.
> There were failing tests. See the report at: file:///jobs/genie.virgo/gradle-build-with-smoke-test/workspace/packaging/tomcat-server/org.eclipse.virgo.tomcat.smoketest/build/reports/tests/index.html

* Try:
Run with --info or --debug option to get more log output.

* Exception is:
org.gradle.api.tasks.TaskExecutionException: Execution failed for task ':packaging:tomcat-server:org.eclipse.virgo.tomcat.smoketest:smokeTest'.
	at org.gradle.api.internal.tasks.execution.ExecuteActionsTaskExecuter.executeActions(ExecuteActionsTaskExecuter.java:69)
	at org.gradle.api.internal.tasks.execution.ExecuteActionsTaskExecuter.execute(ExecuteActionsTaskExecuter.java:46)
	at org.gradle.api.internal.tasks.execution.PostExecutionAnalysisTaskExecuter.execute(PostExecutionAnalysisTaskExecuter.java:35)
	at org.gradle.api.internal.tasks.execution.SkipUpToDateTaskExecuter.execute(SkipUpToDateTaskExecuter.java:64)
	at org.gradle.api.internal.tasks.execution.ValidatingTaskExecuter.execute(ValidatingTaskExecuter.java:58)
	at org.gradle.api.internal.tasks.execution.SkipEmptySourceFilesTaskExecuter.execute(SkipEmptySourceFilesTaskExecuter.java:42)
	at org.gradle.api.internal.tasks.execution.SkipTaskWithNoActionsExecuter.execute(SkipTaskWithNoActionsExecuter.java:52)
	at org.gradle.api.internal.tasks.execution.SkipOnlyIfTaskExecuter.execute(SkipOnlyIfTaskExecuter.java:53)
	at org.gradle.api.internal.tasks.execution.ExecuteAtMostOnceTaskExecuter.execute(ExecuteAtMostOnceTaskExecuter.java:43)
	at org.gradle.api.internal.AbstractTask.executeWithoutThrowingTaskFailure(AbstractTask.java:296)
	at org.gradle.execution.taskgraph.AbstractTaskPlanExecutor$TaskExecutorWorker.executeTask(AbstractTaskPlanExecutor.java:79)
	at org.gradle.execution.taskgraph.AbstractTaskPlanExecutor$TaskExecutorWorker.processTask(AbstractTaskPlanExecutor.java:63)
	at org.gradle.execution.taskgraph.AbstractTaskPlanExecutor$TaskExecutorWorker.run(AbstractTaskPlanExecutor.java:51)
	at org.gradle.execution.taskgraph.DefaultTaskPlanExecutor.process(DefaultTaskPlanExecutor.java:23)
	at org.gradle.execution.taskgraph.DefaultTaskGraphExecuter.execute(DefaultTaskGraphExecuter.java:86)
	at org.gradle.execution.SelectedTaskExecutionAction.execute(SelectedTaskExecutionAction.java:29)
	at org.gradle.execution.DefaultBuildExecuter.execute(DefaultBuildExecuter.java:61)
	at org.gradle.execution.DefaultBuildExecuter.access$200(DefaultBuildExecuter.java:23)
	at org.gradle.execution.DefaultBuildExecuter$2.proceed(DefaultBuildExecuter.java:67)
	at org.gradle.execution.DryRunBuildExecutionAction.execute(DryRunBuildExecutionAction.java:32)
	at org.gradle.execution.DefaultBuildExecuter.execute(DefaultBuildExecuter.java:61)
	at org.gradle.execution.DefaultBuildExecuter.execute(DefaultBuildExecuter.java:54)
	at org.gradle.initialization.DefaultGradleLauncher.doBuildStages(DefaultGradleLauncher.java:148)
	at org.gradle.initialization.DefaultGradleLauncher.doBuild(DefaultGradleLauncher.java:105)
	at org.gradle.initialization.DefaultGradleLauncher.run(DefaultGradleLauncher.java:85)
	at org.gradle.launcher.exec.InProcessBuildActionExecuter$DefaultBuildController.run(InProcessBuildActionExecuter.java:81)
	at org.gradle.launcher.cli.ExecuteBuildAction.run(ExecuteBuildAction.java:33)
	at org.gradle.launcher.cli.ExecuteBuildAction.run(ExecuteBuildAction.java:24)
	at org.gradle.launcher.exec.InProcessBuildActionExecuter.execute(InProcessBuildActionExecuter.java:39)
	at org.gradle.launcher.exec.InProcessBuildActionExecuter.execute(InProcessBuildActionExecuter.java:29)
	at org.gradle.launcher.cli.RunBuildAction.run(RunBuildAction.java:50)
	at org.gradle.internal.Actions$RunnableActionAdapter.execute(Actions.java:171)
	at org.gradle.launcher.cli.CommandLineActionFactory$ParseAndBuildAction.execute(CommandLineActionFactory.java:237)
	at org.gradle.launcher.cli.CommandLineActionFactory$ParseAndBuildAction.execute(CommandLineActionFactory.java:210)
	at org.gradle.launcher.cli.JavaRuntimeValidationAction.execute(JavaRuntimeValidationAction.java:35)
	at org.gradle.launcher.cli.JavaRuntimeValidationAction.execute(JavaRuntimeValidationAction.java:24)
	at org.gradle.launcher.cli.CommandLineActionFactory$WithLogging.execute(CommandLineActionFactory.java:206)
	at org.gradle.launcher.cli.CommandLineActionFactory$WithLogging.execute(CommandLineActionFactory.java:169)
	at org.gradle.launcher.cli.ExceptionReportingAction.execute(ExceptionReportingAction.java:33)
	at org.gradle.launcher.cli.ExceptionReportingAction.execute(ExceptionReportingAction.java:22)
	at org.gradle.launcher.Main.doAction(Main.java:33)
	at org.gradle.launcher.bootstrap.EntryPoint.run(EntryPoint.java:45)
	at sun.reflect.NativeMethodAccessorImpl.invoke0(Native Method)
	at sun.reflect.NativeMethodAccessorImpl.invoke(NativeMethodAccessorImpl.java:62)
	at sun.reflect.DelegatingMethodAccessorImpl.invoke(DelegatingMethodAccessorImpl.java:43)
	at java.lang.reflect.Method.invoke(Method.java:497)
	at org.gradle.launcher.bootstrap.ProcessBootstrap.runNoExit(ProcessBootstrap.java:54)
	at org.gradle.launcher.bootstrap.ProcessBootstrap.run(ProcessBootstrap.java:35)
	at org.gradle.launcher.GradleMain.main(GradleMain.java:23)
	at sun.reflect.NativeMethodAccessorImpl.invoke0(Native Method)
	at sun.reflect.NativeMethodAccessorImpl.invoke(NativeMethodAccessorImpl.java:62)
	at sun.reflect.DelegatingMethodAccessorImpl.invoke(DelegatingMethodAccessorImpl.java:43)
	at java.lang.reflect.Method.invoke(Method.java:497)
	at org.gradle.wrapper.BootstrapMainStarter.start(BootstrapMainStarter.java:30)
	at org.gradle.wrapper.WrapperExecutor.execute(WrapperExecutor.java:127)
	at org.gradle.wrapper.GradleWrapperMain.main(GradleWrapperMain.java:56)
Caused by: org.gradle.api.GradleException: There were failing tests. See the report at: file:///jobs/genie.virgo/gradle-build-with-smoke-test/workspace/packaging/tomcat-server/org.eclipse.virgo.tomcat.smoketest/build/reports/tests/index.html
	at org.gradle.api.tasks.testing.Test.handleTestFailures(Test.java:1111)
	at org.gradle.api.tasks.testing.Test.executeTests(Test.java:542)
	at sun.reflect.GeneratedMethodAccessor523.invoke(Unknown Source)
	at sun.reflect.DelegatingMethodAccessorImpl.invoke(DelegatingMethodAccessorImpl.java:43)
	at java.lang.reflect.Method.invoke(Method.java:497)
	at org.gradle.internal.reflect.JavaMethod.invoke(JavaMethod.java:63)
	at org.gradle.api.internal.project.taskfactory.AnnotationProcessingTaskFactory$StandardTaskAction.doExecute(AnnotationProcessingTaskFactory.java:218)
	at org.gradle.api.internal.project.taskfactory.AnnotationProcessingTaskFactory$StandardTaskAction.execute(AnnotationProcessingTaskFactory.java:211)
	at org.gradle.api.internal.project.taskfactory.AnnotationProcessingTaskFactory$StandardTaskAction.execute(AnnotationProcessingTaskFactory.java:200)
	at org.gradle.api.internal.AbstractTask$TaskActionWrapper.execute(AbstractTask.java:570)
	at org.gradle.api.internal.AbstractTask$TaskActionWrapper.execute(AbstractTask.java:553)
	at org.gradle.api.internal.tasks.execution.ExecuteActionsTaskExecuter.executeAction(ExecuteActionsTaskExecuter.java:80)
	at org.gradle.api.internal.tasks.execution.ExecuteActionsTaskExecuter.executeActions(ExecuteActionsTaskExecuter.java:61)
	... 55 more

==============================================================================

BUILD FAILED

Total time: 29 mins 38.334 secs
[locks-and-latches] Releasing all the locks
[locks-and-latches] All the locks released
[FINDBUGS] Skipping publisher since build result is FAILURE
Recording test results
Archiving artifacts
Sending e-mails to: fwaibel@eclipsesource.com
Finished: FAILURE