FailedConsole Output

Started by user fwaibel@eclipsesource.com
Checkout:workspace / /home/hudson/genie.virgo/.hudson/jobs/gradle-build-489327/workspace - hudson.remoting.LocalChannel@4ffaab85
Using strategy: Default
Git Exe: git
Last Built Revision: Revision 610051a7873c521f0ff70c31710bb3615a49be96 (origin/489327_bundlor_0_2)
Checkout:workspace / /home/hudson/genie.virgo/.hudson/jobs/gradle-build-489327/workspace - hudson.remoting.LocalChannel@4ffaab85
Fetching changes from the remote Git repository
Fetching upstream changes from git://git.eclipse.org/gitroot/virgo/org.eclipse.virgo.root.git
Commencing build of Revision 610051a7873c521f0ff70c31710bb3615a49be96 (origin/489327_bundlor_0_2)
Checking out Revision 610051a7873c521f0ff70c31710bb3615a49be96 (origin/489327_bundlor_0_2)
The origin is non-bare.
Trying to fetch apps into /home/hudson/genie.virgo/.hudson/jobs/gradle-build-489327/workspace/apps
Problem fetching from submodule apps - could be unavailable. Continuing anyway
Trying to fetch kernel into /home/hudson/genie.virgo/.hudson/jobs/gradle-build-489327/workspace/kernel
Problem fetching from submodule kernel - could be unavailable. Continuing anyway
Trying to fetch medic into /home/hudson/genie.virgo/.hudson/jobs/gradle-build-489327/workspace/medic
Problem fetching from submodule medic - could be unavailable. Continuing anyway
Trying to fetch nano into /home/hudson/genie.virgo/.hudson/jobs/gradle-build-489327/workspace/nano
Problem fetching from submodule nano - could be unavailable. Continuing anyway
Trying to fetch packaging into /home/hudson/genie.virgo/.hudson/jobs/gradle-build-489327/workspace/packaging
Problem fetching from submodule packaging - could be unavailable. Continuing anyway
Trying to fetch repository into /home/hudson/genie.virgo/.hudson/jobs/gradle-build-489327/workspace/repository
Problem fetching from submodule repository - could be unavailable. Continuing anyway
Trying to fetch test into /home/hudson/genie.virgo/.hudson/jobs/gradle-build-489327/workspace/test
Problem fetching from submodule test - could be unavailable. Continuing anyway
Trying to fetch util into /home/hudson/genie.virgo/.hudson/jobs/gradle-build-489327/workspace/util
Problem fetching from submodule util - could be unavailable. Continuing anyway
Trying to fetch web into /home/hudson/genie.virgo/.hudson/jobs/gradle-build-489327/workspace/web
Problem fetching from submodule web - could be unavailable. Continuing anyway
The origin is non-bare.
[locks-and-latches] Checking to see if we really have the locks
[locks-and-latches] Have all the locks, build can start
[Gradle] - Launching build.
[workspace] $ /home/hudson/genie.virgo/.hudson/jobs/gradle-build-489327/workspace/gradlew -Declipse.build=true -Dci.build=true -Dskip.docs=true -Dskip.normalize.bundles=true -Dskip.compress.bundles=true -Dskip.local.signing=true --stacktrace --continue -Dhttp.proxyHost=proxy.eclipse.org -Dhttp.proxyPort=9898 -Dhttp.nonProxyHosts=172.30.206.* -Dhttps.proxyHost=proxy.eclipse.org -Dhttps.proxyPort=9898 -Dhttps.nonProxyHosts=172.30.206.* -Dftp.proxyHost=proxy.eclipse.org -Dftp.proxyPort=9898 -Dftp.nonProxyHosts=172.30.206.* clean jar build distZip fullDistZip rapDistZip installDist installFullDist installRapDist findbugsMain
Java HotSpot(TM) Server VM warning: ignoring option MaxPermSize=256m; support was removed in 8.0
:buildSrc:compileJava UP-TO-DATE
:buildSrc:compileGroovy UP-TO-DATE
:buildSrc:processResources UP-TO-DATE
:buildSrc:classes UP-TO-DATE
:buildSrc:jar UP-TO-DATE
:buildSrc:assemble UP-TO-DATE
:buildSrc:compileTestJava UP-TO-DATE
:buildSrc:compileTestGroovy UP-TO-DATE
:buildSrc:processTestResources UP-TO-DATE
:buildSrc:testClasses UP-TO-DATE
:buildSrc:test UP-TO-DATE
:buildSrc:check UP-TO-DATE
:buildSrc:build UP-TO-DATE

FAILURE: Build failed with an exception.

* What went wrong:
A problem occurred configuring root project 'workspace'.
> Could not resolve all dependencies for configuration ':classpath'.
   > Could not find org.eclipse.virgo.bundlor:bundlor-plugin:0.2.
     Searched in the following locations:
         file:/opt/public/hipp/homes/genie.virgo/.m2/repository/org/eclipse/virgo/bundlor/bundlor-plugin/0.2/bundlor-plugin-0.2.pom
         file:/opt/public/hipp/homes/genie.virgo/.m2/repository/org/eclipse/virgo/bundlor/bundlor-plugin/0.2/bundlor-plugin-0.2.jar
         https://plugins.gradle.org/m2/org/eclipse/virgo/bundlor/bundlor-plugin/0.2/bundlor-plugin-0.2.pom
         https://plugins.gradle.org/m2/org/eclipse/virgo/bundlor/bundlor-plugin/0.2/bundlor-plugin-0.2.jar
     Required by:
         :workspace:@VIRGO.VERSION@

* Try:
Run with --info or --debug option to get more log output.

* Exception is:
org.gradle.api.ProjectConfigurationException: A problem occurred configuring root project 'workspace'.
	at org.gradle.configuration.project.LifecycleProjectEvaluator.addConfigurationFailure(LifecycleProjectEvaluator.java:79)
	at org.gradle.configuration.project.LifecycleProjectEvaluator.evaluate(LifecycleProjectEvaluator.java:57)
	at org.gradle.api.internal.project.AbstractProject.evaluate(AbstractProject.java:470)
	at org.gradle.api.internal.project.AbstractProject.evaluate(AbstractProject.java:79)
	at org.gradle.configuration.DefaultBuildConfigurer.configure(DefaultBuildConfigurer.java:31)
	at org.gradle.initialization.DefaultGradleLauncher.doBuildStages(DefaultGradleLauncher.java:128)
	at org.gradle.initialization.DefaultGradleLauncher.doBuild(DefaultGradleLauncher.java:105)
	at org.gradle.initialization.DefaultGradleLauncher.run(DefaultGradleLauncher.java:85)
	at org.gradle.launcher.exec.InProcessBuildActionExecuter$DefaultBuildController.run(InProcessBuildActionExecuter.java:81)
	at org.gradle.launcher.cli.ExecuteBuildAction.run(ExecuteBuildAction.java:33)
	at org.gradle.launcher.cli.ExecuteBuildAction.run(ExecuteBuildAction.java:24)
	at org.gradle.launcher.exec.InProcessBuildActionExecuter.execute(InProcessBuildActionExecuter.java:39)
	at org.gradle.launcher.exec.InProcessBuildActionExecuter.execute(InProcessBuildActionExecuter.java:29)
	at org.gradle.launcher.cli.RunBuildAction.run(RunBuildAction.java:50)
	at org.gradle.internal.Actions$RunnableActionAdapter.execute(Actions.java:171)
	at org.gradle.launcher.cli.CommandLineActionFactory$ParseAndBuildAction.execute(CommandLineActionFactory.java:237)
	at org.gradle.launcher.cli.CommandLineActionFactory$ParseAndBuildAction.execute(CommandLineActionFactory.java:210)
	at org.gradle.launcher.cli.JavaRuntimeValidationAction.execute(JavaRuntimeValidationAction.java:35)
	at org.gradle.launcher.cli.JavaRuntimeValidationAction.execute(JavaRuntimeValidationAction.java:24)
	at org.gradle.launcher.cli.CommandLineActionFactory$WithLogging.execute(CommandLineActionFactory.java:206)
	at org.gradle.launcher.cli.CommandLineActionFactory$WithLogging.execute(CommandLineActionFactory.java:169)
	at org.gradle.launcher.cli.ExceptionReportingAction.execute(ExceptionReportingAction.java:33)
	at org.gradle.launcher.cli.ExceptionReportingAction.execute(ExceptionReportingAction.java:22)
	at org.gradle.launcher.Main.doAction(Main.java:33)
	at org.gradle.launcher.bootstrap.EntryPoint.run(EntryPoint.java:45)
	at org.gradle.launcher.bootstrap.ProcessBootstrap.runNoExit(ProcessBootstrap.java:54)
	at org.gradle.launcher.bootstrap.ProcessBootstrap.run(ProcessBootstrap.java:35)
	at org.gradle.launcher.GradleMain.main(GradleMain.java:23)
	at org.gradle.wrapper.BootstrapMainStarter.start(BootstrapMainStarter.java:30)
	at org.gradle.wrapper.WrapperExecutor.execute(WrapperExecutor.java:127)
	at org.gradle.wrapper.GradleWrapperMain.main(GradleWrapperMain.java:56)
Caused by: org.gradle.api.artifacts.ResolveException: Could not resolve all dependencies for configuration ':classpath'.
	at org.gradle.api.internal.artifacts.ivyservice.DefaultLenientConfiguration.rethrowFailure(DefaultLenientConfiguration.java:52)
	at org.gradle.api.internal.artifacts.ivyservice.DefaultResolvedConfiguration.rethrowFailure(DefaultResolvedConfiguration.java:36)
	at org.gradle.api.internal.artifacts.ivyservice.SelfResolvingDependencyResolver$FilesAggregatingResolvedConfiguration.rethrowFailure(SelfResolvingDependencyResolver.java:110)
	at org.gradle.api.internal.artifacts.ivyservice.ErrorHandlingArtifactDependencyResolver$ErrorHandlingResolvedConfiguration.rethrowFailure(ErrorHandlingArtifactDependencyResolver.java:180)
	at org.gradle.api.internal.artifacts.configurations.DefaultConfiguration$ConfigurationFileCollection.getFiles(DefaultConfiguration.java:428)
	at org.gradle.api.internal.artifacts.configurations.DefaultConfiguration.getFiles(DefaultConfiguration.java:202)
	at org.gradle.api.internal.artifacts.configurations.DefaultConfiguration_Decorated.getFiles(Unknown Source)
	at org.gradle.configuration.DefaultScriptPluginFactory$ScriptPluginImpl.apply(DefaultScriptPluginFactory.java:136)
	at org.gradle.configuration.project.BuildScriptProcessor.execute(BuildScriptProcessor.java:39)
	at org.gradle.configuration.project.BuildScriptProcessor.execute(BuildScriptProcessor.java:26)
	at org.gradle.configuration.project.ConfigureActionsProjectEvaluator.evaluate(ConfigureActionsProjectEvaluator.java:34)
	at org.gradle.configuration.project.LifecycleProjectEvaluator.evaluate(LifecycleProjectEvaluator.java:55)
	... 29 more
Caused by: org.gradle.api.internal.artifacts.ivyservice.ModuleVersionNotFoundException: Could not find org.eclipse.virgo.bundlor:bundlor-plugin:0.2.
Searched in the following locations:
    file:/opt/public/hipp/homes/genie.virgo/.m2/repository/org/eclipse/virgo/bundlor/bundlor-plugin/0.2/bundlor-plugin-0.2.pom
    file:/opt/public/hipp/homes/genie.virgo/.m2/repository/org/eclipse/virgo/bundlor/bundlor-plugin/0.2/bundlor-plugin-0.2.jar
    https://plugins.gradle.org/m2/org/eclipse/virgo/bundlor/bundlor-plugin/0.2/bundlor-plugin-0.2.pom
    https://plugins.gradle.org/m2/org/eclipse/virgo/bundlor/bundlor-plugin/0.2/bundlor-plugin-0.2.jar
Required by:
    :workspace:@VIRGO.VERSION@
	at org.gradle.api.internal.artifacts.ivyservice.DefaultBuildableComponentResolveResult.notFound(DefaultBuildableComponentResolveResult.java:38)
	at org.gradle.api.internal.artifacts.ivyservice.ivyresolve.RepositoryChainDependencyResolver.resolve(RepositoryChainDependencyResolver.java:85)
	at org.gradle.api.internal.artifacts.ivyservice.clientmodule.ClientModuleResolver.resolve(ClientModuleResolver.java:45)
	at org.gradle.api.internal.artifacts.ivyservice.projectmodule.ProjectDependencyResolver.resolve(ProjectDependencyResolver.java:49)
	at org.gradle.api.internal.artifacts.ivyservice.ivyresolve.LazyDependencyToModuleResolver$AbstractVersionResolveResult.resolve(LazyDependencyToModuleResolver.java:69)
	at org.gradle.api.internal.artifacts.ivyservice.resolveengine.graph.DependencyGraphBuilder$ModuleVersionResolveState.resolve(DependencyGraphBuilder.java:543)
	at org.gradle.api.internal.artifacts.ivyservice.resolveengine.graph.DependencyGraphBuilder$ModuleVersionResolveState.getMetaData(DependencyGraphBuilder.java:554)
	at org.gradle.api.internal.artifacts.ivyservice.resolveengine.graph.DependencyGraphBuilder$DependencyEdge.calculateTargetConfigurations(DependencyGraphBuilder.java:255)
	at org.gradle.api.internal.artifacts.ivyservice.resolveengine.graph.DependencyGraphBuilder$DependencyEdge.attachToTargetConfigurations(DependencyGraphBuilder.java:229)
	at org.gradle.api.internal.artifacts.ivyservice.resolveengine.graph.DependencyGraphBuilder.traverseGraph(DependencyGraphBuilder.java:142)
	at org.gradle.api.internal.artifacts.ivyservice.resolveengine.graph.DependencyGraphBuilder.resolveDependencyGraph(DependencyGraphBuilder.java:82)
	at org.gradle.api.internal.artifacts.ivyservice.resolveengine.graph.DependencyGraphBuilder.resolve(DependencyGraphBuilder.java:74)
	at org.gradle.api.internal.artifacts.ivyservice.resolveengine.DefaultDependencyResolver$1.execute(DefaultDependencyResolver.java:120)
	at org.gradle.api.internal.artifacts.ivyservice.resolveengine.DefaultDependencyResolver$1.execute(DefaultDependencyResolver.java:86)
	at org.gradle.internal.Transformers$3.transform(Transformers.java:131)
	at org.gradle.api.internal.artifacts.ivyservice.DefaultIvyContextManager.withIvy(DefaultIvyContextManager.java:61)
	at org.gradle.api.internal.artifacts.ivyservice.DefaultIvyContextManager.withIvy(DefaultIvyContextManager.java:39)
	at org.gradle.api.internal.artifacts.ivyservice.resolveengine.DefaultDependencyResolver.resolve(DefaultDependencyResolver.java:86)
	at org.gradle.api.internal.artifacts.ivyservice.CacheLockingArtifactDependencyResolver$1.run(CacheLockingArtifactDependencyResolver.java:42)
	at org.gradle.internal.Factories$1.create(Factories.java:22)
	at org.gradle.cache.internal.DefaultCacheAccess.useCache(DefaultCacheAccess.java:187)
	at org.gradle.cache.internal.DefaultCacheAccess.useCache(DefaultCacheAccess.java:175)
	at org.gradle.cache.internal.DefaultPersistentDirectoryStore.useCache(DefaultPersistentDirectoryStore.java:106)
	at org.gradle.cache.internal.DefaultCacheFactory$ReferenceTrackingCache.useCache(DefaultCacheFactory.java:187)
	at org.gradle.api.internal.artifacts.ivyservice.DefaultCacheLockingManager.useCache(DefaultCacheLockingManager.java:63)
	at org.gradle.api.internal.artifacts.ivyservice.CacheLockingArtifactDependencyResolver.resolve(CacheLockingArtifactDependencyResolver.java:40)
	at org.gradle.api.internal.artifacts.ivyservice.SelfResolvingDependencyResolver.resolve(SelfResolvingDependencyResolver.java:45)
	at org.gradle.api.internal.artifacts.ivyservice.ShortcircuitEmptyConfigsArtifactDependencyResolver.resolve(ShortcircuitEmptyConfigsArtifactDependencyResolver.java:55)
	at org.gradle.api.internal.artifacts.ivyservice.ErrorHandlingArtifactDependencyResolver.resolve(ErrorHandlingArtifactDependencyResolver.java:47)
	at org.gradle.api.internal.artifacts.ivyservice.DefaultConfigurationResolver.resolve(DefaultConfigurationResolver.java:46)
	at org.gradle.api.internal.artifacts.configurations.DefaultConfiguration.resolveNow(DefaultConfiguration.java:240)
	at org.gradle.api.internal.artifacts.configurations.DefaultConfiguration.getResolvedConfiguration(DefaultConfiguration.java:230)
	at org.gradle.api.internal.artifacts.configurations.DefaultConfiguration_Decorated.getResolvedConfiguration(Unknown Source)
	at org.gradle.api.internal.artifacts.configurations.DefaultConfiguration$ConfigurationFileCollection.getFiles(DefaultConfiguration.java:426)
	... 36 more


BUILD FAILED

Total time: 6.517 secs
[locks-and-latches] Releasing all the locks
[locks-and-latches] All the locks released
[FINDBUGS] Skipping publisher since build result is FAILURE
Recording test results
Archiving artifacts
Sending e-mails to: fwaibel@eclipsesource.com
Finished: FAILURE