Hudson logo

FailedConsole Output

Skipping 5,506 KB.. Full Log
ActionExecuter$DefaultBuildController.run(InProcessBuildActionExecuter.java:81)
[ant:taskdef] 	at org.gradle.launcher.cli.ExecuteBuildAction.run(ExecuteBuildAction.java:33)
[ant:taskdef] 	at org.gradle.launcher.cli.ExecuteBuildAction.run(ExecuteBuildAction.java:24)
[ant:taskdef] 	at org.gradle.launcher.exec.InProcessBuildActionExecuter.execute(InProcessBuildActionExecuter.java:39)
[ant:taskdef] 	at org.gradle.launcher.exec.InProcessBuildActionExecuter.execute(InProcessBuildActionExecuter.java:29)
[ant:taskdef] 	at org.gradle.launcher.cli.RunBuildAction.run(RunBuildAction.java:50)
[ant:taskdef] 	at org.gradle.internal.Actions$RunnableActionAdapter.execute(Actions.java:171)
[ant:taskdef] 	at org.gradle.launcher.cli.CommandLineActionFactory$ParseAndBuildAction.execute(CommandLineActionFactory.java:237)
[ant:taskdef] 	at org.gradle.launcher.cli.CommandLineActionFactory$ParseAndBuildAction.execute(CommandLineActionFactory.java:210)
[ant:taskdef] 	at org.gradle.launcher.cli.JavaRuntimeValidationAction.execute(JavaRuntimeValidationAction.java:35)
[ant:taskdef] 	at org.gradle.launcher.cli.JavaRuntimeValidationAction.execute(JavaRuntimeValidationAction.java:24)
[ant:taskdef] 	at org.gradle.launcher.cli.CommandLineActionFactory$WithLogging.execute(CommandLineActionFactory.java:206)
[ant:taskdef] 	at org.gradle.launcher.cli.CommandLineActionFactory$WithLogging.execute(CommandLineActionFactory.java:169)
[ant:taskdef] 	at org.gradle.launcher.cli.ExceptionReportingAction.execute(ExceptionReportingAction.java:33)
[ant:taskdef] 	at org.gradle.launcher.cli.ExceptionReportingAction.execute(ExceptionReportingAction.java:22)
[ant:taskdef] 	at org.gradle.launcher.Main.doAction(Main.java:33)
[ant:taskdef] 	at org.gradle.launcher.bootstrap.EntryPoint.run(EntryPoint.java:45)
[ant:taskdef] 	at sun.reflect.NativeMethodAccessorImpl.invoke0(Native Method)
[ant:taskdef] 	at sun.reflect.NativeMethodAccessorImpl.invoke(NativeMethodAccessorImpl.java:62)
[ant:taskdef] 	at sun.reflect.DelegatingMethodAccessorImpl.invoke(DelegatingMethodAccessorImpl.java:43)
[ant:taskdef] 	at java.lang.reflect.Method.invoke(Method.java:497)
[ant:taskdef] 	at org.gradle.launcher.bootstrap.ProcessBootstrap.runNoExit(ProcessBootstrap.java:54)
[ant:taskdef] 	at org.gradle.launcher.bootstrap.ProcessBootstrap.run(ProcessBootstrap.java:35)
[ant:taskdef] 	at org.gradle.launcher.GradleMain.main(GradleMain.java:23)
[ant:taskdef] 	at sun.reflect.NativeMethodAccessorImpl.invoke0(Native Method)
[ant:taskdef] 	at sun.reflect.NativeMethodAccessorImpl.invoke(NativeMethodAccessorImpl.java:62)
[ant:taskdef] 	at sun.reflect.DelegatingMethodAccessorImpl.invoke(DelegatingMethodAccessorImpl.java:43)
[ant:taskdef] 	at java.lang.reflect.Method.invoke(Method.java:497)
[ant:taskdef] 	at org.gradle.wrapper.BootstrapMainStarter.start(BootstrapMainStarter.java:30)
[ant:taskdef] 	at org.gradle.wrapper.WrapperExecutor.execute(WrapperExecutor.java:127)
[ant:taskdef] 	at org.gradle.wrapper.GradleWrapperMain.main(GradleWrapperMain.java:56)
Unable to obtain resource from /opt/public/hipp/homes/genie.virgo/.gradle/caches/modules-2/files-2.1/org.apache.ant/com.springsource.org.apache.tools.ant/1.7.0/cb832720fcc4a4c22df3d40db4134d9e8bea5955/notice-1.7.0.txt: java.util.zip.ZipException: error in opening zip file
[ant:taskdef] Unable to obtain resource from /opt/public/hipp/homes/genie.virgo/.gradle/caches/modules-2/files-2.1/org.apache.ant/com.springsource.org.apache.tools.ant/1.7.0/cb832720fcc4a4c22df3d40db4134d9e8bea5955/notice-1.7.0.txt: 
[ant:taskdef] java.util.zip.ZipException: error in opening zip file
[ant:taskdef] 	at java.util.zip.ZipFile.open(Native Method)
[ant:taskdef] 	at java.util.zip.ZipFile.<init>(ZipFile.java:220)
[ant:taskdef] 	at java.util.zip.ZipFile.<init>(ZipFile.java:150)
[ant:taskdef] 	at java.util.jar.JarFile.<init>(JarFile.java:166)
[ant:taskdef] 	at java.util.jar.JarFile.<init>(JarFile.java:130)
[ant:taskdef] 	at org.apache.tools.ant.AntClassLoader.getResourceURL(AntClassLoader.java:1006)
[ant:taskdef] 	at org.apache.tools.ant.AntClassLoader$ResourceEnumeration.findNextResource(AntClassLoader.java:149)
[ant:taskdef] 	at org.apache.tools.ant.AntClassLoader$ResourceEnumeration.nextElement(AntClassLoader.java:134)
[ant:taskdef] 	at org.apache.tools.ant.AntClassLoader$ResourceEnumeration.nextElement(AntClassLoader.java:83)
[ant:taskdef] 	at org.apache.tools.ant.util.CollectionUtils$CompoundEnumeration.nextElement(CollectionUtils.java:239)
[ant:taskdef] 	at org.apache.tools.ant.taskdefs.Definer.execute(Definer.java:256)
[ant:taskdef] 	at org.apache.tools.ant.UnknownElement.execute(UnknownElement.java:292)
[ant:taskdef] 	at sun.reflect.GeneratedMethodAccessor265.invoke(Unknown Source)
[ant:taskdef] 	at sun.reflect.DelegatingMethodAccessorImpl.invoke(DelegatingMethodAccessorImpl.java:43)
[ant:taskdef] 	at java.lang.reflect.Method.invoke(Method.java:497)
[ant:taskdef] 	at org.apache.tools.ant.dispatch.DispatchUtils.execute(DispatchUtils.java:106)
[ant:taskdef] 	at groovy.util.AntBuilder.performTask(AntBuilder.java:319)
[ant:taskdef] 	at groovy.util.AntBuilder.nodeCompleted(AntBuilder.java:264)
[ant:taskdef] 	at org.gradle.api.internal.project.ant.BasicAntBuilder.nodeCompleted(BasicAntBuilder.java:71)
[ant:taskdef] 	at groovy.util.BuilderSupport.doInvokeMethod(BuilderSupport.java:147)
[ant:taskdef] 	at groovy.util.AntBuilder.doInvokeMethod(AntBuilder.java:203)
[ant:taskdef] 	at org.gradle.api.internal.project.ant.BasicAntBuilder.doInvokeMethod(BasicAntBuilder.java:86)
[ant:taskdef] 	at groovy.util.BuilderSupport.invokeMethod(BuilderSupport.java:64)
[ant:taskdef] 	at org.codehaus.groovy.runtime.callsite.PogoMetaClassSite.call(PogoMetaClassSite.java:45)
[ant:taskdef] 	at org.codehaus.groovy.runtime.callsite.AbstractCallSite.call(AbstractCallSite.java:116)
[ant:taskdef] 	at org.eclipse.virgo.bundlor.BundlorPlugin$_apply_closure6_closure9.doCall(BundlorPlugin.groovy:95)
[ant:taskdef] 	at sun.reflect.GeneratedMethodAccessor288.invoke(Unknown Source)
[ant:taskdef] 	at sun.reflect.DelegatingMethodAccessorImpl.invoke(DelegatingMethodAccessorImpl.java:43)
[ant:taskdef] 	at java.lang.reflect.Method.invoke(Method.java:497)
[ant:taskdef] 	at org.codehaus.groovy.reflection.CachedMethod.invoke(CachedMethod.java:90)
[ant:taskdef] 	at groovy.lang.MetaMethod.doMethodInvoke(MetaMethod.java:233)
[ant:taskdef] 	at org.codehaus.groovy.runtime.metaclass.ClosureMetaClass.invokeMethod(ClosureMetaClass.java:272)
[ant:taskdef] 	at groovy.lang.MetaClassImpl.invokeMethod(MetaClassImpl.java:909)
[ant:taskdef] 	at groovy.lang.Closure.call(Closure.java:423)
[ant:taskdef] 	at groovy.lang.Closure.call(Closure.java:439)
[ant:taskdef] 	at org.gradle.api.internal.AbstractTask$ClosureTaskAction.execute(AbstractTask.java:539)
[ant:taskdef] 	at org.gradle.api.internal.AbstractTask$ClosureTaskAction.execute(AbstractTask.java:520)
[ant:taskdef] 	at org.gradle.api.internal.tasks.execution.ExecuteActionsTaskExecuter.executeAction(ExecuteActionsTaskExecuter.java:80)
[ant:taskdef] 	at org.gradle.api.internal.tasks.execution.ExecuteActionsTaskExecuter.executeActions(ExecuteActionsTaskExecuter.java:61)
[ant:taskdef] 	at org.gradle.api.internal.tasks.execution.ExecuteActionsTaskExecuter.execute(ExecuteActionsTaskExecuter.java:46)
[ant:taskdef] 	at org.gradle.api.internal.tasks.execution.PostExecutionAnalysisTaskExecuter.execute(PostExecutionAnalysisTaskExecuter.java:35)
[ant:taskdef] 	at org.gradle.api.internal.tasks.execution.SkipUpToDateTaskExecuter.execute(SkipUpToDateTaskExecuter.java:64)
[ant:taskdef] 	at org.gradle.api.internal.tasks.execution.ValidatingTaskExecuter.execute(ValidatingTaskExecuter.java:58)
[ant:taskdef] 	at org.gradle.api.internal.tasks.execution.SkipEmptySourceFilesTaskExecuter.execute(SkipEmptySourceFilesTaskExecuter.java:42)
[ant:taskdef] 	at org.gradle.api.internal.tasks.execution.SkipTaskWithNoActionsExecuter.execute(SkipTaskWithNoActionsExecuter.java:52)
[ant:taskdef] 	at org.gradle.api.internal.tasks.execution.SkipOnlyIfTaskExecuter.execute(SkipOnlyIfTaskExecuter.java:53)
[ant:taskdef] 	at org.gradle.api.internal.tasks.execution.ExecuteAtMostOnceTaskExecuter.execute(ExecuteAtMostOnceTaskExecuter.java:43)
[ant:taskdef] 	at org.gradle.api.internal.AbstractTask.executeWithoutThrowingTaskFailure(AbstractTask.java:296)
[ant:taskdef] 	at org.gradle.execution.taskgraph.AbstractTaskPlanExecutor$TaskExecutorWorker.executeTask(AbstractTaskPlanExecutor.java:79)
[ant:taskdef] 	at org.gradle.execution.taskgraph.AbstractTaskPlanExecutor$TaskExecutorWorker.processTask(AbstractTaskPlanExecutor.java:63)
[ant:taskdef] 	at org.gradle.execution.taskgraph.AbstractTaskPlanExecutor$TaskExecutorWorker.run(AbstractTaskPlanExecutor.java:51)
[ant:taskdef] 	at org.gradle.execution.taskgraph.DefaultTaskPlanExecutor.process(DefaultTaskPlanExecutor.java:23)
[ant:taskdef] 	at org.gradle.execution.taskgraph.DefaultTaskGraphExecuter.execute(DefaultTaskGraphExecuter.java:86)
[ant:taskdef] 	at org.gradle.execution.SelectedTaskExecutionAction.execute(SelectedTaskExecutionAction.java:29)
[ant:taskdef] 	at org.gradle.execution.DefaultBuildExecuter.execute(DefaultBuildExecuter.java:61)
[ant:taskdef] 	at org.gradle.execution.DefaultBuildExecuter.access$200(DefaultBuildExecuter.java:23)
[ant:taskdef] 	at org.gradle.execution.DefaultBuildExecuter$2.proceed(DefaultBuildExecuter.java:67)
[ant:taskdef] 	at org.gradle.execution.DryRunBuildExecutionAction.execute(DryRunBuildExecutionAction.java:32)
[ant:taskdef] 	at org.gradle.execution.DefaultBuildExecuter.execute(DefaultBuildExecuter.java:61)
[ant:taskdef] 	at org.gradle.execution.DefaultBuildExecuter.execute(DefaultBuildExecuter.java:54)
[ant:taskdef] 	at org.gradle.initialization.DefaultGradleLauncher.doBuildStages(DefaultGradleLauncher.java:148)
[ant:taskdef] 	at org.gradle.initialization.DefaultGradleLauncher.doBuild(DefaultGradleLauncher.java:105)
[ant:taskdef] 	at org.gradle.initialization.DefaultGradleLauncher.run(DefaultGradleLauncher.java:85)
[ant:taskdef] 	at org.gradle.launcher.exec.InProcessBuildActionExecuter$DefaultBuildController.run(InProcessBuildActionExecuter.java:81)
[ant:taskdef] 	at org.gradle.launcher.cli.ExecuteBuildAction.run(ExecuteBuildAction.java:33)
[ant:taskdef] 	at org.gradle.launcher.cli.ExecuteBuildAction.run(ExecuteBuildAction.java:24)
[ant:taskdef] 	at org.gradle.launcher.exec.InProcessBuildActionExecuter.execute(InProcessBuildActionExecuter.java:39)
[ant:taskdef] 	at org.gradle.launcher.exec.InProcessBuildActionExecuter.execute(InProcessBuildActionExecuter.java:29)
[ant:taskdef] 	at org.gradle.launcher.cli.RunBuildAction.run(RunBuildAction.java:50)
[ant:taskdef] 	at org.gradle.internal.Actions$RunnableActionAdapter.execute(Actions.java:171)
[ant:taskdef] 	at org.gradle.launcher.cli.CommandLineActionFactory$ParseAndBuildAction.execute(CommandLineActionFactory.java:237)
[ant:taskdef] 	at org.gradle.launcher.cli.CommandLineActionFactory$ParseAndBuildAction.execute(CommandLineActionFactory.java:210)
[ant:taskdef] 	at org.gradle.launcher.cli.JavaRuntimeValidationAction.execute(JavaRuntimeValidationAction.java:35)
[ant:taskdef] 	at org.gradle.launcher.cli.JavaRuntimeValidationAction.execute(JavaRuntimeValidationAction.java:24)
[ant:taskdef] 	at org.gradle.launcher.cli.CommandLineActionFactory$WithLogging.execute(CommandLineActionFactory.java:206)
[ant:taskdef] 	at org.gradle.launcher.cli.CommandLineActionFactory$WithLogging.execute(CommandLineActionFactory.java:169)
[ant:taskdef] 	at org.gradle.launcher.cli.ExceptionReportingAction.execute(ExceptionReportingAction.java:33)
[ant:taskdef] 	at org.gradle.launcher.cli.ExceptionReportingAction.execute(ExceptionReportingAction.java:22)
[ant:taskdef] 	at org.gradle.launcher.Main.doAction(Main.java:33)
[ant:taskdef] 	at org.gradle.launcher.bootstrap.EntryPoint.run(EntryPoint.java:45)
[ant:taskdef] 	at sun.reflect.NativeMethodAccessorImpl.invoke0(Native Method)
[ant:taskdef] 	at sun.reflect.NativeMethodAccessorImpl.invoke(NativeMethodAccessorImpl.java:62)
[ant:taskdef] 	at sun.reflect.DelegatingMethodAccessorImpl.invoke(DelegatingMethodAccessorImpl.java:43)
[ant:taskdef] 	at java.lang.reflect.Method.invoke(Method.java:497)
[ant:taskdef] 	at org.gradle.launcher.bootstrap.ProcessBootstrap.runNoExit(ProcessBootstrap.java:54)
[ant:taskdef] 	at org.gradle.launcher.bootstrap.ProcessBootstrap.run(ProcessBootstrap.java:35)
[ant:taskdef] 	at org.gradle.launcher.GradleMain.main(GradleMain.java:23)
[ant:taskdef] 	at sun.reflect.NativeMethodAccessorImpl.invoke0(Native Method)
[ant:taskdef] 	at sun.reflect.NativeMethodAccessorImpl.invoke(NativeMethodAccessorImpl.java:62)
[ant:taskdef] 	at sun.reflect.DelegatingMethodAccessorImpl.invoke(DelegatingMethodAccessorImpl.java:43)
[ant:taskdef] 	at java.lang.reflect.Method.invoke(Method.java:497)
[ant:taskdef] 	at org.gradle.wrapper.BootstrapMainStarter.start(BootstrapMainStarter.java:30)
[ant:taskdef] 	at org.gradle.wrapper.WrapperExecutor.execute(WrapperExecutor.java:127)
[ant:taskdef] 	at org.gradle.wrapper.GradleWrapperMain.main(GradleWrapperMain.java:56)
Unable to obtain resource from /opt/public/hipp/homes/genie.virgo/.gradle/caches/modules-2/files-2.1/org.slf4j/com.springsource.slf4j.api/1.6.1/5e9ef2d166b9ebbbaa1a48c93557a90ccfee8140/license-1.6.1.txt: java.util.zip.ZipException: error in opening zip file
[ant:taskdef] Unable to obtain resource from /opt/public/hipp/homes/genie.virgo/.gradle/caches/modules-2/files-2.1/org.slf4j/com.springsource.slf4j.api/1.6.1/5e9ef2d166b9ebbbaa1a48c93557a90ccfee8140/license-1.6.1.txt: 
[ant:taskdef] java.util.zip.ZipException: error in opening zip file
[ant:taskdef] 	at java.util.zip.ZipFile.open(Native Method)
[ant:taskdef] 	at java.util.zip.ZipFile.<init>(ZipFile.java:220)
[ant:taskdef] 	at java.util.zip.ZipFile.<init>(ZipFile.java:150)
[ant:taskdef] 	at java.util.jar.JarFile.<init>(JarFile.java:166)
[ant:taskdef] 	at java.util.jar.JarFile.<init>(JarFile.java:130)
[ant:taskdef] 	at org.apache.tools.ant.AntClassLoader.getResourceURL(AntClassLoader.java:1006)
[ant:taskdef] 	at org.apache.tools.ant.AntClassLoader$ResourceEnumeration.findNextResource(AntClassLoader.java:149)
[ant:taskdef] 	at org.apache.tools.ant.AntClassLoader$ResourceEnumeration.nextElement(AntClassLoader.java:134)
[ant:taskdef] 	at org.apache.tools.ant.AntClassLoader$ResourceEnumeration.nextElement(AntClassLoader.java:83)
[ant:taskdef] 	at org.apache.tools.ant.util.CollectionUtils$CompoundEnumeration.nextElement(CollectionUtils.java:239)
[ant:taskdef] 	at org.apache.tools.ant.taskdefs.Definer.execute(Definer.java:256)
[ant:taskdef] 	at org.apache.tools.ant.UnknownElement.execute(UnknownElement.java:292)
[ant:taskdef] 	at sun.reflect.GeneratedMethodAccessor265.invoke(Unknown Source)
[ant:taskdef] 	at sun.reflect.DelegatingMethodAccessorImpl.invoke(DelegatingMethodAccessorImpl.java:43)
[ant:taskdef] 	at java.lang.reflect.Method.invoke(Method.java:497)
[ant:taskdef] 	at org.apache.tools.ant.dispatch.DispatchUtils.execute(DispatchUtils.java:106)
[ant:taskdef] 	at groovy.util.AntBuilder.performTask(AntBuilder.java:319)
[ant:taskdef] 	at groovy.util.AntBuilder.nodeCompleted(AntBuilder.java:264)
[ant:taskdef] 	at org.gradle.api.internal.project.ant.BasicAntBuilder.nodeCompleted(BasicAntBuilder.java:71)
[ant:taskdef] 	at groovy.util.BuilderSupport.doInvokeMethod(BuilderSupport.java:147)
[ant:taskdef] 	at groovy.util.AntBuilder.doInvokeMethod(AntBuilder.java:203)
[ant:taskdef] 	at org.gradle.api.internal.project.ant.BasicAntBuilder.doInvokeMethod(BasicAntBuilder.java:86)
[ant:taskdef] 	at groovy.util.BuilderSupport.invokeMethod(BuilderSupport.java:64)
[ant:taskdef] 	at org.codehaus.groovy.runtime.callsite.PogoMetaClassSite.call(PogoMetaClassSite.java:45)
[ant:taskdef] 	at org.codehaus.groovy.runtime.callsite.AbstractCallSite.call(AbstractCallSite.java:116)
[ant:taskdef] 	at org.eclipse.virgo.bundlor.BundlorPlugin$_apply_closure6_closure9.doCall(BundlorPlugin.groovy:95)
[ant:taskdef] 	at sun.reflect.GeneratedMethodAccessor288.invoke(Unknown Source)
[ant:taskdef] 	at sun.reflect.DelegatingMethodAccessorImpl.invoke(DelegatingMethodAccessorImpl.java:43)
[ant:taskdef] 	at java.lang.reflect.Method.invoke(Method.java:497)
[ant:taskdef] 	at org.codehaus.groovy.reflection.CachedMethod.invoke(CachedMethod.java:90)
[ant:taskdef] 	at groovy.lang.MetaMethod.doMethodInvoke(MetaMethod.java:233)
[ant:taskdef] 	at org.codehaus.groovy.runtime.metaclass.ClosureMetaClass.invokeMethod(ClosureMetaClass.java:272)
[ant:taskdef] 	at groovy.lang.MetaClassImpl.invokeMethod(MetaClassImpl.java:909)
[ant:taskdef] 	at groovy.lang.Closure.call(Closure.java:423)
[ant:taskdef] 	at groovy.lang.Closure.call(Closure.java:439)
[ant:taskdef] 	at org.gradle.api.internal.AbstractTask$ClosureTaskAction.execute(AbstractTask.java:539)
[ant:taskdef] 	at org.gradle.api.internal.AbstractTask$ClosureTaskAction.execute(AbstractTask.java:520)
[ant:taskdef] 	at org.gradle.api.internal.tasks.execution.ExecuteActionsTaskExecuter.executeAction(ExecuteActionsTaskExecuter.java:80)
[ant:taskdef] 	at org.gradle.api.internal.tasks.execution.ExecuteActionsTaskExecuter.executeActions(ExecuteActionsTaskExecuter.java:61)
[ant:taskdef] 	at org.gradle.api.internal.tasks.execution.ExecuteActionsTaskExecuter.execute(ExecuteActionsTaskExecuter.java:46)
[ant:taskdef] 	at org.gradle.api.internal.tasks.execution.PostExecutionAnalysisTaskExecuter.execute(PostExecutionAnalysisTaskExecuter.java:35)
[ant:taskdef] 	at org.gradle.api.internal.tasks.execution.SkipUpToDateTaskExecuter.execute(SkipUpToDateTaskExecuter.java:64)
[ant:taskdef] 	at org.gradle.api.internal.tasks.execution.ValidatingTaskExecuter.execute(ValidatingTaskExecuter.java:58)
[ant:taskdef] 	at org.gradle.api.internal.tasks.execution.SkipEmptySourceFilesTaskExecuter.execute(SkipEmptySourceFilesTaskExecuter.java:42)
[ant:taskdef] 	at org.gradle.api.internal.tasks.execution.SkipTaskWithNoActionsExecuter.execute(SkipTaskWithNoActionsExecuter.java:52)
[ant:taskdef] 	at org.gradle.api.internal.tasks.execution.SkipOnlyIfTaskExecuter.execute(SkipOnlyIfTaskExecuter.java:53)
[ant:taskdef] 	at org.gradle.api.internal.tasks.execution.ExecuteAtMostOnceTaskExecuter.execute(ExecuteAtMostOnceTaskExecuter.java:43)
[ant:taskdef] 	at org.gradle.api.internal.AbstractTask.executeWithoutThrowingTaskFailure(AbstractTask.java:296)
[ant:taskdef] 	at org.gradle.execution.taskgraph.AbstractTaskPlanExecutor$TaskExecutorWorker.executeTask(AbstractTaskPlanExecutor.java:79)
[ant:taskdef] 	at org.gradle.execution.taskgraph.AbstractTaskPlanExecutor$TaskExecutorWorker.processTask(AbstractTaskPlanExecutor.java:63)
[ant:taskdef] 	at org.gradle.execution.taskgraph.AbstractTaskPlanExecutor$TaskExecutorWorker.run(AbstractTaskPlanExecutor.java:51)
[ant:taskdef] 	at org.gradle.execution.taskgraph.DefaultTaskPlanExecutor.process(DefaultTaskPlanExecutor.java:23)
[ant:taskdef] 	at org.gradle.execution.taskgraph.DefaultTaskGraphExecuter.execute(DefaultTaskGraphExecuter.java:86)
[ant:taskdef] 	at org.gradle.execution.SelectedTaskExecutionAction.execute(SelectedTaskExecutionAction.java:29)
[ant:taskdef] 	at org.gradle.execution.DefaultBuildExecuter.execute(DefaultBuildExecuter.java:61)
[ant:taskdef] 	at org.gradle.execution.DefaultBuildExecuter.access$200(DefaultBuildExecuter.java:23)
[ant:taskdef] 	at org.gradle.execution.DefaultBuildExecuter$2.proceed(DefaultBuildExecuter.java:67)
[ant:taskdef] 	at org.gradle.execution.DryRunBuildExecutionAction.execute(DryRunBuildExecutionAction.java:32)
[ant:taskdef] 	at org.gradle.execution.DefaultBuildExecuter.execute(DefaultBuildExecuter.java:61)
[ant:taskdef] 	at org.gradle.execution.DefaultBuildExecuter.execute(DefaultBuildExecuter.java:54)
[ant:taskdef] 	at org.gradle.initialization.DefaultGradleLauncher.doBuildStages(DefaultGradleLauncher.java:148)
[ant:taskdef] 	at org.gradle.initialization.DefaultGradleLauncher.doBuild(DefaultGradleLauncher.java:105)
[ant:taskdef] 	at org.gradle.initialization.DefaultGradleLauncher.run(DefaultGradleLauncher.java:85)
[ant:taskdef] 	at org.gradle.launcher.exec.InProcessBuildActionExecuter$DefaultBuildController.run(InProcessBuildActionExecuter.java:81)
[ant:taskdef] 	at org.gradle.launcher.cli.ExecuteBuildAction.run(ExecuteBuildAction.java:33)
[ant:taskdef] 	at org.gradle.launcher.cli.ExecuteBuildAction.run(ExecuteBuildAction.java:24)
[ant:taskdef] 	at org.gradle.launcher.exec.InProcessBuildActionExecuter.execute(InProcessBuildActionExecuter.java:39)
[ant:taskdef] 	at org.gradle.launcher.exec.InProcessBuildActionExecuter.execute(InProcessBuildActionExecuter.java:29)
[ant:taskdef] 	at org.gradle.launcher.cli.RunBuildAction.run(RunBuildAction.java:50)
[ant:taskdef] 	at org.gradle.internal.Actions$RunnableActionAdapter.execute(Actions.java:171)
[ant:taskdef] 	at org.gradle.launcher.cli.CommandLineActionFactory$ParseAndBuildAction.execute(CommandLineActionFactory.java:237)
[ant:taskdef] 	at org.gradle.launcher.cli.CommandLineActionFactory$ParseAndBuildAction.execute(CommandLineActionFactory.java:210)
[ant:taskdef] 	at org.gradle.launcher.cli.JavaRuntimeValidationAction.execute(JavaRuntimeValidationAction.java:35)
[ant:taskdef] 	at org.gradle.launcher.cli.JavaRuntimeValidationAction.execute(JavaRuntimeValidationAction.java:24)
[ant:taskdef] 	at org.gradle.launcher.cli.CommandLineActionFactory$WithLogging.execute(CommandLineActionFactory.java:206)
[ant:taskdef] 	at org.gradle.launcher.cli.CommandLineActionFactory$WithLogging.execute(CommandLineActionFactory.java:169)
[ant:taskdef] 	at org.gradle.launcher.cli.ExceptionReportingAction.execute(ExceptionReportingAction.java:33)
[ant:taskdef] 	at org.gradle.launcher.cli.ExceptionReportingAction.execute(ExceptionReportingAction.java:22)
[ant:taskdef] 	at org.gradle.launcher.Main.doAction(Main.java:33)
[ant:taskdef] 	at org.gradle.launcher.bootstrap.EntryPoint.run(EntryPoint.java:45)
[ant:taskdef] 	at sun.reflect.NativeMethodAccessorImpl.invoke0(Native Method)
[ant:taskdef] 	at sun.reflect.NativeMethodAccessorImpl.invoke(NativeMethodAccessorImpl.java:62)
[ant:taskdef] 	at sun.reflect.DelegatingMethodAccessorImpl.invoke(DelegatingMethodAccessorImpl.java:43)
[ant:taskdef] 	at java.lang.reflect.Method.invoke(Method.java:497)
[ant:taskdef] 	at org.gradle.launcher.bootstrap.ProcessBootstrap.runNoExit(ProcessBootstrap.java:54)
[ant:taskdef] 	at org.gradle.launcher.bootstrap.ProcessBootstrap.run(ProcessBootstrap.java:35)
[ant:taskdef] 	at org.gradle.launcher.GradleMain.main(GradleMain.java:23)
[ant:taskdef] 	at sun.reflect.NativeMethodAccessorImpl.invoke0(Native Method)
[ant:taskdef] 	at sun.reflect.NativeMethodAccessorImpl.invoke(NativeMethodAccessorImpl.java:62)
[ant:taskdef] 	at sun.reflect.DelegatingMethodAccessorImpl.invoke(DelegatingMethodAccessorImpl.java:43)
[ant:taskdef] 	at java.lang.reflect.Method.invoke(Method.java:497)
[ant:taskdef] 	at org.gradle.wrapper.BootstrapMainStarter.start(BootstrapMainStarter.java:30)
[ant:taskdef] 	at org.gradle.wrapper.WrapperExecutor.execute(WrapperExecutor.java:127)
[ant:taskdef] 	at org.gradle.wrapper.GradleWrapperMain.main(GradleWrapperMain.java:56)
Unable to obtain resource from /opt/public/hipp/homes/genie.virgo/.gradle/caches/modules-2/files-2.1/org.slf4j/com.springsource.slf4j.nop/1.6.1/5e9ef2d166b9ebbbaa1a48c93557a90ccfee8140/license-1.6.1.txt: java.util.zip.ZipException: error in opening zip file
[ant:taskdef] Unable to obtain resource from /opt/public/hipp/homes/genie.virgo/.gradle/caches/modules-2/files-2.1/org.slf4j/com.springsource.slf4j.nop/1.6.1/5e9ef2d166b9ebbbaa1a48c93557a90ccfee8140/license-1.6.1.txt: 
[ant:taskdef] java.util.zip.ZipException: error in opening zip file
[ant:taskdef] 	at java.util.zip.ZipFile.open(Native Method)
[ant:taskdef] 	at java.util.zip.ZipFile.<init>(ZipFile.java:220)
[ant:taskdef] 	at java.util.zip.ZipFile.<init>(ZipFile.java:150)
[ant:taskdef] 	at java.util.jar.JarFile.<init>(JarFile.java:166)
[ant:taskdef] 	at java.util.jar.JarFile.<init>(JarFile.java:130)
[ant:taskdef] 	at org.apache.tools.ant.AntClassLoader.getResourceURL(AntClassLoader.java:1006)
[ant:taskdef] 	at org.apache.tools.ant.AntClassLoader$ResourceEnumeration.findNextResource(AntClassLoader.java:149)
[ant:taskdef] 	at org.apache.tools.ant.AntClassLoader$ResourceEnumeration.nextElement(AntClassLoader.java:134)
[ant:taskdef] 	at org.apache.tools.ant.AntClassLoader$ResourceEnumeration.nextElement(AntClassLoader.java:83)
[ant:taskdef] 	at org.apache.tools.ant.util.CollectionUtils$CompoundEnumeration.nextElement(CollectionUtils.java:239)
[ant:taskdef] 	at org.apache.tools.ant.taskdefs.Definer.execute(Definer.java:256)
[ant:taskdef] 	at org.apache.tools.ant.UnknownElement.execute(UnknownElement.java:292)
[ant:taskdef] 	at sun.reflect.GeneratedMethodAccessor265.invoke(Unknown Source)
[ant:taskdef] 	at sun.reflect.DelegatingMethodAccessorImpl.invoke(DelegatingMethodAccessorImpl.java:43)
[ant:taskdef] 	at java.lang.reflect.Method.invoke(Method.java:497)
[ant:taskdef] 	at org.apache.tools.ant.dispatch.DispatchUtils.execute(DispatchUtils.java:106)
[ant:taskdef] 	at groovy.util.AntBuilder.performTask(AntBuilder.java:319)
[ant:taskdef] 	at groovy.util.AntBuilder.nodeCompleted(AntBuilder.java:264)
[ant:taskdef] 	at org.gradle.api.internal.project.ant.BasicAntBuilder.nodeCompleted(BasicAntBuilder.java:71)
[ant:taskdef] 	at groovy.util.BuilderSupport.doInvokeMethod(BuilderSupport.java:147)
[ant:taskdef] 	at groovy.util.AntBuilder.doInvokeMethod(AntBuilder.java:203)
[ant:taskdef] 	at org.gradle.api.internal.project.ant.BasicAntBuilder.doInvokeMethod(BasicAntBuilder.java:86)
[ant:taskdef] 	at groovy.util.BuilderSupport.invokeMethod(BuilderSupport.java:64)
[ant:taskdef] 	at org.codehaus.groovy.runtime.callsite.PogoMetaClassSite.call(PogoMetaClassSite.java:45)
[ant:taskdef] 	at org.codehaus.groovy.runtime.callsite.AbstractCallSite.call(AbstractCallSite.java:116)
[ant:taskdef] 	at org.eclipse.virgo.bundlor.BundlorPlugin$_apply_closure6_closure9.doCall(BundlorPlugin.groovy:95)
[ant:taskdef] 	at sun.reflect.GeneratedMethodAccessor288.invoke(Unknown Source)
[ant:taskdef] 	at sun.reflect.DelegatingMethodAccessorImpl.invoke(DelegatingMethodAccessorImpl.java:43)
[ant:taskdef] 	at java.lang.reflect.Method.invoke(Method.java:497)
[ant:taskdef] 	at org.codehaus.groovy.reflection.CachedMethod.invoke(CachedMethod.java:90)
[ant:taskdef] 	at groovy.lang.MetaMethod.doMethodInvoke(MetaMethod.java:233)
[ant:taskdef] 	at org.codehaus.groovy.runtime.metaclass.ClosureMetaClass.invokeMethod(ClosureMetaClass.java:272)
[ant:taskdef] 	at groovy.lang.MetaClassImpl.invokeMethod(MetaClassImpl.java:909)
[ant:taskdef] 	at groovy.lang.Closure.call(Closure.java:423)
[ant:taskdef] 	at groovy.lang.Closure.call(Closure.java:439)
[ant:taskdef] 	at org.gradle.api.internal.AbstractTask$ClosureTaskAction.execute(AbstractTask.java:539)
[ant:taskdef] 	at org.gradle.api.internal.AbstractTask$ClosureTaskAction.execute(AbstractTask.java:520)
[ant:taskdef] 	at org.gradle.api.internal.tasks.execution.ExecuteActionsTaskExecuter.executeAction(ExecuteActionsTaskExecuter.java:80)
[ant:taskdef] 	at org.gradle.api.internal.tasks.execution.ExecuteActionsTaskExecuter.executeActions(ExecuteActionsTaskExecuter.java:61)
[ant:taskdef] 	at org.gradle.api.internal.tasks.execution.ExecuteActionsTaskExecuter.execute(ExecuteActionsTaskExecuter.java:46)
[ant:taskdef] 	at org.gradle.api.internal.tasks.execution.PostExecutionAnalysisTaskExecuter.execute(PostExecutionAnalysisTaskExecuter.java:35)
[ant:taskdef] 	at org.gradle.api.internal.tasks.execution.SkipUpToDateTaskExecuter.execute(SkipUpToDateTaskExecuter.java:64)
[ant:taskdef] 	at org.gradle.api.internal.tasks.execution.ValidatingTaskExecuter.execute(ValidatingTaskExecuter.java:58)
[ant:taskdef] 	at org.gradle.api.internal.tasks.execution.SkipEmptySourceFilesTaskExecuter.execute(SkipEmptySourceFilesTaskExecuter.java:42)
[ant:taskdef] 	at org.gradle.api.internal.tasks.execution.SkipTaskWithNoActionsExecuter.execute(SkipTaskWithNoActionsExecuter.java:52)
[ant:taskdef] 	at org.gradle.api.internal.tasks.execution.SkipOnlyIfTaskExecuter.execute(SkipOnlyIfTaskExecuter.java:53)
[ant:taskdef] 	at org.gradle.api.internal.tasks.execution.ExecuteAtMostOnceTaskExecuter.execute(ExecuteAtMostOnceTaskExecuter.java:43)
[ant:taskdef] 	at org.gradle.api.internal.AbstractTask.executeWithoutThrowingTaskFailure(AbstractTask.java:296)
[ant:taskdef] 	at org.gradle.execution.taskgraph.AbstractTaskPlanExecutor$TaskExecutorWorker.executeTask(AbstractTaskPlanExecutor.java:79)
[ant:taskdef] 	at org.gradle.execution.taskgraph.AbstractTaskPlanExecutor$TaskExecutorWorker.processTask(AbstractTaskPlanExecutor.java:63)
[ant:taskdef] 	at org.gradle.execution.taskgraph.AbstractTaskPlanExecutor$TaskExecutorWorker.run(AbstractTaskPlanExecutor.java:51)
[ant:taskdef] 	at org.gradle.execution.taskgraph.DefaultTaskPlanExecutor.process(DefaultTaskPlanExecutor.java:23)
[ant:taskdef] 	at org.gradle.execution.taskgraph.DefaultTaskGraphExecuter.execute(DefaultTaskGraphExecuter.java:86)
[ant:taskdef] 	at org.gradle.execution.SelectedTaskExecutionAction.execute(SelectedTaskExecutionAction.java:29)
[ant:taskdef] 	at org.gradle.execution.DefaultBuildExecuter.execute(DefaultBuildExecuter.java:61)
[ant:taskdef] 	at org.gradle.execution.DefaultBuildExecuter.access$200(DefaultBuildExecuter.java:23)
[ant:taskdef] 	at org.gradle.execution.DefaultBuildExecuter$2.proceed(DefaultBuildExecuter.java:67)
[ant:taskdef] 	at org.gradle.execution.DryRunBuildExecutionAction.execute(DryRunBuildExecutionAction.java:32)
[ant:taskdef] 	at org.gradle.execution.DefaultBuildExecuter.execute(DefaultBuildExecuter.java:61)
[ant:taskdef] 	at org.gradle.execution.DefaultBuildExecuter.execute(DefaultBuildExecuter.java:54)
[ant:taskdef] 	at org.gradle.initialization.DefaultGradleLauncher.doBuildStages(DefaultGradleLauncher.java:148)
[ant:taskdef] 	at org.gradle.initialization.DefaultGradleLauncher.doBuild(DefaultGradleLauncher.java:105)
[ant:taskdef] 	at org.gradle.initialization.DefaultGradleLauncher.run(DefaultGradleLauncher.java:85)
[ant:taskdef] 	at org.gradle.launcher.exec.InProcessBuildActionExecuter$DefaultBuildController.run(InProcessBuildActionExecuter.java:81)
[ant:taskdef] 	at org.gradle.launcher.cli.ExecuteBuildAction.run(ExecuteBuildAction.java:33)
[ant:taskdef] 	at org.gradle.launcher.cli.ExecuteBuildAction.run(ExecuteBuildAction.java:24)
[ant:taskdef] 	at org.gradle.launcher.exec.InProcessBuildActionExecuter.execute(InProcessBuildActionExecuter.java:39)
[ant:taskdef] 	at org.gradle.launcher.exec.InProcessBuildActionExecuter.execute(InProcessBuildActionExecuter.java:29)
[ant:taskdef] 	at org.gradle.launcher.cli.RunBuildAction.run(RunBuildAction.java:50)
[ant:taskdef] 	at org.gradle.internal.Actions$RunnableActionAdapter.execute(Actions.java:171)
[ant:taskdef] 	at org.gradle.launcher.cli.CommandLineActionFactory$ParseAndBuildAction.execute(CommandLineActionFactory.java:237)
[ant:taskdef] 	at org.gradle.launcher.cli.CommandLineActionFactory$ParseAndBuildAction.execute(CommandLineActionFactory.java:210)
[ant:taskdef] 	at org.gradle.launcher.cli.JavaRuntimeValidationAction.execute(JavaRuntimeValidationAction.java:35)
[ant:taskdef] 	at org.gradle.launcher.cli.JavaRuntimeValidationAction.execute(JavaRuntimeValidationAction.java:24)
[ant:taskdef] 	at org.gradle.launcher.cli.CommandLineActionFactory$WithLogging.execute(CommandLineActionFactory.java:206)
[ant:taskdef] 	at org.gradle.launcher.cli.CommandLineActionFactory$WithLogging.execute(CommandLineActionFactory.java:169)
[ant:taskdef] 	at org.gradle.launcher.cli.ExceptionReportingAction.execute(ExceptionReportingAction.java:33)
[ant:taskdef] 	at org.gradle.launcher.cli.ExceptionReportingAction.execute(ExceptionReportingAction.java:22)
[ant:taskdef] 	at org.gradle.launcher.Main.doAction(Main.java:33)
[ant:taskdef] 	at org.gradle.launcher.bootstrap.EntryPoint.run(EntryPoint.java:45)
[ant:taskdef] 	at sun.reflect.NativeMethodAccessorImpl.invoke0(Native Method)
[ant:taskdef] 	at sun.reflect.NativeMethodAccessorImpl.invoke(NativeMethodAccessorImpl.java:62)
[ant:taskdef] 	at sun.reflect.DelegatingMethodAccessorImpl.invoke(DelegatingMethodAccessorImpl.java:43)
[ant:taskdef] 	at java.lang.reflect.Method.invoke(Method.java:497)
[ant:taskdef] 	at org.gradle.launcher.bootstrap.ProcessBootstrap.runNoExit(ProcessBootstrap.java:54)
[ant:taskdef] 	at org.gradle.launcher.bootstrap.ProcessBootstrap.run(ProcessBootstrap.java:35)
[ant:taskdef] 	at org.gradle.launcher.GradleMain.main(GradleMain.java:23)
[ant:taskdef] 	at sun.reflect.NativeMethodAccessorImpl.invoke0(Native Method)
[ant:taskdef] 	at sun.reflect.NativeMethodAccessorImpl.invoke(NativeMethodAccessorImpl.java:62)
[ant:taskdef] 	at sun.reflect.DelegatingMethodAccessorImpl.invoke(DelegatingMethodAccessorImpl.java:43)
[ant:taskdef] 	at java.lang.reflect.Method.invoke(Method.java:497)
[ant:taskdef] 	at org.gradle.wrapper.BootstrapMainStarter.start(BootstrapMainStarter.java:30)
[ant:taskdef] 	at org.gradle.wrapper.WrapperExecutor.execute(WrapperExecutor.java:127)
[ant:taskdef] 	at org.gradle.wrapper.GradleWrapperMain.main(GradleWrapperMain.java:56)
Unable to obtain resource from /opt/public/hipp/homes/genie.virgo/.gradle/caches/modules-2/files-2.1/org.apache.ant/com.springsource.org.apache.tools.ant.launch/1.7.0/2b8b815229aa8a61e483fb4ba0588b8b6c491890/license-1.7.0.txt: java.util.zip.ZipException: error in opening zip file
[ant:taskdef] Unable to obtain resource from /opt/public/hipp/homes/genie.virgo/.gradle/caches/modules-2/files-2.1/org.apache.ant/com.springsource.org.apache.tools.ant.launch/1.7.0/2b8b815229aa8a61e483fb4ba0588b8b6c491890/license-1.7.0.txt: 
[ant:taskdef] java.util.zip.ZipException: error in opening zip file
[ant:taskdef] 	at java.util.zip.ZipFile.open(Native Method)
[ant:taskdef] 	at java.util.zip.ZipFile.<init>(ZipFile.java:220)
[ant:taskdef] 	at java.util.zip.ZipFile.<init>(ZipFile.java:150)
[ant:taskdef] 	at java.util.jar.JarFile.<init>(JarFile.java:166)
[ant:taskdef] 	at java.util.jar.JarFile.<init>(JarFile.java:130)
[ant:taskdef] 	at org.apache.tools.ant.AntClassLoader.getResourceURL(AntClassLoader.java:1006)
[ant:taskdef] 	at org.apache.tools.ant.AntClassLoader$ResourceEnumeration.findNextResource(AntClassLoader.java:149)
[ant:taskdef] 	at org.apache.tools.ant.AntClassLoader$ResourceEnumeration.nextElement(AntClassLoader.java:134)
[ant:taskdef] 	at org.apache.tools.ant.AntClassLoader$ResourceEnumeration.nextElement(AntClassLoader.java:83)
[ant:taskdef] 	at org.apache.tools.ant.util.CollectionUtils$CompoundEnumeration.nextElement(CollectionUtils.java:239)
[ant:taskdef] 	at org.apache.tools.ant.taskdefs.Definer.execute(Definer.java:256)
[ant:taskdef] 	at org.apache.tools.ant.UnknownElement.execute(UnknownElement.java:292)
[ant:taskdef] 	at sun.reflect.GeneratedMethodAccessor265.invoke(Unknown Source)
[ant:taskdef] 	at sun.reflect.DelegatingMethodAccessorImpl.invoke(DelegatingMethodAccessorImpl.java:43)
[ant:taskdef] 	at java.lang.reflect.Method.invoke(Method.java:497)
[ant:taskdef] 	at org.apache.tools.ant.dispatch.DispatchUtils.execute(DispatchUtils.java:106)
[ant:taskdef] 	at groovy.util.AntBuilder.performTask(AntBuilder.java:319)
[ant:taskdef] 	at groovy.util.AntBuilder.nodeCompleted(AntBuilder.java:264)
[ant:taskdef] 	at org.gradle.api.internal.project.ant.BasicAntBuilder.nodeCompleted(BasicAntBuilder.java:71)
[ant:taskdef] 	at groovy.util.BuilderSupport.doInvokeMethod(BuilderSupport.java:147)
[ant:taskdef] 	at groovy.util.AntBuilder.doInvokeMethod(AntBuilder.java:203)
[ant:taskdef] 	at org.gradle.api.internal.project.ant.BasicAntBuilder.doInvokeMethod(BasicAntBuilder.java:86)
[ant:taskdef] 	at groovy.util.BuilderSupport.invokeMethod(BuilderSupport.java:64)
[ant:taskdef] 	at org.codehaus.groovy.runtime.callsite.PogoMetaClassSite.call(PogoMetaClassSite.java:45)
[ant:taskdef] 	at org.codehaus.groovy.runtime.callsite.AbstractCallSite.call(AbstractCallSite.java:116)
[ant:taskdef] 	at org.eclipse.virgo.bundlor.BundlorPlugin$_apply_closure6_closure9.doCall(BundlorPlugin.groovy:95)
[ant:taskdef] 	at sun.reflect.GeneratedMethodAccessor288.invoke(Unknown Source)
[ant:taskdef] 	at sun.reflect.DelegatingMethodAccessorImpl.invoke(DelegatingMethodAccessorImpl.java:43)
[ant:taskdef] 	at java.lang.reflect.Method.invoke(Method.java:497)
[ant:taskdef] 	at org.codehaus.groovy.reflection.CachedMethod.invoke(CachedMethod.java:90)
[ant:taskdef] 	at groovy.lang.MetaMethod.doMethodInvoke(MetaMethod.java:233)
[ant:taskdef] 	at org.codehaus.groovy.runtime.metaclass.ClosureMetaClass.invokeMethod(ClosureMetaClass.java:272)
[ant:taskdef] 	at groovy.lang.MetaClassImpl.invokeMethod(MetaClassImpl.java:909)
[ant:taskdef] 	at groovy.lang.Closure.call(Closure.java:423)
[ant:taskdef] 	at groovy.lang.Closure.call(Closure.java:439)
[ant:taskdef] 	at org.gradle.api.internal.AbstractTask$ClosureTaskAction.execute(AbstractTask.java:539)
[ant:taskdef] 	at org.gradle.api.internal.AbstractTask$ClosureTaskAction.execute(AbstractTask.java:520)
[ant:taskdef] 	at org.gradle.api.internal.tasks.execution.ExecuteActionsTaskExecuter.executeAction(ExecuteActionsTaskExecuter.java:80)
[ant:taskdef] 	at org.gradle.api.internal.tasks.execution.ExecuteActionsTaskExecuter.executeActions(ExecuteActionsTaskExecuter.java:61)
[ant:taskdef] 	at org.gradle.api.internal.tasks.execution.ExecuteActionsTaskExecuter.execute(ExecuteActionsTaskExecuter.java:46)
[ant:taskdef] 	at org.gradle.api.internal.tasks.execution.PostExecutionAnalysisTaskExecuter.execute(PostExecutionAnalysisTaskExecuter.java:35)
[ant:taskdef] 	at org.gradle.api.internal.tasks.execution.SkipUpToDateTaskExecuter.execute(SkipUpToDateTaskExecuter.java:64)
[ant:taskdef] 	at org.gradle.api.internal.tasks.execution.ValidatingTaskExecuter.execute(ValidatingTaskExecuter.java:58)
[ant:taskdef] 	at org.gradle.api.internal.tasks.execution.SkipEmptySourceFilesTaskExecuter.execute(SkipEmptySourceFilesTaskExecuter.java:42)
[ant:taskdef] 	at org.gradle.api.internal.tasks.execution.SkipTaskWithNoActionsExecuter.execute(SkipTaskWithNoActionsExecuter.java:52)
[ant:taskdef] 	at org.gradle.api.internal.tasks.execution.SkipOnlyIfTaskExecuter.execute(SkipOnlyIfTaskExecuter.java:53)
[ant:taskdef] 	at org.gradle.api.internal.tasks.execution.ExecuteAtMostOnceTaskExecuter.execute(ExecuteAtMostOnceTaskExecuter.java:43)
[ant:taskdef] 	at org.gradle.api.internal.AbstractTask.executeWithoutThrowingTaskFailure(AbstractTask.java:296)
[ant:taskdef] 	at org.gradle.execution.taskgraph.AbstractTaskPlanExecutor$TaskExecutorWorker.executeTask(AbstractTaskPlanExecutor.java:79)
[ant:taskdef] 	at org.gradle.execution.taskgraph.AbstractTaskPlanExecutor$TaskExecutorWorker.processTask(AbstractTaskPlanExecutor.java:63)
[ant:taskdef] 	at org.gradle.execution.taskgraph.AbstractTaskPlanExecutor$TaskExecutorWorker.run(AbstractTaskPlanExecutor.java:51)
[ant:taskdef] 	at org.gradle.execution.taskgraph.DefaultTaskPlanExecutor.process(DefaultTaskPlanExecutor.java:23)
[ant:taskdef] 	at org.gradle.execution.taskgraph.DefaultTaskGraphExecuter.execute(DefaultTaskGraphExecuter.java:86)
[ant:taskdef] 	at org.gradle.execution.SelectedTaskExecutionAction.execute(SelectedTaskExecutionAction.java:29)
[ant:taskdef] 	at org.gradle.execution.DefaultBuildExecuter.execute(DefaultBuildExecuter.java:61)
[ant:taskdef] 	at org.gradle.execution.DefaultBuildExecuter.access$200(DefaultBuildExecuter.java:23)
[ant:taskdef] 	at org.gradle.execution.DefaultBuildExecuter$2.proceed(DefaultBuildExecuter.java:67)
[ant:taskdef] 	at org.gradle.execution.DryRunBuildExecutionAction.execute(DryRunBuildExecutionAction.java:32)
[ant:taskdef] 	at org.gradle.execution.DefaultBuildExecuter.execute(DefaultBuildExecuter.java:61)
[ant:taskdef] 	at org.gradle.execution.DefaultBuildExecuter.execute(DefaultBuildExecuter.java:54)
[ant:taskdef] 	at org.gradle.initialization.DefaultGradleLauncher.doBuildStages(DefaultGradleLauncher.java:148)
[ant:taskdef] 	at org.gradle.initialization.DefaultGradleLauncher.doBuild(DefaultGradleLauncher.java:105)
[ant:taskdef] 	at org.gradle.initialization.DefaultGradleLauncher.run(DefaultGradleLauncher.java:85)
[ant:taskdef] 	at org.gradle.launcher.exec.InProcessBuildActionExecuter$DefaultBuildController.run(InProcessBuildActionExecuter.java:81)
[ant:taskdef] 	at org.gradle.launcher.cli.ExecuteBuildAction.run(ExecuteBuildAction.java:33)
[ant:taskdef] 	at org.gradle.launcher.cli.ExecuteBuildAction.run(ExecuteBuildAction.java:24)
[ant:taskdef] 	at org.gradle.launcher.exec.InProcessBuildActionExecuter.execute(InProcessBuildActionExecuter.java:39)
[ant:taskdef] 	at org.gradle.launcher.exec.InProcessBuildActionExecuter.execute(InProcessBuildActionExecuter.java:29)
[ant:taskdef] 	at org.gradle.launcher.cli.RunBuildAction.run(RunBuildAction.java:50)
[ant:taskdef] 	at org.gradle.internal.Actions$RunnableActionAdapter.execute(Actions.java:171)
[ant:taskdef] 	at org.gradle.launcher.cli.CommandLineActionFactory$ParseAndBuildAction.execute(CommandLineActionFactory.java:237)
[ant:taskdef] 	at org.gradle.launcher.cli.CommandLineActionFactory$ParseAndBuildAction.execute(CommandLineActionFactory.java:210)
[ant:taskdef] 	at org.gradle.launcher.cli.JavaRuntimeValidationAction.execute(JavaRuntimeValidationAction.java:35)
[ant:taskdef] 	at org.gradle.launcher.cli.JavaRuntimeValidationAction.execute(JavaRuntimeValidationAction.java:24)
[ant:taskdef] 	at org.gradle.launcher.cli.CommandLineActionFactory$WithLogging.execute(CommandLineActionFactory.java:206)
[ant:taskdef] 	at org.gradle.launcher.cli.CommandLineActionFactory$WithLogging.execute(CommandLineActionFactory.java:169)
[ant:taskdef] 	at org.gradle.launcher.cli.ExceptionReportingAction.execute(ExceptionReportingAction.java:33)
[ant:taskdef] 	at org.gradle.launcher.cli.ExceptionReportingAction.execute(ExceptionReportingAction.java:22)
[ant:taskdef] 	at org.gradle.launcher.Main.doAction(Main.java:33)
[ant:taskdef] 	at org.gradle.launcher.bootstrap.EntryPoint.run(EntryPoint.java:45)
[ant:taskdef] 	at sun.reflect.NativeMethodAccessorImpl.invoke0(Native Method)
[ant:taskdef] 	at sun.reflect.NativeMethodAccessorImpl.invoke(NativeMethodAccessorImpl.java:62)
[ant:taskdef] 	at sun.reflect.DelegatingMethodAccessorImpl.invoke(DelegatingMethodAccessorImpl.java:43)
[ant:taskdef] 	at java.lang.reflect.Method.invoke(Method.java:497)
[ant:taskdef] 	at org.gradle.launcher.bootstrap.ProcessBootstrap.runNoExit(ProcessBootstrap.java:54)
[ant:taskdef] 	at org.gradle.launcher.bootstrap.ProcessBootstrap.run(ProcessBootstrap.java:35)
[ant:taskdef] 	at org.gradle.launcher.GradleMain.main(GradleMain.java:23)
[ant:taskdef] 	at sun.reflect.NativeMethodAccessorImpl.invoke0(Native Method)
[ant:taskdef] 	at sun.reflect.NativeMethodAccessorImpl.invoke(NativeMethodAccessorImpl.java:62)
[ant:taskdef] 	at sun.reflect.DelegatingMethodAccessorImpl.invoke(DelegatingMethodAccessorImpl.java:43)
[ant:taskdef] 	at java.lang.reflect.Method.invoke(Method.java:497)
[ant:taskdef] 	at org.gradle.wrapper.BootstrapMainStarter.start(BootstrapMainStarter.java:30)
[ant:taskdef] 	at org.gradle.wrapper.WrapperExecutor.execute(WrapperExecutor.java:127)
[ant:taskdef] 	at org.gradle.wrapper.GradleWrapperMain.main(GradleWrapperMain.java:56)
Unable to obtain resource from /opt/public/hipp/homes/genie.virgo/.gradle/caches/modules-2/files-2.1/org.apache.ant/com.springsource.org.apache.tools.ant.launch/1.7.0/cb832720fcc4a4c22df3d40db4134d9e8bea5955/notice-1.7.0.txt: java.util.zip.ZipException: error in opening zip file
[ant:taskdef] Unable to obtain resource from /opt/public/hipp/homes/genie.virgo/.gradle/caches/modules-2/files-2.1/org.apache.ant/com.springsource.org.apache.tools.ant.launch/1.7.0/cb832720fcc4a4c22df3d40db4134d9e8bea5955/notice-1.7.0.txt: 
[ant:taskdef] java.util.zip.ZipException: error in opening zip file
[ant:taskdef] 	at java.util.zip.ZipFile.open(Native Method)
[ant:taskdef] 	at java.util.zip.ZipFile.<init>(ZipFile.java:220)
[ant:taskdef] 	at java.util.zip.ZipFile.<init>(ZipFile.java:150)
[ant:taskdef] 	at java.util.jar.JarFile.<init>(JarFile.java:166)
[ant:taskdef] 	at java.util.jar.JarFile.<init>(JarFile.java:130)
[ant:taskdef] 	at org.apache.tools.ant.AntClassLoader.getResourceURL(AntClassLoader.java:1006)
[ant:taskdef] 	at org.apache.tools.ant.AntClassLoader$ResourceEnumeration.findNextResource(AntClassLoader.java:149)
[ant:taskdef] 	at org.apache.tools.ant.AntClassLoader$ResourceEnumeration.nextElement(AntClassLoader.java:134)
[ant:taskdef] 	at org.apache.tools.ant.AntClassLoader$ResourceEnumeration.nextElement(AntClassLoader.java:83)
[ant:taskdef] 	at org.apache.tools.ant.util.CollectionUtils$CompoundEnumeration.nextElement(CollectionUtils.java:239)
[ant:taskdef] 	at org.apache.tools.ant.taskdefs.Definer.execute(Definer.java:256)
[ant:taskdef] 	at org.apache.tools.ant.UnknownElement.execute(UnknownElement.java:292)
[ant:taskdef] 	at sun.reflect.GeneratedMethodAccessor265.invoke(Unknown Source)
[ant:taskdef] 	at sun.reflect.DelegatingMethodAccessorImpl.invoke(DelegatingMethodAccessorImpl.java:43)
[ant:taskdef] 	at java.lang.reflect.Method.invoke(Method.java:497)
[ant:taskdef] 	at org.apache.tools.ant.dispatch.DispatchUtils.execute(DispatchUtils.java:106)
[ant:taskdef] 	at groovy.util.AntBuilder.performTask(AntBuilder.java:319)
[ant:taskdef] 	at groovy.util.AntBuilder.nodeCompleted(AntBuilder.java:264)
[ant:taskdef] 	at org.gradle.api.internal.project.ant.BasicAntBuilder.nodeCompleted(BasicAntBuilder.java:71)
[ant:taskdef] 	at groovy.util.BuilderSupport.doInvokeMethod(BuilderSupport.java:147)
[ant:taskdef] 	at groovy.util.AntBuilder.doInvokeMethod(AntBuilder.java:203)
[ant:taskdef] 	at org.gradle.api.internal.project.ant.BasicAntBuilder.doInvokeMethod(BasicAntBuilder.java:86)
[ant:taskdef] 	at groovy.util.BuilderSupport.invokeMethod(BuilderSupport.java:64)
[ant:taskdef] 	at org.codehaus.groovy.runtime.callsite.PogoMetaClassSite.call(PogoMetaClassSite.java:45)
[ant:taskdef] 	at org.codehaus.groovy.runtime.callsite.AbstractCallSite.call(AbstractCallSite.java:116)
[ant:taskdef] 	at org.eclipse.virgo.bundlor.BundlorPlugin$_apply_closure6_closure9.doCall(BundlorPlugin.groovy:95)
[ant:taskdef] 	at sun.reflect.GeneratedMethodAccessor288.invoke(Unknown Source)
[ant:taskdef] 	at sun.reflect.DelegatingMethodAccessorImpl.invoke(DelegatingMethodAccessorImpl.java:43)
[ant:taskdef] 	at java.lang.reflect.Method.invoke(Method.java:497)
[ant:taskdef] 	at org.codehaus.groovy.reflection.CachedMethod.invoke(CachedMethod.java:90)
[ant:taskdef] 	at groovy.lang.MetaMethod.doMethodInvoke(MetaMethod.java:233)
[ant:taskdef] 	at org.codehaus.groovy.runtime.metaclass.ClosureMetaClass.invokeMethod(ClosureMetaClass.java:272)
[ant:taskdef] 	at groovy.lang.MetaClassImpl.invokeMethod(MetaClassImpl.java:909)
[ant:taskdef] 	at groovy.lang.Closure.call(Closure.java:423)
[ant:taskdef] 	at groovy.lang.Closure.call(Closure.java:439)
[ant:taskdef] 	at org.gradle.api.internal.AbstractTask$ClosureTaskAction.execute(AbstractTask.java:539)
[ant:taskdef] 	at org.gradle.api.internal.AbstractTask$ClosureTaskAction.execute(AbstractTask.java:520)
[ant:taskdef] 	at org.gradle.api.internal.tasks.execution.ExecuteActionsTaskExecuter.executeAction(ExecuteActionsTaskExecuter.java:80)
[ant:taskdef] 	at org.gradle.api.internal.tasks.execution.ExecuteActionsTaskExecuter.executeActions(ExecuteActionsTaskExecuter.java:61)
[ant:taskdef] 	at org.gradle.api.internal.tasks.execution.ExecuteActionsTaskExecuter.execute(ExecuteActionsTaskExecuter.java:46)
[ant:taskdef] 	at org.gradle.api.internal.tasks.execution.PostExecutionAnalysisTaskExecuter.execute(PostExecutionAnalysisTaskExecuter.java:35)
[ant:taskdef] 	at org.gradle.api.internal.tasks.execution.SkipUpToDateTaskExecuter.execute(SkipUpToDateTaskExecuter.java:64)
[ant:taskdef] 	at org.gradle.api.internal.tasks.execution.ValidatingTaskExecuter.execute(ValidatingTaskExecuter.java:58)
[ant:taskdef] 	at org.gradle.api.internal.tasks.execution.SkipEmptySourceFilesTaskExecuter.execute(SkipEmptySourceFilesTaskExecuter.java:42)
[ant:taskdef] 	at org.gradle.api.internal.tasks.execution.SkipTaskWithNoActionsExecuter.execute(SkipTaskWithNoActionsExecuter.java:52)
[ant:taskdef] 	at org.gradle.api.internal.tasks.execution.SkipOnlyIfTaskExecuter.execute(SkipOnlyIfTaskExecuter.java:53)
[ant:taskdef] 	at org.gradle.api.internal.tasks.execution.ExecuteAtMostOnceTaskExecuter.execute(ExecuteAtMostOnceTaskExecuter.java:43)
[ant:taskdef] 	at org.gradle.api.internal.AbstractTask.executeWithoutThrowingTaskFailure(AbstractTask.java:296)
[ant:taskdef] 	at org.gradle.execution.taskgraph.AbstractTaskPlanExecutor$TaskExecutorWorker.executeTask(AbstractTaskPlanExecutor.java:79)
[ant:taskdef] 	at org.gradle.execution.taskgraph.AbstractTaskPlanExecutor$TaskExecutorWorker.processTask(AbstractTaskPlanExecutor.java:63)
[ant:taskdef] 	at org.gradle.execution.taskgraph.AbstractTaskPlanExecutor$TaskExecutorWorker.run(AbstractTaskPlanExecutor.java:51)
[ant:taskdef] 	at org.gradle.execution.taskgraph.DefaultTaskPlanExecutor.process(DefaultTaskPlanExecutor.java:23)
[ant:taskdef] 	at org.gradle.execution.taskgraph.DefaultTaskGraphExecuter.execute(DefaultTaskGraphExecuter.java:86)
[ant:taskdef] 	at org.gradle.execution.SelectedTaskExecutionAction.execute(SelectedTaskExecutionAction.java:29)
[ant:taskdef] 	at org.gradle.execution.DefaultBuildExecuter.execute(DefaultBuildExecuter.java:61)
[ant:taskdef] 	at org.gradle.execution.DefaultBuildExecuter.access$200(DefaultBuildExecuter.java:23)
[ant:taskdef] 	at org.gradle.execution.DefaultBuildExecuter$2.proceed(DefaultBuildExecuter.java:67)
[ant:taskdef] 	at org.gradle.execution.DryRunBuildExecutionAction.execute(DryRunBuildExecutionAction.java:32)
[ant:taskdef] 	at org.gradle.execution.DefaultBuildExecuter.execute(DefaultBuildExecuter.java:61)
[ant:taskdef] 	at org.gradle.execution.DefaultBuildExecuter.execute(DefaultBuildExecuter.java:54)
[ant:taskdef] 	at org.gradle.initialization.DefaultGradleLauncher.doBuildStages(DefaultGradleLauncher.java:148)
[ant:taskdef] 	at org.gradle.initialization.DefaultGradleLauncher.doBuild(DefaultGradleLauncher.java:105)
[ant:taskdef] 	at org.gradle.initialization.DefaultGradleLauncher.run(DefaultGradleLauncher.java:85)
[ant:taskdef] 	at org.gradle.launcher.exec.InProcessBuildActionExecuter$DefaultBuildController.run(InProcessBuildActionExecuter.java:81)
[ant:taskdef] 	at org.gradle.launcher.cli.ExecuteBuildAction.run(ExecuteBuildAction.java:33)
[ant:taskdef] 	at org.gradle.launcher.cli.ExecuteBuildAction.run(ExecuteBuildAction.java:24)
[ant:taskdef] 	at org.gradle.launcher.exec.InProcessBuildActionExecuter.execute(InProcessBuildActionExecuter.java:39)
[ant:taskdef] 	at org.gradle.launcher.exec.InProcessBuildActionExecuter.execute(InProcessBuildActionExecuter.java:29)
[ant:taskdef] 	at org.gradle.launcher.cli.RunBuildAction.run(RunBuildAction.java:50)
[ant:taskdef] 	at org.gradle.internal.Actions$RunnableActionAdapter.execute(Actions.java:171)
[ant:taskdef] 	at org.gradle.launcher.cli.CommandLineActionFactory$ParseAndBuildAction.execute(CommandLineActionFactory.java:237)
[ant:taskdef] 	at org.gradle.launcher.cli.CommandLineActionFactory$ParseAndBuildAction.execute(CommandLineActionFactory.java:210)
[ant:taskdef] 	at org.gradle.launcher.cli.JavaRuntimeValidationAction.execute(JavaRuntimeValidationAction.java:35)
[ant:taskdef] 	at org.gradle.launcher.cli.JavaRuntimeValidationAction.execute(JavaRuntimeValidationAction.java:24)
[ant:taskdef] 	at org.gradle.launcher.cli.CommandLineActionFactory$WithLogging.execute(CommandLineActionFactory.java:206)
[ant:taskdef] 	at org.gradle.launcher.cli.CommandLineActionFactory$WithLogging.execute(CommandLineActionFactory.java:169)
[ant:taskdef] 	at org.gradle.launcher.cli.ExceptionReportingAction.execute(ExceptionReportingAction.java:33)
[ant:taskdef] 	at org.gradle.launcher.cli.ExceptionReportingAction.execute(ExceptionReportingAction.java:22)
[ant:taskdef] 	at org.gradle.launcher.Main.doAction(Main.java:33)
[ant:taskdef] 	at org.gradle.launcher.bootstrap.EntryPoint.run(EntryPoint.java:45)
[ant:taskdef] 	at sun.reflect.NativeMethodAccessorImpl.invoke0(Native Method)
[ant:taskdef] 	at sun.reflect.NativeMethodAccessorImpl.invoke(NativeMethodAccessorImpl.java:62)
[ant:taskdef] 	at sun.reflect.DelegatingMethodAccessorImpl.invoke(DelegatingMethodAccessorImpl.java:43)
[ant:taskdef] 	at java.lang.reflect.Method.invoke(Method.java:497)
[ant:taskdef] 	at org.gradle.launcher.bootstrap.ProcessBootstrap.runNoExit(ProcessBootstrap.java:54)
[ant:taskdef] 	at org.gradle.launcher.bootstrap.ProcessBootstrap.run(ProcessBootstrap.java:35)
[ant:taskdef] 	at org.gradle.launcher.GradleMain.main(GradleMain.java:23)
[ant:taskdef] 	at sun.reflect.NativeMethodAccessorImpl.invoke0(Native Method)
[ant:taskdef] 	at sun.reflect.NativeMethodAccessorImpl.invoke(NativeMethodAccessorImpl.java:62)
[ant:taskdef] 	at sun.reflect.DelegatingMethodAccessorImpl.invoke(DelegatingMethodAccessorImpl.java:43)
[ant:taskdef] 	at java.lang.reflect.Method.invoke(Method.java:497)
[ant:taskdef] 	at org.gradle.wrapper.BootstrapMainStarter.start(BootstrapMainStarter.java:30)
[ant:taskdef] 	at org.gradle.wrapper.WrapperExecutor.execute(WrapperExecutor.java:127)
[ant:taskdef] 	at org.gradle.wrapper.GradleWrapperMain.main(GradleWrapperMain.java:56)
:web:org.eclipse.virgo.web.tomcat.support:jar
:web:org.eclipse.virgo.web.war.deployer:addProjectVersionToGradlePropertiesTask
:web:org.eclipse.virgo.web.war.deployer:compileJava
:web:org.eclipse.virgo.web.war.deployer:processResources
:web:org.eclipse.virgo.web.war.deployer:classes
:web:org.eclipse.virgo.web.war.deployer:mergeClassesAndResources
:web:org.eclipse.virgo.web.war.deployer:bundlor
Unable to obtain resource from /opt/public/hipp/homes/genie.virgo/.gradle/caches/modules-2/files-2.1/org.objectweb.asm/com.springsource.org.objectweb.asm/3.1.0/92aa30cba2e7151b9bc970e5f2a7acacef137550/license-3.1.0.txt: java.util.zip.ZipException: error in opening zip file
[ant:taskdef] Unable to obtain resource from /opt/public/hipp/homes/genie.virgo/.gradle/caches/modules-2/files-2.1/org.objectweb.asm/com.springsource.org.objectweb.asm/3.1.0/92aa30cba2e7151b9bc970e5f2a7acacef137550/license-3.1.0.txt: 
[ant:taskdef] java.util.zip.ZipException: error in opening zip file
[ant:taskdef] 	at java.util.zip.ZipFile.open(Native Method)
[ant:taskdef] 	at java.util.zip.ZipFile.<init>(ZipFile.java:220)
[ant:taskdef] 	at java.util.zip.ZipFile.<init>(ZipFile.java:150)
[ant:taskdef] 	at java.util.jar.JarFile.<init>(JarFile.java:166)
[ant:taskdef] 	at java.util.jar.JarFile.<init>(JarFile.java:130)
[ant:taskdef] 	at org.apache.tools.ant.AntClassLoader.getResourceURL(AntClassLoader.java:1006)
[ant:taskdef] 	at org.apache.tools.ant.AntClassLoader$ResourceEnumeration.findNextResource(AntClassLoader.java:149)
[ant:taskdef] 	at org.apache.tools.ant.AntClassLoader$ResourceEnumeration.nextElement(AntClassLoader.java:134)
[ant:taskdef] 	at org.apache.tools.ant.AntClassLoader$ResourceEnumeration.nextElement(AntClassLoader.java:83)
[ant:taskdef] 	at org.apache.tools.ant.util.CollectionUtils$CompoundEnumeration.nextElement(CollectionUtils.java:239)
[ant:taskdef] 	at org.apache.tools.ant.taskdefs.Definer.execute(Definer.java:256)
[ant:taskdef] 	at org.apache.tools.ant.UnknownElement.execute(UnknownElement.java:292)
[ant:taskdef] 	at sun.reflect.GeneratedMethodAccessor265.invoke(Unknown Source)
[ant:taskdef] 	at sun.reflect.DelegatingMethodAccessorImpl.invoke(DelegatingMethodAccessorImpl.java:43)
[ant:taskdef] 	at java.lang.reflect.Method.invoke(Method.java:497)
[ant:taskdef] 	at org.apache.tools.ant.dispatch.DispatchUtils.execute(DispatchUtils.java:106)
[ant:taskdef] 	at groovy.util.AntBuilder.performTask(AntBuilder.java:319)
[ant:taskdef] 	at groovy.util.AntBuilder.nodeCompleted(AntBuilder.java:264)
[ant:taskdef] 	at org.gradle.api.internal.project.ant.BasicAntBuilder.nodeCompleted(BasicAntBuilder.java:71)
[ant:taskdef] 	at groovy.util.BuilderSupport.doInvokeMethod(BuilderSupport.java:147)
[ant:taskdef] 	at groovy.util.AntBuilder.doInvokeMethod(AntBuilder.java:203)
[ant:taskdef] 	at org.gradle.api.internal.project.ant.BasicAntBuilder.doInvokeMethod(BasicAntBuilder.java:86)
[ant:taskdef] 	at groovy.util.BuilderSupport.invokeMethod(BuilderSupport.java:64)
[ant:taskdef] 	at org.codehaus.groovy.runtime.callsite.PogoMetaClassSite.call(PogoMetaClassSite.java:45)
[ant:taskdef] 	at org.codehaus.groovy.runtime.callsite.AbstractCallSite.call(AbstractCallSite.java:116)
[ant:taskdef] 	at org.eclipse.virgo.bundlor.BundlorPlugin$_apply_closure6_closure9.doCall(BundlorPlugin.groovy:95)
[ant:taskdef] 	at sun.reflect.GeneratedMethodAccessor288.invoke(Unknown Source)
[ant:taskdef] 	at sun.reflect.DelegatingMethodAccessorImpl.invoke(DelegatingMethodAccessorImpl.java:43)
[ant:taskdef] 	at java.lang.reflect.Method.invoke(Method.java:497)
[ant:taskdef] 	at org.codehaus.groovy.reflection.CachedMethod.invoke(CachedMethod.java:90)
[ant:taskdef] 	at groovy.lang.MetaMethod.doMethodInvoke(MetaMethod.java:233)
[ant:taskdef] 	at org.codehaus.groovy.runtime.metaclass.ClosureMetaClass.invokeMethod(ClosureMetaClass.java:272)
[ant:taskdef] 	at groovy.lang.MetaClassImpl.invokeMethod(MetaClassImpl.java:909)
[ant:taskdef] 	at groovy.lang.Closure.call(Closure.java:423)
[ant:taskdef] 	at groovy.lang.Closure.call(Closure.java:439)
[ant:taskdef] 	at org.gradle.api.internal.AbstractTask$ClosureTaskAction.execute(AbstractTask.java:539)
[ant:taskdef] 	at org.gradle.api.internal.AbstractTask$ClosureTaskAction.execute(AbstractTask.java:520)
[ant:taskdef] 	at org.gradle.api.internal.tasks.execution.ExecuteActionsTaskExecuter.executeAction(ExecuteActionsTaskExecuter.java:80)
[ant:taskdef] 	at org.gradle.api.internal.tasks.execution.ExecuteActionsTaskExecuter.executeActions(ExecuteActionsTaskExecuter.java:61)
[ant:taskdef] 	at org.gradle.api.internal.tasks.execution.ExecuteActionsTaskExecuter.execute(ExecuteActionsTaskExecuter.java:46)
[ant:taskdef] 	at org.gradle.api.internal.tasks.execution.PostExecutionAnalysisTaskExecuter.execute(PostExecutionAnalysisTaskExecuter.java:35)
[ant:taskdef] 	at org.gradle.api.internal.tasks.execution.SkipUpToDateTaskExecuter.execute(SkipUpToDateTaskExecuter.java:64)
[ant:taskdef] 	at org.gradle.api.internal.tasks.execution.ValidatingTaskExecuter.execute(ValidatingTaskExecuter.java:58)
[ant:taskdef] 	at org.gradle.api.internal.tasks.execution.SkipEmptySourceFilesTaskExecuter.execute(SkipEmptySourceFilesTaskExecuter.java:42)
[ant:taskdef] 	at org.gradle.api.internal.tasks.execution.SkipTaskWithNoActionsExecuter.execute(SkipTaskWithNoActionsExecuter.java:52)
[ant:taskdef] 	at org.gradle.api.internal.tasks.execution.SkipOnlyIfTaskExecuter.execute(SkipOnlyIfTaskExecuter.java:53)
[ant:taskdef] 	at org.gradle.api.internal.tasks.execution.ExecuteAtMostOnceTaskExecuter.execute(ExecuteAtMostOnceTaskExecuter.java:43)
[ant:taskdef] 	at org.gradle.api.internal.AbstractTask.executeWithoutThrowingTaskFailure(AbstractTask.java:296)
[ant:taskdef] 	at org.gradle.execution.taskgraph.AbstractTaskPlanExecutor$TaskExecutorWorker.executeTask(AbstractTaskPlanExecutor.java:79)
[ant:taskdef] 	at org.gradle.execution.taskgraph.AbstractTaskPlanExecutor$TaskExecutorWorker.processTask(AbstractTaskPlanExecutor.java:63)
[ant:taskdef] 	at org.gradle.execution.taskgraph.AbstractTaskPlanExecutor$TaskExecutorWorker.run(AbstractTaskPlanExecutor.java:51)
[ant:taskdef] 	at org.gradle.execution.taskgraph.DefaultTaskPlanExecutor.process(DefaultTaskPlanExecutor.java:23)
[ant:taskdef] 	at org.gradle.execution.taskgraph.DefaultTaskGraphExecuter.execute(DefaultTaskGraphExecuter.java:86)
[ant:taskdef] 	at org.gradle.execution.SelectedTaskExecutionAction.execute(SelectedTaskExecutionAction.java:29)
[ant:taskdef] 	at org.gradle.execution.DefaultBuildExecuter.execute(DefaultBuildExecuter.java:61)
[ant:taskdef] 	at org.gradle.execution.DefaultBuildExecuter.access$200(DefaultBuildExecuter.java:23)
[ant:taskdef] 	at org.gradle.execution.DefaultBuildExecuter$2.proceed(DefaultBuildExecuter.java:67)
[ant:taskdef] 	at org.gradle.execution.DryRunBuildExecutionAction.execute(DryRunBuildExecutionAction.java:32)
[ant:taskdef] 	at org.gradle.execution.DefaultBuildExecuter.execute(DefaultBuildExecuter.java:61)
[ant:taskdef] 	at org.gradle.execution.DefaultBuildExecuter.execute(DefaultBuildExecuter.java:54)
[ant:taskdef] 	at org.gradle.initialization.DefaultGradleLauncher.doBuildStages(DefaultGradleLauncher.java:148)
[ant:taskdef] 	at org.gradle.initialization.DefaultGradleLauncher.doBuild(DefaultGradleLauncher.java:105)
[ant:taskdef] 	at org.gradle.initialization.DefaultGradleLauncher.run(DefaultGradleLauncher.java:85)
[ant:taskdef] 	at org.gradle.launcher.exec.InProcessBuildActionExecuter$DefaultBuildController.run(InProcessBuildActionExecuter.java:81)
[ant:taskdef] 	at org.gradle.launcher.cli.ExecuteBuildAction.run(ExecuteBuildAction.java:33)
[ant:taskdef] 	at org.gradle.launcher.cli.ExecuteBuildAction.run(ExecuteBuildAction.java:24)
[ant:taskdef] 	at org.gradle.launcher.exec.InProcessBuildActionExecuter.execute(InProcessBuildActionExecuter.java:39)
[ant:taskdef] 	at org.gradle.launcher.exec.InProcessBuildActionExecuter.execute(InProcessBuildActionExecuter.java:29)
[ant:taskdef] 	at org.gradle.launcher.cli.RunBuildAction.run(RunBuildAction.java:50)
[ant:taskdef] 	at org.gradle.internal.Actions$RunnableActionAdapter.execute(Actions.java:171)
[ant:taskdef] 	at org.gradle.launcher.cli.CommandLineActionFactory$ParseAndBuildAction.execute(CommandLineActionFactory.java:237)
[ant:taskdef] 	at org.gradle.launcher.cli.CommandLineActionFactory$ParseAndBuildAction.execute(CommandLineActionFactory.java:210)
[ant:taskdef] 	at org.gradle.launcher.cli.JavaRuntimeValidationAction.execute(JavaRuntimeValidationAction.java:35)
[ant:taskdef] 	at org.gradle.launcher.cli.JavaRuntimeValidationAction.execute(JavaRuntimeValidationAction.java:24)
[ant:taskdef] 	at org.gradle.launcher.cli.CommandLineActionFactory$WithLogging.execute(CommandLineActionFactory.java:206)
[ant:taskdef] 	at org.gradle.launcher.cli.CommandLineActionFactory$WithLogging.execute(CommandLineActionFactory.java:169)
[ant:taskdef] 	at org.gradle.launcher.cli.ExceptionReportingAction.execute(ExceptionReportingAction.java:33)
[ant:taskdef] 	at org.gradle.launcher.cli.ExceptionReportingAction.execute(ExceptionReportingAction.java:22)
[ant:taskdef] 	at org.gradle.launcher.Main.doAction(Main.java:33)
[ant:taskdef] 	at org.gradle.launcher.bootstrap.EntryPoint.run(EntryPoint.java:45)
[ant:taskdef] 	at sun.reflect.NativeMethodAccessorImpl.invoke0(Native Method)
[ant:taskdef] 	at sun.reflect.NativeMethodAccessorImpl.invoke(NativeMethodAccessorImpl.java:62)
[ant:taskdef] 	at sun.reflect.DelegatingMethodAccessorImpl.invoke(DelegatingMethodAccessorImpl.java:43)
[ant:taskdef] 	at java.lang.reflect.Method.invoke(Method.java:497)
[ant:taskdef] 	at org.gradle.launcher.bootstrap.ProcessBootstrap.runNoExit(ProcessBootstrap.java:54)
[ant:taskdef] 	at org.gradle.launcher.bootstrap.ProcessBootstrap.run(ProcessBootstrap.java:35)
[ant:taskdef] 	at org.gradle.launcher.GradleMain.main(GradleMain.java:23)
[ant:taskdef] 	at sun.reflect.NativeMethodAccessorImpl.invoke0(Native Method)
[ant:taskdef] 	at sun.reflect.NativeMethodAccessorImpl.invoke(NativeMethodAccessorImpl.java:62)
[ant:taskdef] 	at sun.reflect.DelegatingMethodAccessorImpl.invoke(DelegatingMethodAccessorImpl.java:43)
[ant:taskdef] 	at java.lang.reflect.Method.invoke(Method.java:497)
[ant:taskdef] 	at org.gradle.wrapper.BootstrapMainStarter.start(BootstrapMainStarter.java:30)
[ant:taskdef] 	at org.gradle.wrapper.WrapperExecutor.execute(WrapperExecutor.java:127)
[ant:taskdef] 	at org.gradle.wrapper.GradleWrapperMain.main(GradleWrapperMain.java:56)
Unable to obtain resource from /opt/public/hipp/homes/genie.virgo/.gradle/caches/modules-2/files-2.1/org.objectweb.asm/com.springsource.org.objectweb.asm.tree/3.1.0/8f605e2fdf26a3bced0f2a9a11ce4825f9cbd90e/license-3.1.0.txt: java.util.zip.ZipException: error in opening zip file
[ant:taskdef] Unable to obtain resource from /opt/public/hipp/homes/genie.virgo/.gradle/caches/modules-2/files-2.1/org.objectweb.asm/com.springsource.org.objectweb.asm.tree/3.1.0/8f605e2fdf26a3bced0f2a9a11ce4825f9cbd90e/license-3.1.0.txt: 
[ant:taskdef] java.util.zip.ZipException: error in opening zip file
[ant:taskdef] 	at java.util.zip.ZipFile.open(Native Method)
[ant:taskdef] 	at java.util.zip.ZipFile.<init>(ZipFile.java:220)
[ant:taskdef] 	at java.util.zip.ZipFile.<init>(ZipFile.java:150)
[ant:taskdef] 	at java.util.jar.JarFile.<init>(JarFile.java:166)
[ant:taskdef] 	at java.util.jar.JarFile.<init>(JarFile.java:130)
[ant:taskdef] 	at org.apache.tools.ant.AntClassLoader.getResourceURL(AntClassLoader.java:1006)
[ant:taskdef] 	at org.apache.tools.ant.AntClassLoader$ResourceEnumeration.findNextResource(AntClassLoader.java:149)
[ant:taskdef] 	at org.apache.tools.ant.AntClassLoader$ResourceEnumeration.nextElement(AntClassLoader.java:134)
[ant:taskdef] 	at org.apache.tools.ant.AntClassLoader$ResourceEnumeration.nextElement(AntClassLoader.java:83)
[ant:taskdef] 	at org.apache.tools.ant.util.CollectionUtils$CompoundEnumeration.nextElement(CollectionUtils.java:239)
[ant:taskdef] 	at org.apache.tools.ant.taskdefs.Definer.execute(Definer.java:256)
[ant:taskdef] 	at org.apache.tools.ant.UnknownElement.execute(UnknownElement.java:292)
[ant:taskdef] 	at sun.reflect.GeneratedMethodAccessor265.invoke(Unknown Source)
[ant:taskdef] 	at sun.reflect.DelegatingMethodAccessorImpl.invoke(DelegatingMethodAccessorImpl.java:43)
[ant:taskdef] 	at java.lang.reflect.Method.invoke(Method.java:497)
[ant:taskdef] 	at org.apache.tools.ant.dispatch.DispatchUtils.execute(DispatchUtils.java:106)
[ant:taskdef] 	at groovy.util.AntBuilder.performTask(AntBuilder.java:319)
[ant:taskdef] 	at groovy.util.AntBuilder.nodeCompleted(AntBuilder.java:264)
[ant:taskdef] 	at org.gradle.api.internal.project.ant.BasicAntBuilder.nodeCompleted(BasicAntBuilder.java:71)
[ant:taskdef] 	at groovy.util.BuilderSupport.doInvokeMethod(BuilderSupport.java:147)
[ant:taskdef] 	at groovy.util.AntBuilder.doInvokeMethod(AntBuilder.java:203)
[ant:taskdef] 	at org.gradle.api.internal.project.ant.BasicAntBuilder.doInvokeMethod(BasicAntBuilder.java:86)
[ant:taskdef] 	at groovy.util.BuilderSupport.invokeMethod(BuilderSupport.java:64)
[ant:taskdef] 	at org.codehaus.groovy.runtime.callsite.PogoMetaClassSite.call(PogoMetaClassSite.java:45)
[ant:taskdef] 	at org.codehaus.groovy.runtime.callsite.AbstractCallSite.call(AbstractCallSite.java:116)
[ant:taskdef] 	at org.eclipse.virgo.bundlor.BundlorPlugin$_apply_closure6_closure9.doCall(BundlorPlugin.groovy:95)
[ant:taskdef] 	at sun.reflect.GeneratedMethodAccessor288.invoke(Unknown Source)
[ant:taskdef] 	at sun.reflect.DelegatingMethodAccessorImpl.invoke(DelegatingMethodAccessorImpl.java:43)
[ant:taskdef] 	at java.lang.reflect.Method.invoke(Method.java:497)
[ant:taskdef] 	at org.codehaus.groovy.reflection.CachedMethod.invoke(CachedMethod.java:90)
[ant:taskdef] 	at groovy.lang.MetaMethod.doMethodInvoke(MetaMethod.java:233)
[ant:taskdef] 	at org.codehaus.groovy.runtime.metaclass.ClosureMetaClass.invokeMethod(ClosureMetaClass.java:272)
[ant:taskdef] 	at groovy.lang.MetaClassImpl.invokeMethod(MetaClassImpl.java:909)
[ant:taskdef] 	at groovy.lang.Closure.call(Closure.java:423)
[ant:taskdef] 	at groovy.lang.Closure.call(Closure.java:439)
[ant:taskdef] 	at org.gradle.api.internal.AbstractTask$ClosureTaskAction.execute(AbstractTask.java:539)
[ant:taskdef] 	at org.gradle.api.internal.AbstractTask$ClosureTaskAction.execute(AbstractTask.java:520)
[ant:taskdef] 	at org.gradle.api.internal.tasks.execution.ExecuteActionsTaskExecuter.executeAction(ExecuteActionsTaskExecuter.java:80)
[ant:taskdef] 	at org.gradle.api.internal.tasks.execution.ExecuteActionsTaskExecuter.executeActions(ExecuteActionsTaskExecuter.java:61)
[ant:taskdef] 	at org.gradle.api.internal.tasks.execution.ExecuteActionsTaskExecuter.execute(ExecuteActionsTaskExecuter.java:46)
[ant:taskdef] 	at org.gradle.api.internal.tasks.execution.PostExecutionAnalysisTaskExecuter.execute(PostExecutionAnalysisTaskExecuter.java:35)
[ant:taskdef] 	at org.gradle.api.internal.tasks.execution.SkipUpToDateTaskExecuter.execute(SkipUpToDateTaskExecuter.java:64)
[ant:taskdef] 	at org.gradle.api.internal.tasks.execution.ValidatingTaskExecuter.execute(ValidatingTaskExecuter.java:58)
[ant:taskdef] 	at org.gradle.api.internal.tasks.execution.SkipEmptySourceFilesTaskExecuter.execute(SkipEmptySourceFilesTaskExecuter.java:42)
[ant:taskdef] 	at org.gradle.api.internal.tasks.execution.SkipTaskWithNoActionsExecuter.execute(SkipTaskWithNoActionsExecuter.java:52)
[ant:taskdef] 	at org.gradle.api.internal.tasks.execution.SkipOnlyIfTaskExecuter.execute(SkipOnlyIfTaskExecuter.java:53)
[ant:taskdef] 	at org.gradle.api.internal.tasks.execution.ExecuteAtMostOnceTaskExecuter.execute(ExecuteAtMostOnceTaskExecuter.java:43)
[ant:taskdef] 	at org.gradle.api.internal.AbstractTask.executeWithoutThrowingTaskFailure(AbstractTask.java:296)
[ant:taskdef] 	at org.gradle.execution.taskgraph.AbstractTaskPlanExecutor$TaskExecutorWorker.executeTask(AbstractTaskPlanExecutor.java:79)
[ant:taskdef] 	at org.gradle.execution.taskgraph.AbstractTaskPlanExecutor$TaskExecutorWorker.processTask(AbstractTaskPlanExecutor.java:63)
[ant:taskdef] 	at org.gradle.execution.taskgraph.AbstractTaskPlanExecutor$TaskExecutorWorker.run(AbstractTaskPlanExecutor.java:51)
[ant:taskdef] 	at org.gradle.execution.taskgraph.DefaultTaskPlanExecutor.process(DefaultTaskPlanExecutor.java:23)
[ant:taskdef] 	at org.gradle.execution.taskgraph.DefaultTaskGraphExecuter.execute(DefaultTaskGraphExecuter.java:86)
[ant:taskdef] 	at org.gradle.execution.SelectedTaskExecutionAction.execute(SelectedTaskExecutionAction.java:29)
[ant:taskdef] 	at org.gradle.execution.DefaultBuildExecuter.execute(DefaultBuildExecuter.java:61)
[ant:taskdef] 	at org.gradle.execution.DefaultBuildExecuter.access$200(DefaultBuildExecuter.java:23)
[ant:taskdef] 	at org.gradle.execution.DefaultBuildExecuter$2.proceed(DefaultBuildExecuter.java:67)
[ant:taskdef] 	at org.gradle.execution.DryRunBuildExecutionAction.execute(DryRunBuildExecutionAction.java:32)
[ant:taskdef] 	at org.gradle.execution.DefaultBuildExecuter.execute(DefaultBuildExecuter.java:61)
[ant:taskdef] 	at org.gradle.execution.DefaultBuildExecuter.execute(DefaultBuildExecuter.java:54)
[ant:taskdef] 	at org.gradle.initialization.DefaultGradleLauncher.doBuildStages(DefaultGradleLauncher.java:148)
[ant:taskdef] 	at org.gradle.initialization.DefaultGradleLauncher.doBuild(DefaultGradleLauncher.java:105)
[ant:taskdef] 	at org.gradle.initialization.DefaultGradleLauncher.run(DefaultGradleLauncher.java:85)
[ant:taskdef] 	at org.gradle.launcher.exec.InProcessBuildActionExecuter$DefaultBuildController.run(InProcessBuildActionExecuter.java:81)
[ant:taskdef] 	at org.gradle.launcher.cli.ExecuteBuildAction.run(ExecuteBuildAction.java:33)
[ant:taskdef] 	at org.gradle.launcher.cli.ExecuteBuildAction.run(ExecuteBuildAction.java:24)
[ant:taskdef] 	at org.gradle.launcher.exec.InProcessBuildActionExecuter.execute(InProcessBuildActionExecuter.java:39)
[ant:taskdef] 	at org.gradle.launcher.exec.InProcessBuildActionExecuter.execute(InProcessBuildActionExecuter.java:29)
[ant:taskdef] 	at org.gradle.launcher.cli.RunBuildAction.run(RunBuildAction.java:50)
[ant:taskdef] 	at org.gradle.internal.Actions$RunnableActionAdapter.execute(Actions.java:171)
[ant:taskdef] 	at org.gradle.launcher.cli.CommandLineActionFactory$ParseAndBuildAction.execute(CommandLineActionFactory.java:237)
[ant:taskdef] 	at org.gradle.launcher.cli.CommandLineActionFactory$ParseAndBuildAction.execute(CommandLineActionFactory.java:210)
[ant:taskdef] 	at org.gradle.launcher.cli.JavaRuntimeValidationAction.execute(JavaRuntimeValidationAction.java:35)
[ant:taskdef] 	at org.gradle.launcher.cli.JavaRuntimeValidationAction.execute(JavaRuntimeValidationAction.java:24)
[ant:taskdef] 	at org.gradle.launcher.cli.CommandLineActionFactory$WithLogging.execute(CommandLineActionFactory.java:206)
[ant:taskdef] 	at org.gradle.launcher.cli.CommandLineActionFactory$WithLogging.execute(CommandLineActionFactory.java:169)
[ant:taskdef] 	at org.gradle.launcher.cli.ExceptionReportingAction.execute(ExceptionReportingAction.java:33)
[ant:taskdef] 	at org.gradle.launcher.cli.ExceptionReportingAction.execute(ExceptionReportingAction.java:22)
[ant:taskdef] 	at org.gradle.launcher.Main.doAction(Main.java:33)
[ant:taskdef] 	at org.gradle.launcher.bootstrap.EntryPoint.run(EntryPoint.java:45)
[ant:taskdef] 	at sun.reflect.NativeMethodAccessorImpl.invoke0(Native Method)
[ant:taskdef] 	at sun.reflect.NativeMethodAccessorImpl.invoke(NativeMethodAccessorImpl.java:62)
[ant:taskdef] 	at sun.reflect.DelegatingMethodAccessorImpl.invoke(DelegatingMethodAccessorImpl.java:43)
[ant:taskdef] 	at java.lang.reflect.Method.invoke(Method.java:497)
[ant:taskdef] 	at org.gradle.launcher.bootstrap.ProcessBootstrap.runNoExit(ProcessBootstrap.java:54)
[ant:taskdef] 	at org.gradle.launcher.bootstrap.ProcessBootstrap.run(ProcessBootstrap.java:35)
[ant:taskdef] 	at org.gradle.launcher.GradleMain.main(GradleMain.java:23)
[ant:taskdef] 	at sun.reflect.NativeMethodAccessorImpl.invoke0(Native Method)
[ant:taskdef] 	at sun.reflect.NativeMethodAccessorImpl.invoke(NativeMethodAccessorImpl.java:62)
[ant:taskdef] 	at sun.reflect.DelegatingMethodAccessorImpl.invoke(DelegatingMethodAccessorImpl.java:43)
[ant:taskdef] 	at java.lang.reflect.Method.invoke(Method.java:497)
[ant:taskdef] 	at org.gradle.wrapper.BootstrapMainStarter.start(BootstrapMainStarter.java:30)
[ant:taskdef] 	at org.gradle.wrapper.WrapperExecutor.execute(WrapperExecutor.java:127)
[ant:taskdef] 	at org.gradle.wrapper.GradleWrapperMain.main(GradleWrapperMain.java:56)
Unable to obtain resource from /opt/public/hipp/homes/genie.virgo/.gradle/caches/modules-2/files-2.1/org.objectweb.asm/com.springsource.org.objectweb.asm.commons/3.1.0/92aa30cba2e7151b9bc970e5f2a7acacef137550/license-3.1.0.txt: java.util.zip.ZipException: error in opening zip file
[ant:taskdef] Unable to obtain resource from /opt/public/hipp/homes/genie.virgo/.gradle/caches/modules-2/files-2.1/org.objectweb.asm/com.springsource.org.objectweb.asm.commons/3.1.0/92aa30cba2e7151b9bc970e5f2a7acacef137550/license-3.1.0.txt: 
[ant:taskdef] java.util.zip.ZipException: error in opening zip file
[ant:taskdef] 	at java.util.zip.ZipFile.open(Native Method)
[ant:taskdef] 	at java.util.zip.ZipFile.<init>(ZipFile.java:220)
[ant:taskdef] 	at java.util.zip.ZipFile.<init>(ZipFile.java:150)
[ant:taskdef] 	at java.util.jar.JarFile.<init>(JarFile.java:166)
[ant:taskdef] 	at java.util.jar.JarFile.<init>(JarFile.java:130)
[ant:taskdef] 	at org.apache.tools.ant.AntClassLoader.getResourceURL(AntClassLoader.java:1006)
[ant:taskdef] 	at org.apache.tools.ant.AntClassLoader$ResourceEnumeration.findNextResource(AntClassLoader.java:149)
[ant:taskdef] 	at org.apache.tools.ant.AntClassLoader$ResourceEnumeration.nextElement(AntClassLoader.java:134)
[ant:taskdef] 	at org.apache.tools.ant.AntClassLoader$ResourceEnumeration.nextElement(AntClassLoader.java:83)
[ant:taskdef] 	at org.apache.tools.ant.util.CollectionUtils$CompoundEnumeration.nextElement(CollectionUtils.java:239)
[ant:taskdef] 	at org.apache.tools.ant.taskdefs.Definer.execute(Definer.java:256)
[ant:taskdef] 	at org.apache.tools.ant.UnknownElement.execute(UnknownElement.java:292)
[ant:taskdef] 	at sun.reflect.GeneratedMethodAccessor265.invoke(Unknown Source)
[ant:taskdef] 	at sun.reflect.DelegatingMethodAccessorImpl.invoke(DelegatingMethodAccessorImpl.java:43)
[ant:taskdef] 	at java.lang.reflect.Method.invoke(Method.java:497)
[ant:taskdef] 	at org.apache.tools.ant.dispatch.DispatchUtils.execute(DispatchUtils.java:106)
[ant:taskdef] 	at groovy.util.AntBuilder.performTask(AntBuilder.java:319)
[ant:taskdef] 	at groovy.util.AntBuilder.nodeCompleted(AntBuilder.java:264)
[ant:taskdef] 	at org.gradle.api.internal.project.ant.BasicAntBuilder.nodeCompleted(BasicAntBuilder.java:71)
[ant:taskdef] 	at groovy.util.BuilderSupport.doInvokeMethod(BuilderSupport.java:147)
[ant:taskdef] 	at groovy.util.AntBuilder.doInvokeMethod(AntBuilder.java:203)
[ant:taskdef] 	at org.gradle.api.internal.project.ant.BasicAntBuilder.doInvokeMethod(BasicAntBuilder.java:86)
[ant:taskdef] 	at groovy.util.BuilderSupport.invokeMethod(BuilderSupport.java:64)
[ant:taskdef] 	at org.codehaus.groovy.runtime.callsite.PogoMetaClassSite.call(PogoMetaClassSite.java:45)
[ant:taskdef] 	at org.codehaus.groovy.runtime.callsite.AbstractCallSite.call(AbstractCallSite.java:116)
[ant:taskdef] 	at org.eclipse.virgo.bundlor.BundlorPlugin$_apply_closure6_closure9.doCall(BundlorPlugin.groovy:95)
[ant:taskdef] 	at sun.reflect.GeneratedMethodAccessor288.invoke(Unknown Source)
[ant:taskdef] 	at sun.reflect.DelegatingMethodAccessorImpl.invoke(DelegatingMethodAccessorImpl.java:43)
[ant:taskdef] 	at java.lang.reflect.Method.invoke(Method.java:497)
[ant:taskdef] 	at org.codehaus.groovy.reflection.CachedMethod.invoke(CachedMethod.java:90)
[ant:taskdef] 	at groovy.lang.MetaMethod.doMethodInvoke(MetaMethod.java:233)
[ant:taskdef] 	at org.codehaus.groovy.runtime.metaclass.ClosureMetaClass.invokeMethod(ClosureMetaClass.java:272)
[ant:taskdef] 	at groovy.lang.MetaClassImpl.invokeMethod(MetaClassImpl.java:909)
[ant:taskdef] 	at groovy.lang.Closure.call(Closure.java:423)
[ant:taskdef] 	at groovy.lang.Closure.call(Closure.java:439)
[ant:taskdef] 	at org.gradle.api.internal.AbstractTask$ClosureTaskAction.execute(AbstractTask.java:539)
[ant:taskdef] 	at org.gradle.api.internal.AbstractTask$ClosureTaskAction.execute(AbstractTask.java:520)
[ant:taskdef] 	at org.gradle.api.internal.tasks.execution.ExecuteActionsTaskExecuter.executeAction(ExecuteActionsTaskExecuter.java:80)
[ant:taskdef] 	at org.gradle.api.internal.tasks.execution.ExecuteActionsTaskExecuter.executeActions(ExecuteActionsTaskExecuter.java:61)
[ant:taskdef] 	at org.gradle.api.internal.tasks.execution.ExecuteActionsTaskExecuter.execute(ExecuteActionsTaskExecuter.java:46)
[ant:taskdef] 	at org.gradle.api.internal.tasks.execution.PostExecutionAnalysisTaskExecuter.execute(PostExecutionAnalysisTaskExecuter.java:35)
[ant:taskdef] 	at org.gradle.api.internal.tasks.execution.SkipUpToDateTaskExecuter.execute(SkipUpToDateTaskExecuter.java:64)
[ant:taskdef] 	at org.gradle.api.internal.tasks.execution.ValidatingTaskExecuter.execute(ValidatingTaskExecuter.java:58)
[ant:taskdef] 	at org.gradle.api.internal.tasks.execution.SkipEmptySourceFilesTaskExecuter.execute(SkipEmptySourceFilesTaskExecuter.java:42)
[ant:taskdef] 	at org.gradle.api.internal.tasks.execution.SkipTaskWithNoActionsExecuter.execute(SkipTaskWithNoActionsExecuter.java:52)
[ant:taskdef] 	at org.gradle.api.internal.tasks.execution.SkipOnlyIfTaskExecuter.execute(SkipOnlyIfTaskExecuter.java:53)
[ant:taskdef] 	at org.gradle.api.internal.tasks.execution.ExecuteAtMostOnceTaskExecuter.execute(ExecuteAtMostOnceTaskExecuter.java:43)
[ant:taskdef] 	at org.gradle.api.internal.AbstractTask.executeWithoutThrowingTaskFailure(AbstractTask.java:296)
[ant:taskdef] 	at org.gradle.execution.taskgraph.AbstractTaskPlanExecutor$TaskExecutorWorker.executeTask(AbstractTaskPlanExecutor.java:79)
[ant:taskdef] 	at org.gradle.execution.taskgraph.AbstractTaskPlanExecutor$TaskExecutorWorker.processTask(AbstractTaskPlanExecutor.java:63)
[ant:taskdef] 	at org.gradle.execution.taskgraph.AbstractTaskPlanExecutor$TaskExecutorWorker.run(AbstractTaskPlanExecutor.java:51)
[ant:taskdef] 	at org.gradle.execution.taskgraph.DefaultTaskPlanExecutor.process(DefaultTaskPlanExecutor.java:23)
[ant:taskdef] 	at org.gradle.execution.taskgraph.DefaultTaskGraphExecuter.execute(DefaultTaskGraphExecuter.java:86)
[ant:taskdef] 	at org.gradle.execution.SelectedTaskExecutionAction.execute(SelectedTaskExecutionAction.java:29)
[ant:taskdef] 	at org.gradle.execution.DefaultBuildExecuter.execute(DefaultBuildExecuter.java:61)
[ant:taskdef] 	at org.gradle.execution.DefaultBuildExecuter.access$200(DefaultBuildExecuter.java:23)
[ant:taskdef] 	at org.gradle.execution.DefaultBuildExecuter$2.proceed(DefaultBuildExecuter.java:67)
[ant:taskdef] 	at org.gradle.execution.DryRunBuildExecutionAction.execute(DryRunBuildExecutionAction.java:32)
[ant:taskdef] 	at org.gradle.execution.DefaultBuildExecuter.execute(DefaultBuildExecuter.java:61)
[ant:taskdef] 	at org.gradle.execution.DefaultBuildExecuter.execute(DefaultBuildExecuter.java:54)
[ant:taskdef] 	at org.gradle.initialization.DefaultGradleLauncher.doBuildStages(DefaultGradleLauncher.java:148)
[ant:taskdef] 	at org.gradle.initialization.DefaultGradleLauncher.doBuild(DefaultGradleLauncher.java:105)
[ant:taskdef] 	at org.gradle.initialization.DefaultGradleLauncher.run(DefaultGradleLauncher.java:85)
[ant:taskdef] 	at org.gradle.launcher.exec.InProcessBuildActionExecuter$DefaultBuildController.run(InProcessBuildActionExecuter.java:81)
[ant:taskdef] 	at org.gradle.launcher.cli.ExecuteBuildAction.run(ExecuteBuildAction.java:33)
[ant:taskdef] 	at org.gradle.launcher.cli.ExecuteBuildAction.run(ExecuteBuildAction.java:24)
[ant:taskdef] 	at org.gradle.launcher.exec.InProcessBuildActionExecuter.execute(InProcessBuildActionExecuter.java:39)
[ant:taskdef] 	at org.gradle.launcher.exec.InProcessBuildActionExecuter.execute(InProcessBuildActionExecuter.java:29)
[ant:taskdef] 	at org.gradle.launcher.cli.RunBuildAction.run(RunBuildAction.java:50)
[ant:taskdef] 	at org.gradle.internal.Actions$RunnableActionAdapter.execute(Actions.java:171)
[ant:taskdef] 	at org.gradle.launcher.cli.CommandLineActionFactory$ParseAndBuildAction.execute(CommandLineActionFactory.java:237)
[ant:taskdef] 	at org.gradle.launcher.cli.CommandLineActionFactory$ParseAndBuildAction.execute(CommandLineActionFactory.java:210)
[ant:taskdef] 	at org.gradle.launcher.cli.JavaRuntimeValidationAction.execute(JavaRuntimeValidationAction.java:35)
[ant:taskdef] 	at org.gradle.launcher.cli.JavaRuntimeValidationAction.execute(JavaRuntimeValidationAction.java:24)
[ant:taskdef] 	at org.gradle.launcher.cli.CommandLineActionFactory$WithLogging.execute(CommandLineActionFactory.java:206)
[ant:taskdef] 	at org.gradle.launcher.cli.CommandLineActionFactory$WithLogging.execute(CommandLineActionFactory.java:169)
[ant:taskdef] 	at org.gradle.launcher.cli.ExceptionReportingAction.execute(ExceptionReportingAction.java:33)
[ant:taskdef] 	at org.gradle.launcher.cli.ExceptionReportingAction.execute(ExceptionReportingAction.java:22)
[ant:taskdef] 	at org.gradle.launcher.Main.doAction(Main.java:33)
[ant:taskdef] 	at org.gradle.launcher.bootstrap.EntryPoint.run(EntryPoint.java:45)
[ant:taskdef] 	at sun.reflect.NativeMethodAccessorImpl.invoke0(Native Method)
[ant:taskdef] 	at sun.reflect.NativeMethodAccessorImpl.invoke(NativeMethodAccessorImpl.java:62)
[ant:taskdef] 	at sun.reflect.DelegatingMethodAccessorImpl.invoke(DelegatingMethodAccessorImpl.java:43)
[ant:taskdef] 	at java.lang.reflect.Method.invoke(Method.java:497)
[ant:taskdef] 	at org.gradle.launcher.bootstrap.ProcessBootstrap.runNoExit(ProcessBootstrap.java:54)
[ant:taskdef] 	at org.gradle.launcher.bootstrap.ProcessBootstrap.run(ProcessBootstrap.java:35)
[ant:taskdef] 	at org.gradle.launcher.GradleMain.main(GradleMain.java:23)
[ant:taskdef] 	at sun.reflect.NativeMethodAccessorImpl.invoke0(Native Method)
[ant:taskdef] 	at sun.reflect.NativeMethodAccessorImpl.invoke(NativeMethodAccessorImpl.java:62)
[ant:taskdef] 	at sun.reflect.DelegatingMethodAccessorImpl.invoke(DelegatingMethodAccessorImpl.java:43)
[ant:taskdef] 	at java.lang.reflect.Method.invoke(Method.java:497)
[ant:taskdef] 	at org.gradle.wrapper.BootstrapMainStarter.start(BootstrapMainStarter.java:30)
[ant:taskdef] 	at org.gradle.wrapper.WrapperExecutor.execute(WrapperExecutor.java:127)
[ant:taskdef] 	at org.gradle.wrapper.GradleWrapperMain.main(GradleWrapperMain.java:56)
Unable to obtain resource from /opt/public/hipp/homes/genie.virgo/.gradle/caches/modules-2/files-2.1/org.apache.ant/com.springsource.org.apache.tools.ant/1.7.0/2b8b815229aa8a61e483fb4ba0588b8b6c491890/license-1.7.0.txt: java.util.zip.ZipException: error in opening zip file
[ant:taskdef] Unable to obtain resource from /opt/public/hipp/homes/genie.virgo/.gradle/caches/modules-2/files-2.1/org.apache.ant/com.springsource.org.apache.tools.ant/1.7.0/2b8b815229aa8a61e483fb4ba0588b8b6c491890/license-1.7.0.txt: 
[ant:taskdef] java.util.zip.ZipException: error in opening zip file
[ant:taskdef] 	at java.util.zip.ZipFile.open(Native Method)
[ant:taskdef] 	at java.util.zip.ZipFile.<init>(ZipFile.java:220)
[ant:taskdef] 	at java.util.zip.ZipFile.<init>(ZipFile.java:150)
[ant:taskdef] 	at java.util.jar.JarFile.<init>(JarFile.java:166)
[ant:taskdef] 	at java.util.jar.JarFile.<init>(JarFile.java:130)
[ant:taskdef] 	at org.apache.tools.ant.AntClassLoader.getResourceURL(AntClassLoader.java:1006)
[ant:taskdef] 	at org.apache.tools.ant.AntClassLoader$ResourceEnumeration.findNextResource(AntClassLoader.java:149)
[ant:taskdef] 	at org.apache.tools.ant.AntClassLoader$ResourceEnumeration.nextElement(AntClassLoader.java:134)
[ant:taskdef] 	at org.apache.tools.ant.AntClassLoader$ResourceEnumeration.nextElement(AntClassLoader.java:83)
[ant:taskdef] 	at org.apache.tools.ant.util.CollectionUtils$CompoundEnumeration.nextElement(CollectionUtils.java:239)
[ant:taskdef] 	at org.apache.tools.ant.taskdefs.Definer.execute(Definer.java:256)
[ant:taskdef] 	at org.apache.tools.ant.UnknownElement.execute(UnknownElement.java:292)
[ant:taskdef] 	at sun.reflect.GeneratedMethodAccessor265.invoke(Unknown Source)
[ant:taskdef] 	at sun.reflect.DelegatingMethodAccessorImpl.invoke(DelegatingMethodAccessorImpl.java:43)
[ant:taskdef] 	at java.lang.reflect.Method.invoke(Method.java:497)
[ant:taskdef] 	at org.apache.tools.ant.dispatch.DispatchUtils.execute(DispatchUtils.java:106)
[ant:taskdef] 	at groovy.util.AntBuilder.performTask(AntBuilder.java:319)
[ant:taskdef] 	at groovy.util.AntBuilder.nodeCompleted(AntBuilder.java:264)
[ant:taskdef] 	at org.gradle.api.internal.project.ant.BasicAntBuilder.nodeCompleted(BasicAntBuilder.java:71)
[ant:taskdef] 	at groovy.util.BuilderSupport.doInvokeMethod(BuilderSupport.java:147)
[ant:taskdef] 	at groovy.util.AntBuilder.doInvokeMethod(AntBuilder.java:203)
[ant:taskdef] 	at org.gradle.api.internal.project.ant.BasicAntBuilder.doInvokeMethod(BasicAntBuilder.java:86)
[ant:taskdef] 	at groovy.util.BuilderSupport.invokeMethod(BuilderSupport.java:64)
[ant:taskdef] 	at org.codehaus.groovy.runtime.callsite.PogoMetaClassSite.call(PogoMetaClassSite.java:45)
[ant:taskdef] 	at org.codehaus.groovy.runtime.callsite.AbstractCallSite.call(AbstractCallSite.java:116)
[ant:taskdef] 	at org.eclipse.virgo.bundlor.BundlorPlugin$_apply_closure6_closure9.doCall(BundlorPlugin.groovy:95)
[ant:taskdef] 	at sun.reflect.GeneratedMethodAccessor288.invoke(Unknown Source)
[ant:taskdef] 	at sun.reflect.DelegatingMethodAccessorImpl.invoke(DelegatingMethodAccessorImpl.java:43)
[ant:taskdef] 	at java.lang.reflect.Method.invoke(Method.java:497)
[ant:taskdef] 	at org.codehaus.groovy.reflection.CachedMethod.invoke(CachedMethod.java:90)
[ant:taskdef] 	at groovy.lang.MetaMethod.doMethodInvoke(MetaMethod.java:233)
[ant:taskdef] 	at org.codehaus.groovy.runtime.metaclass.ClosureMetaClass.invokeMethod(ClosureMetaClass.java:272)
[ant:taskdef] 	at groovy.lang.MetaClassImpl.invokeMethod(MetaClassImpl.java:909)
[ant:taskdef] 	at groovy.lang.Closure.call(Closure.java:423)
[ant:taskdef] 	at groovy.lang.Closure.call(Closure.java:439)
[ant:taskdef] 	at org.gradle.api.internal.AbstractTask$ClosureTaskAction.execute(AbstractTask.java:539)
[ant:taskdef] 	at org.gradle.api.internal.AbstractTask$ClosureTaskAction.execute(AbstractTask.java:520)
[ant:taskdef] 	at org.gradle.api.internal.tasks.execution.ExecuteActionsTaskExecuter.executeAction(ExecuteActionsTaskExecuter.java:80)
[ant:taskdef] 	at org.gradle.api.internal.tasks.execution.ExecuteActionsTaskExecuter.executeActions(ExecuteActionsTaskExecuter.java:61)
[ant:taskdef] 	at org.gradle.api.internal.tasks.execution.ExecuteActionsTaskExecuter.execute(ExecuteActionsTaskExecuter.java:46)
[ant:taskdef] 	at org.gradle.api.internal.tasks.execution.PostExecutionAnalysisTaskExecuter.execute(PostExecutionAnalysisTaskExecuter.java:35)
[ant:taskdef] 	at org.gradle.api.internal.tasks.execution.SkipUpToDateTaskExecuter.execute(SkipUpToDateTaskExecuter.java:64)
[ant:taskdef] 	at org.gradle.api.internal.tasks.execution.ValidatingTaskExecuter.execute(ValidatingTaskExecuter.java:58)
[ant:taskdef] 	at org.gradle.api.internal.tasks.execution.SkipEmptySourceFilesTaskExecuter.execute(SkipEmptySourceFilesTaskExecuter.java:42)
[ant:taskdef] 	at org.gradle.api.internal.tasks.execution.SkipTaskWithNoActionsExecuter.execute(SkipTaskWithNoActionsExecuter.java:52)
[ant:taskdef] 	at org.gradle.api.internal.tasks.execution.SkipOnlyIfTaskExecuter.execute(SkipOnlyIfTaskExecuter.java:53)
[ant:taskdef] 	at org.gradle.api.internal.tasks.execution.ExecuteAtMostOnceTaskExecuter.execute(ExecuteAtMostOnceTaskExecuter.java:43)
[ant:taskdef] 	at org.gradle.api.internal.AbstractTask.executeWithoutThrowingTaskFailure(AbstractTask.java:296)
[ant:taskdef] 	at org.gradle.execution.taskgraph.AbstractTaskPlanExecutor$TaskExecutorWorker.executeTask(AbstractTaskPlanExecutor.java:79)
[ant:taskdef] 	at org.gradle.execution.taskgraph.AbstractTaskPlanExecutor$TaskExecutorWorker.processTask(AbstractTaskPlanExecutor.java:63)
[ant:taskdef] 	at org.gradle.execution.taskgraph.AbstractTaskPlanExecutor$TaskExecutorWorker.run(AbstractTaskPlanExecutor.java:51)
[ant:taskdef] 	at org.gradle.execution.taskgraph.DefaultTaskPlanExecutor.process(DefaultTaskPlanExecutor.java:23)
[ant:taskdef] 	at org.gradle.execution.taskgraph.DefaultTaskGraphExecuter.execute(DefaultTaskGraphExecuter.java:86)
[ant:taskdef] 	at org.gradle.execution.SelectedTaskExecutionAction.execute(SelectedTaskExecutionAction.java:29)
[ant:taskdef] 	at org.gradle.execution.DefaultBuildExecuter.execute(DefaultBuildExecuter.java:61)
[ant:taskdef] 	at org.gradle.execution.DefaultBuildExecuter.access$200(DefaultBuildExecuter.java:23)
[ant:taskdef] 	at org.gradle.execution.DefaultBuildExecuter$2.proceed(DefaultBuildExecuter.java:67)
[ant:taskdef] 	at org.gradle.execution.DryRunBuildExecutionAction.execute(DryRunBuildExecutionAction.java:32)
[ant:taskdef] 	at org.gradle.execution.DefaultBuildExecuter.execute(DefaultBuildExecuter.java:61)
[ant:taskdef] 	at org.gradle.execution.DefaultBuildExecuter.execute(DefaultBuildExecuter.java:54)
[ant:taskdef] 	at org.gradle.initialization.DefaultGradleLauncher.doBuildStages(DefaultGradleLauncher.java:148)
[ant:taskdef] 	at org.gradle.initialization.DefaultGradleLauncher.doBuild(DefaultGradleLauncher.java:105)
[ant:taskdef] 	at org.gradle.initialization.DefaultGradleLauncher.run(DefaultGradleLauncher.java:85)
[ant:taskdef] 	at org.gradle.launcher.exec.InProcessBuildActionExecuter$DefaultBuildController.run(InProcessBuildActionExecuter.java:81)
[ant:taskdef] 	at org.gradle.launcher.cli.ExecuteBuildAction.run(ExecuteBuildAction.java:33)
[ant:taskdef] 	at org.gradle.launcher.cli.ExecuteBuildAction.run(ExecuteBuildAction.java:24)
[ant:taskdef] 	at org.gradle.launcher.exec.InProcessBuildActionExecuter.execute(InProcessBuildActionExecuter.java:39)
[ant:taskdef] 	at org.gradle.launcher.exec.InProcessBuildActionExecuter.execute(InProcessBuildActionExecuter.java:29)
[ant:taskdef] 	at org.gradle.launcher.cli.RunBuildAction.run(RunBuildAction.java:50)
[ant:taskdef] 	at org.gradle.internal.Actions$RunnableActionAdapter.execute(Actions.java:171)
[ant:taskdef] 	at org.gradle.launcher.cli.CommandLineActionFactory$ParseAndBuildAction.execute(CommandLineActionFactory.java:237)
[ant:taskdef] 	at org.gradle.launcher.cli.CommandLineActionFactory$ParseAndBuildAction.execute(CommandLineActionFactory.java:210)
[ant:taskdef] 	at org.gradle.launcher.cli.JavaRuntimeValidationAction.execute(JavaRuntimeValidationAction.java:35)
[ant:taskdef] 	at org.gradle.launcher.cli.JavaRuntimeValidationAction.execute(JavaRuntimeValidationAction.java:24)
[ant:taskdef] 	at org.gradle.launcher.cli.CommandLineActionFactory$WithLogging.execute(CommandLineActionFactory.java:206)
[ant:taskdef] 	at org.gradle.launcher.cli.CommandLineActionFactory$WithLogging.execute(CommandLineActionFactory.java:169)
[ant:taskdef] 	at org.gradle.launcher.cli.ExceptionReportingAction.execute(ExceptionReportingAction.java:33)
[ant:taskdef] 	at org.gradle.launcher.cli.ExceptionReportingAction.execute(ExceptionReportingAction.java:22)
[ant:taskdef] 	at org.gradle.launcher.Main.doAction(Main.java:33)
[ant:taskdef] 	at org.gradle.launcher.bootstrap.EntryPoint.run(EntryPoint.java:45)
[ant:taskdef] 	at sun.reflect.NativeMethodAccessorImpl.invoke0(Native Method)
[ant:taskdef] 	at sun.reflect.NativeMethodAccessorImpl.invoke(NativeMethodAccessorImpl.java:62)
[ant:taskdef] 	at sun.reflect.DelegatingMethodAccessorImpl.invoke(DelegatingMethodAccessorImpl.java:43)
[ant:taskdef] 	at java.lang.reflect.Method.invoke(Method.java:497)
[ant:taskdef] 	at org.gradle.launcher.bootstrap.ProcessBootstrap.runNoExit(ProcessBootstrap.java:54)
[ant:taskdef] 	at org.gradle.launcher.bootstrap.ProcessBootstrap.run(ProcessBootstrap.java:35)
[ant:taskdef] 	at org.gradle.launcher.GradleMain.main(GradleMain.java:23)
[ant:taskdef] 	at sun.reflect.NativeMethodAccessorImpl.invoke0(Native Method)
[ant:taskdef] 	at sun.reflect.NativeMethodAccessorImpl.invoke(NativeMethodAccessorImpl.java:62)
[ant:taskdef] 	at sun.reflect.DelegatingMethodAccessorImpl.invoke(DelegatingMethodAccessorImpl.java:43)
[ant:taskdef] 	at java.lang.reflect.Method.invoke(Method.java:497)
[ant:taskdef] 	at org.gradle.wrapper.BootstrapMainStarter.start(BootstrapMainStarter.java:30)
[ant:taskdef] 	at org.gradle.wrapper.WrapperExecutor.execute(WrapperExecutor.java:127)
[ant:taskdef] 	at org.gradle.wrapper.GradleWrapperMain.main(GradleWrapperMain.java:56)
Unable to obtain resource from /opt/public/hipp/homes/genie.virgo/.gradle/caches/modules-2/files-2.1/org.apache.ant/com.springsource.org.apache.tools.ant/1.7.0/cb832720fcc4a4c22df3d40db4134d9e8bea5955/notice-1.7.0.txt: java.util.zip.ZipException: error in opening zip file
[ant:taskdef] Unable to obtain resource from /opt/public/hipp/homes/genie.virgo/.gradle/caches/modules-2/files-2.1/org.apache.ant/com.springsource.org.apache.tools.ant/1.7.0/cb832720fcc4a4c22df3d40db4134d9e8bea5955/notice-1.7.0.txt: 
[ant:taskdef] java.util.zip.ZipException: error in opening zip file
[ant:taskdef] 	at java.util.zip.ZipFile.open(Native Method)
[ant:taskdef] 	at java.util.zip.ZipFile.<init>(ZipFile.java:220)
[ant:taskdef] 	at java.util.zip.ZipFile.<init>(ZipFile.java:150)
[ant:taskdef] 	at java.util.jar.JarFile.<init>(JarFile.java:166)
[ant:taskdef] 	at java.util.jar.JarFile.<init>(JarFile.java:130)
[ant:taskdef] 	at org.apache.tools.ant.AntClassLoader.getResourceURL(AntClassLoader.java:1006)
[ant:taskdef] 	at org.apache.tools.ant.AntClassLoader$ResourceEnumeration.findNextResource(AntClassLoader.java:149)
[ant:taskdef] 	at org.apache.tools.ant.AntClassLoader$ResourceEnumeration.nextElement(AntClassLoader.java:134)
[ant:taskdef] 	at org.apache.tools.ant.AntClassLoader$ResourceEnumeration.nextElement(AntClassLoader.java:83)
[ant:taskdef] 	at org.apache.tools.ant.util.CollectionUtils$CompoundEnumeration.nextElement(CollectionUtils.java:239)
[ant:taskdef] 	at org.apache.tools.ant.taskdefs.Definer.execute(Definer.java:256)
[ant:taskdef] 	at org.apache.tools.ant.UnknownElement.execute(UnknownElement.java:292)
[ant:taskdef] 	at sun.reflect.GeneratedMethodAccessor265.invoke(Unknown Source)
[ant:taskdef] 	at sun.reflect.DelegatingMethodAccessorImpl.invoke(DelegatingMethodAccessorImpl.java:43)
[ant:taskdef] 	at java.lang.reflect.Method.invoke(Method.java:497)
[ant:taskdef] 	at org.apache.tools.ant.dispatch.DispatchUtils.execute(DispatchUtils.java:106)
[ant:taskdef] 	at groovy.util.AntBuilder.performTask(AntBuilder.java:319)
[ant:taskdef] 	at groovy.util.AntBuilder.nodeCompleted(AntBuilder.java:264)
[ant:taskdef] 	at org.gradle.api.internal.project.ant.BasicAntBuilder.nodeCompleted(BasicAntBuilder.java:71)
[ant:taskdef] 	at groovy.util.BuilderSupport.doInvokeMethod(BuilderSupport.java:147)
[ant:taskdef] 	at groovy.util.AntBuilder.doInvokeMethod(AntBuilder.java:203)
[ant:taskdef] 	at org.gradle.api.internal.project.ant.BasicAntBuilder.doInvokeMethod(BasicAntBuilder.java:86)
[ant:taskdef] 	at groovy.util.BuilderSupport.invokeMethod(BuilderSupport.java:64)
[ant:taskdef] 	at org.codehaus.groovy.runtime.callsite.PogoMetaClassSite.call(PogoMetaClassSite.java:45)
[ant:taskdef] 	at org.codehaus.groovy.runtime.callsite.AbstractCallSite.call(AbstractCallSite.java:116)
[ant:taskdef] 	at org.eclipse.virgo.bundlor.BundlorPlugin$_apply_closure6_closure9.doCall(BundlorPlugin.groovy:95)
[ant:taskdef] 	at sun.reflect.GeneratedMethodAccessor288.invoke(Unknown Source)
[ant:taskdef] 	at sun.reflect.DelegatingMethodAccessorImpl.invoke(DelegatingMethodAccessorImpl.java:43)
[ant:taskdef] 	at java.lang.reflect.Method.invoke(Method.java:497)
[ant:taskdef] 	at org.codehaus.groovy.reflection.CachedMethod.invoke(CachedMethod.java:90)
[ant:taskdef] 	at groovy.lang.MetaMethod.doMethodInvoke(MetaMethod.java:233)
[ant:taskdef] 	at org.codehaus.groovy.runtime.metaclass.ClosureMetaClass.invokeMethod(ClosureMetaClass.java:272)
[ant:taskdef] 	at groovy.lang.MetaClassImpl.invokeMethod(MetaClassImpl.java:909)
[ant:taskdef] 	at groovy.lang.Closure.call(Closure.java:423)
[ant:taskdef] 	at groovy.lang.Closure.call(Closure.java:439)
[ant:taskdef] 	at org.gradle.api.internal.AbstractTask$ClosureTaskAction.execute(AbstractTask.java:539)
[ant:taskdef] 	at org.gradle.api.internal.AbstractTask$ClosureTaskAction.execute(AbstractTask.java:520)
[ant:taskdef] 	at org.gradle.api.internal.tasks.execution.ExecuteActionsTaskExecuter.executeAction(ExecuteActionsTaskExecuter.java:80)
[ant:taskdef] 	at org.gradle.api.internal.tasks.execution.ExecuteActionsTaskExecuter.executeActions(ExecuteActionsTaskExecuter.java:61)
[ant:taskdef] 	at org.gradle.api.internal.tasks.execution.ExecuteActionsTaskExecuter.execute(ExecuteActionsTaskExecuter.java:46)
[ant:taskdef] 	at org.gradle.api.internal.tasks.execution.PostExecutionAnalysisTaskExecuter.execute(PostExecutionAnalysisTaskExecuter.java:35)
[ant:taskdef] 	at org.gradle.api.internal.tasks.execution.SkipUpToDateTaskExecuter.execute(SkipUpToDateTaskExecuter.java:64)
[ant:taskdef] 	at org.gradle.api.internal.tasks.execution.ValidatingTaskExecuter.execute(ValidatingTaskExecuter.java:58)
[ant:taskdef] 	at org.gradle.api.internal.tasks.execution.SkipEmptySourceFilesTaskExecuter.execute(SkipEmptySourceFilesTaskExecuter.java:42)
[ant:taskdef] 	at org.gradle.api.internal.tasks.execution.SkipTaskWithNoActionsExecuter.execute(SkipTaskWithNoActionsExecuter.java:52)
[ant:taskdef] 	at org.gradle.api.internal.tasks.execution.SkipOnlyIfTaskExecuter.execute(SkipOnlyIfTaskExecuter.java:53)
[ant:taskdef] 	at org.gradle.api.internal.tasks.execution.ExecuteAtMostOnceTaskExecuter.execute(ExecuteAtMostOnceTaskExecuter.java:43)
[ant:taskdef] 	at org.gradle.api.internal.AbstractTask.executeWithoutThrowingTaskFailure(AbstractTask.java:296)
[ant:taskdef] 	at org.gradle.execution.taskgraph.AbstractTaskPlanExecutor$TaskExecutorWorker.executeTask(AbstractTaskPlanExecutor.java:79)
[ant:taskdef] 	at org.gradle.execution.taskgraph.AbstractTaskPlanExecutor$TaskExecutorWorker.processTask(AbstractTaskPlanExecutor.java:63)
[ant:taskdef] 	at org.gradle.execution.taskgraph.AbstractTaskPlanExecutor$TaskExecutorWorker.run(AbstractTaskPlanExecutor.java:51)
[ant:taskdef] 	at org.gradle.execution.taskgraph.DefaultTaskPlanExecutor.process(DefaultTaskPlanExecutor.java:23)
[ant:taskdef] 	at org.gradle.execution.taskgraph.DefaultTaskGraphExecuter.execute(DefaultTaskGraphExecuter.java:86)
[ant:taskdef] 	at org.gradle.execution.SelectedTaskExecutionAction.execute(SelectedTaskExecutionAction.java:29)
[ant:taskdef] 	at org.gradle.execution.DefaultBuildExecuter.execute(DefaultBuildExecuter.java:61)
[ant:taskdef] 	at org.gradle.execution.DefaultBuildExecuter.access$200(DefaultBuildExecuter.java:23)
[ant:taskdef] 	at org.gradle.execution.DefaultBuildExecuter$2.proceed(DefaultBuildExecuter.java:67)
[ant:taskdef] 	at org.gradle.execution.DryRunBuildExecutionAction.execute(DryRunBuildExecutionAction.java:32)
[ant:taskdef] 	at org.gradle.execution.DefaultBuildExecuter.execute(DefaultBuildExecuter.java:61)
[ant:taskdef] 	at org.gradle.execution.DefaultBuildExecuter.execute(DefaultBuildExecuter.java:54)
[ant:taskdef] 	at org.gradle.initialization.DefaultGradleLauncher.doBuildStages(DefaultGradleLauncher.java:148)
[ant:taskdef] 	at org.gradle.initialization.DefaultGradleLauncher.doBuild(DefaultGradleLauncher.java:105)
[ant:taskdef] 	at org.gradle.initialization.DefaultGradleLauncher.run(DefaultGradleLauncher.java:85)
[ant:taskdef] 	at org.gradle.launcher.exec.InProcessBuildActionExecuter$DefaultBuildController.run(InProcessBuildActionExecuter.java:81)
[ant:taskdef] 	at org.gradle.launcher.cli.ExecuteBuildAction.run(ExecuteBuildAction.java:33)
[ant:taskdef] 	at org.gradle.launcher.cli.ExecuteBuildAction.run(ExecuteBuildAction.java:24)
[ant:taskdef] 	at org.gradle.launcher.exec.InProcessBuildActionExecuter.execute(InProcessBuildActionExecuter.java:39)
[ant:taskdef] 	at org.gradle.launcher.exec.InProcessBuildActionExecuter.execute(InProcessBuildActionExecuter.java:29)
[ant:taskdef] 	at org.gradle.launcher.cli.RunBuildAction.run(RunBuildAction.java:50)
[ant:taskdef] 	at org.gradle.internal.Actions$RunnableActionAdapter.execute(Actions.java:171)
[ant:taskdef] 	at org.gradle.launcher.cli.CommandLineActionFactory$ParseAndBuildAction.execute(CommandLineActionFactory.java:237)
[ant:taskdef] 	at org.gradle.launcher.cli.CommandLineActionFactory$ParseAndBuildAction.execute(CommandLineActionFactory.java:210)
[ant:taskdef] 	at org.gradle.launcher.cli.JavaRuntimeValidationAction.execute(JavaRuntimeValidationAction.java:35)
[ant:taskdef] 	at org.gradle.launcher.cli.JavaRuntimeValidationAction.execute(JavaRuntimeValidationAction.java:24)
[ant:taskdef] 	at org.gradle.launcher.cli.CommandLineActionFactory$WithLogging.execute(CommandLineActionFactory.java:206)
[ant:taskdef] 	at org.gradle.launcher.cli.CommandLineActionFactory$WithLogging.execute(CommandLineActionFactory.java:169)
[ant:taskdef] 	at org.gradle.launcher.cli.ExceptionReportingAction.execute(ExceptionReportingAction.java:33)
[ant:taskdef] 	at org.gradle.launcher.cli.ExceptionReportingAction.execute(ExceptionReportingAction.java:22)
[ant:taskdef] 	at org.gradle.launcher.Main.doAction(Main.java:33)
[ant:taskdef] 	at org.gradle.launcher.bootstrap.EntryPoint.run(EntryPoint.java:45)
[ant:taskdef] 	at sun.reflect.NativeMethodAccessorImpl.invoke0(Native Method)
[ant:taskdef] 	at sun.reflect.NativeMethodAccessorImpl.invoke(NativeMethodAccessorImpl.java:62)
[ant:taskdef] 	at sun.reflect.DelegatingMethodAccessorImpl.invoke(DelegatingMethodAccessorImpl.java:43)
[ant:taskdef] 	at java.lang.reflect.Method.invoke(Method.java:497)
[ant:taskdef] 	at org.gradle.launcher.bootstrap.ProcessBootstrap.runNoExit(ProcessBootstrap.java:54)
[ant:taskdef] 	at org.gradle.launcher.bootstrap.ProcessBootstrap.run(ProcessBootstrap.java:35)
[ant:taskdef] 	at org.gradle.launcher.GradleMain.main(GradleMain.java:23)
[ant:taskdef] 	at sun.reflect.NativeMethodAccessorImpl.invoke0(Native Method)
[ant:taskdef] 	at sun.reflect.NativeMethodAccessorImpl.invoke(NativeMethodAccessorImpl.java:62)
[ant:taskdef] 	at sun.reflect.DelegatingMethodAccessorImpl.invoke(DelegatingMethodAccessorImpl.java:43)
[ant:taskdef] 	at java.lang.reflect.Method.invoke(Method.java:497)
[ant:taskdef] 	at org.gradle.wrapper.BootstrapMainStarter.start(BootstrapMainStarter.java:30)
[ant:taskdef] 	at org.gradle.wrapper.WrapperExecutor.execute(WrapperExecutor.java:127)
[ant:taskdef] 	at org.gradle.wrapper.GradleWrapperMain.main(GradleWrapperMain.java:56)
Unable to obtain resource from /opt/public/hipp/homes/genie.virgo/.gradle/caches/modules-2/files-2.1/org.slf4j/com.springsource.slf4j.api/1.6.1/5e9ef2d166b9ebbbaa1a48c93557a90ccfee8140/license-1.6.1.txt: java.util.zip.ZipException: error in opening zip file
[ant:taskdef] Unable to obtain resource from /opt/public/hipp/homes/genie.virgo/.gradle/caches/modules-2/files-2.1/org.slf4j/com.springsource.slf4j.api/1.6.1/5e9ef2d166b9ebbbaa1a48c93557a90ccfee8140/license-1.6.1.txt: 
[ant:taskdef] java.util.zip.ZipException: error in opening zip file
[ant:taskdef] 	at java.util.zip.ZipFile.open(Native Method)
[ant:taskdef] 	at java.util.zip.ZipFile.<init>(ZipFile.java:220)
[ant:taskdef] 	at java.util.zip.ZipFile.<init>(ZipFile.java:150)
[ant:taskdef] 	at java.util.jar.JarFile.<init>(JarFile.java:166)
[ant:taskdef] 	at java.util.jar.JarFile.<init>(JarFile.java:130)
[ant:taskdef] 	at org.apache.tools.ant.AntClassLoader.getResourceURL(AntClassLoader.java:1006)
[ant:taskdef] 	at org.apache.tools.ant.AntClassLoader$ResourceEnumeration.findNextResource(AntClassLoader.java:149)
[ant:taskdef] 	at org.apache.tools.ant.AntClassLoader$ResourceEnumeration.nextElement(AntClassLoader.java:134)
[ant:taskdef] 	at org.apache.tools.ant.AntClassLoader$ResourceEnumeration.nextElement(AntClassLoader.java:83)
[ant:taskdef] 	at org.apache.tools.ant.util.CollectionUtils$CompoundEnumeration.nextElement(CollectionUtils.java:239)
[ant:taskdef] 	at org.apache.tools.ant.taskdefs.Definer.execute(Definer.java:256)
[ant:taskdef] 	at org.apache.tools.ant.UnknownElement.execute(UnknownElement.java:292)
[ant:taskdef] 	at sun.reflect.GeneratedMethodAccessor265.invoke(Unknown Source)
[ant:taskdef] 	at sun.reflect.DelegatingMethodAccessorImpl.invoke(DelegatingMethodAccessorImpl.java:43)
[ant:taskdef] 	at java.lang.reflect.Method.invoke(Method.java:497)
[ant:taskdef] 	at org.apache.tools.ant.dispatch.DispatchUtils.execute(DispatchUtils.java:106)
[ant:taskdef] 	at groovy.util.AntBuilder.performTask(AntBuilder.java:319)
[ant:taskdef] 	at groovy.util.AntBuilder.nodeCompleted(AntBuilder.java:264)
[ant:taskdef] 	at org.gradle.api.internal.project.ant.BasicAntBuilder.nodeCompleted(BasicAntBuilder.java:71)
[ant:taskdef] 	at groovy.util.BuilderSupport.doInvokeMethod(BuilderSupport.java:147)
[ant:taskdef] 	at groovy.util.AntBuilder.doInvokeMethod(AntBuilder.java:203)
[ant:taskdef] 	at org.gradle.api.internal.project.ant.BasicAntBuilder.doInvokeMethod(BasicAntBuilder.java:86)
[ant:taskdef] 	at groovy.util.BuilderSupport.invokeMethod(BuilderSupport.java:64)
[ant:taskdef] 	at org.codehaus.groovy.runtime.callsite.PogoMetaClassSite.call(PogoMetaClassSite.java:45)
[ant:taskdef] 	at org.codehaus.groovy.runtime.callsite.AbstractCallSite.call(AbstractCallSite.java:116)
[ant:taskdef] 	at org.eclipse.virgo.bundlor.BundlorPlugin$_apply_closure6_closure9.doCall(BundlorPlugin.groovy:95)
[ant:taskdef] 	at sun.reflect.GeneratedMethodAccessor288.invoke(Unknown Source)
[ant:taskdef] 	at sun.reflect.DelegatingMethodAccessorImpl.invoke(DelegatingMethodAccessorImpl.java:43)
[ant:taskdef] 	at java.lang.reflect.Method.invoke(Method.java:497)
[ant:taskdef] 	at org.codehaus.groovy.reflection.CachedMethod.invoke(CachedMethod.java:90)
[ant:taskdef] 	at groovy.lang.MetaMethod.doMethodInvoke(MetaMethod.java:233)
[ant:taskdef] 	at org.codehaus.groovy.runtime.metaclass.ClosureMetaClass.invokeMethod(ClosureMetaClass.java:272)
[ant:taskdef] 	at groovy.lang.MetaClassImpl.invokeMethod(MetaClassImpl.java:909)
[ant:taskdef] 	at groovy.lang.Closure.call(Closure.java:423)
[ant:taskdef] 	at groovy.lang.Closure.call(Closure.java:439)
[ant:taskdef] 	at org.gradle.api.internal.AbstractTask$ClosureTaskAction.execute(AbstractTask.java:539)
[ant:taskdef] 	at org.gradle.api.internal.AbstractTask$ClosureTaskAction.execute(AbstractTask.java:520)
[ant:taskdef] 	at org.gradle.api.internal.tasks.execution.ExecuteActionsTaskExecuter.executeAction(ExecuteActionsTaskExecuter.java:80)
[ant:taskdef] 	at org.gradle.api.internal.tasks.execution.ExecuteActionsTaskExecuter.executeActions(ExecuteActionsTaskExecuter.java:61)
[ant:taskdef] 	at org.gradle.api.internal.tasks.execution.ExecuteActionsTaskExecuter.execute(ExecuteActionsTaskExecuter.java:46)
[ant:taskdef] 	at org.gradle.api.internal.tasks.execution.PostExecutionAnalysisTaskExecuter.execute(PostExecutionAnalysisTaskExecuter.java:35)
[ant:taskdef] 	at org.gradle.api.internal.tasks.execution.SkipUpToDateTaskExecuter.execute(SkipUpToDateTaskExecuter.java:64)
[ant:taskdef] 	at org.gradle.api.internal.tasks.execution.ValidatingTaskExecuter.execute(ValidatingTaskExecuter.java:58)
[ant:taskdef] 	at org.gradle.api.internal.tasks.execution.SkipEmptySourceFilesTaskExecuter.execute(SkipEmptySourceFilesTaskExecuter.java:42)
[ant:taskdef] 	at org.gradle.api.internal.tasks.execution.SkipTaskWithNoActionsExecuter.execute(SkipTaskWithNoActionsExecuter.java:52)
[ant:taskdef] 	at org.gradle.api.internal.tasks.execution.SkipOnlyIfTaskExecuter.execute(SkipOnlyIfTaskExecuter.java:53)
[ant:taskdef] 	at org.gradle.api.internal.tasks.execution.ExecuteAtMostOnceTaskExecuter.execute(ExecuteAtMostOnceTaskExecuter.java:43)
[ant:taskdef] 	at org.gradle.api.internal.AbstractTask.executeWithoutThrowingTaskFailure(AbstractTask.java:296)
[ant:taskdef] 	at org.gradle.execution.taskgraph.AbstractTaskPlanExecutor$TaskExecutorWorker.executeTask(AbstractTaskPlanExecutor.java:79)
[ant:taskdef] 	at org.gradle.execution.taskgraph.AbstractTaskPlanExecutor$TaskExecutorWorker.processTask(AbstractTaskPlanExecutor.java:63)
[ant:taskdef] 	at org.gradle.execution.taskgraph.AbstractTaskPlanExecutor$TaskExecutorWorker.run(AbstractTaskPlanExecutor.java:51)
[ant:taskdef] 	at org.gradle.execution.taskgraph.DefaultTaskPlanExecutor.process(DefaultTaskPlanExecutor.java:23)
[ant:taskdef] 	at org.gradle.execution.taskgraph.DefaultTaskGraphExecuter.execute(DefaultTaskGraphExecuter.java:86)
[ant:taskdef] 	at org.gradle.execution.SelectedTaskExecutionAction.execute(SelectedTaskExecutionAction.java:29)
[ant:taskdef] 	at org.gradle.execution.DefaultBuildExecuter.execute(DefaultBuildExecuter.java:61)
[ant:taskdef] 	at org.gradle.execution.DefaultBuildExecuter.access$200(DefaultBuildExecuter.java:23)
[ant:taskdef] 	at org.gradle.execution.DefaultBuildExecuter$2.proceed(DefaultBuildExecuter.java:67)
[ant:taskdef] 	at org.gradle.execution.DryRunBuildExecutionAction.execute(DryRunBuildExecutionAction.java:32)
[ant:taskdef] 	at org.gradle.execution.DefaultBuildExecuter.execute(DefaultBuildExecuter.java:61)
[ant:taskdef] 	at org.gradle.execution.DefaultBuildExecuter.execute(DefaultBuildExecuter.java:54)
[ant:taskdef] 	at org.gradle.initialization.DefaultGradleLauncher.doBuildStages(DefaultGradleLauncher.java:148)
[ant:taskdef] 	at org.gradle.initialization.DefaultGradleLauncher.doBuild(DefaultGradleLauncher.java:105)
[ant:taskdef] 	at org.gradle.initialization.DefaultGradleLauncher.run(DefaultGradleLauncher.java:85)
[ant:taskdef] 	at org.gradle.launcher.exec.InProcessBuildActionExecuter$DefaultBuildController.run(InProcessBuildActionExecuter.java:81)
[ant:taskdef] 	at org.gradle.launcher.cli.ExecuteBuildAction.run(ExecuteBuildAction.java:33)
[ant:taskdef] 	at org.gradle.launcher.cli.ExecuteBuildAction.run(ExecuteBuildAction.java:24)
[ant:taskdef] 	at org.gradle.launcher.exec.InProcessBuildActionExecuter.execute(InProcessBuildActionExecuter.java:39)
[ant:taskdef] 	at org.gradle.launcher.exec.InProcessBuildActionExecuter.execute(InProcessBuildActionExecuter.java:29)
[ant:taskdef] 	at org.gradle.launcher.cli.RunBuildAction.run(RunBuildAction.java:50)
[ant:taskdef] 	at org.gradle.internal.Actions$RunnableActionAdapter.execute(Actions.java:171)
[ant:taskdef] 	at org.gradle.launcher.cli.CommandLineActionFactory$ParseAndBuildAction.execute(CommandLineActionFactory.java:237)
[ant:taskdef] 	at org.gradle.launcher.cli.CommandLineActionFactory$ParseAndBuildAction.execute(CommandLineActionFactory.java:210)
[ant:taskdef] 	at org.gradle.launcher.cli.JavaRuntimeValidationAction.execute(JavaRuntimeValidationAction.java:35)
[ant:taskdef] 	at org.gradle.launcher.cli.JavaRuntimeValidationAction.execute(JavaRuntimeValidationAction.java:24)
[ant:taskdef] 	at org.gradle.launcher.cli.CommandLineActionFactory$WithLogging.execute(CommandLineActionFactory.java:206)
[ant:taskdef] 	at org.gradle.launcher.cli.CommandLineActionFactory$WithLogging.execute(CommandLineActionFactory.java:169)
[ant:taskdef] 	at org.gradle.launcher.cli.ExceptionReportingAction.execute(ExceptionReportingAction.java:33)
[ant:taskdef] 	at org.gradle.launcher.cli.ExceptionReportingAction.execute(ExceptionReportingAction.java:22)
[ant:taskdef] 	at org.gradle.launcher.Main.doAction(Main.java:33)
[ant:taskdef] 	at org.gradle.launcher.bootstrap.EntryPoint.run(EntryPoint.java:45)
[ant:taskdef] 	at sun.reflect.NativeMethodAccessorImpl.invoke0(Native Method)
[ant:taskdef] 	at sun.reflect.NativeMethodAccessorImpl.invoke(NativeMethodAccessorImpl.java:62)
[ant:taskdef] 	at sun.reflect.DelegatingMethodAccessorImpl.invoke(DelegatingMethodAccessorImpl.java:43)
[ant:taskdef] 	at java.lang.reflect.Method.invoke(Method.java:497)
[ant:taskdef] 	at org.gradle.launcher.bootstrap.ProcessBootstrap.runNoExit(ProcessBootstrap.java:54)
[ant:taskdef] 	at org.gradle.launcher.bootstrap.ProcessBootstrap.run(ProcessBootstrap.java:35)
[ant:taskdef] 	at org.gradle.launcher.GradleMain.main(GradleMain.java:23)
[ant:taskdef] 	at sun.reflect.NativeMethodAccessorImpl.invoke0(Native Method)
[ant:taskdef] 	at sun.reflect.NativeMethodAccessorImpl.invoke(NativeMethodAccessorImpl.java:62)
[ant:taskdef] 	at sun.reflect.DelegatingMethodAccessorImpl.invoke(DelegatingMethodAccessorImpl.java:43)
[ant:taskdef] 	at java.lang.reflect.Method.invoke(Method.java:497)
[ant:taskdef] 	at org.gradle.wrapper.BootstrapMainStarter.start(BootstrapMainStarter.java:30)
[ant:taskdef] 	at org.gradle.wrapper.WrapperExecutor.execute(WrapperExecutor.java:127)
[ant:taskdef] 	at org.gradle.wrapper.GradleWrapperMain.main(GradleWrapperMain.java:56)
Unable to obtain resource from /opt/public/hipp/homes/genie.virgo/.gradle/caches/modules-2/files-2.1/org.slf4j/com.springsource.slf4j.nop/1.6.1/5e9ef2d166b9ebbbaa1a48c93557a90ccfee8140/license-1.6.1.txt: java.util.zip.ZipException: error in opening zip file
[ant:taskdef] Unable to obtain resource from /opt/public/hipp/homes/genie.virgo/.gradle/caches/modules-2/files-2.1/org.slf4j/com.springsource.slf4j.nop/1.6.1/5e9ef2d166b9ebbbaa1a48c93557a90ccfee8140/license-1.6.1.txt: 
[ant:taskdef] java.util.zip.ZipException: error in opening zip file
[ant:taskdef] 	at java.util.zip.ZipFile.open(Native Method)
[ant:taskdef] 	at java.util.zip.ZipFile.<init>(ZipFile.java:220)
[ant:taskdef] 	at java.util.zip.ZipFile.<init>(ZipFile.java:150)
[ant:taskdef] 	at java.util.jar.JarFile.<init>(JarFile.java:166)
[ant:taskdef] 	at java.util.jar.JarFile.<init>(JarFile.java:130)
[ant:taskdef] 	at org.apache.tools.ant.AntClassLoader.getResourceURL(AntClassLoader.java:1006)
[ant:taskdef] 	at org.apache.tools.ant.AntClassLoader$ResourceEnumeration.findNextResource(AntClassLoader.java:149)
[ant:taskdef] 	at org.apache.tools.ant.AntClassLoader$ResourceEnumeration.nextElement(AntClassLoader.java:134)
[ant:taskdef] 	at org.apache.tools.ant.AntClassLoader$ResourceEnumeration.nextElement(AntClassLoader.java:83)
[ant:taskdef] 	at org.apache.tools.ant.util.CollectionUtils$CompoundEnumeration.nextElement(CollectionUtils.java:239)
[ant:taskdef] 	at org.apache.tools.ant.taskdefs.Definer.execute(Definer.java:256)
[ant:taskdef] 	at org.apache.tools.ant.UnknownElement.execute(UnknownElement.java:292)
[ant:taskdef] 	at sun.reflect.GeneratedMethodAccessor265.invoke(Unknown Source)
[ant:taskdef] 	at sun.reflect.DelegatingMethodAccessorImpl.invoke(DelegatingMethodAccessorImpl.java:43)
[ant:taskdef] 	at java.lang.reflect.Method.invoke(Method.java:497)
[ant:taskdef] 	at org.apache.tools.ant.dispatch.DispatchUtils.execute(DispatchUtils.java:106)
[ant:taskdef] 	at groovy.util.AntBuilder.performTask(AntBuilder.java:319)
[ant:taskdef] 	at groovy.util.AntBuilder.nodeCompleted(AntBuilder.java:264)
[ant:taskdef] 	at org.gradle.api.internal.project.ant.BasicAntBuilder.nodeCompleted(BasicAntBuilder.java:71)
[ant:taskdef] 	at groovy.util.BuilderSupport.doInvokeMethod(BuilderSupport.java:147)
[ant:taskdef] 	at groovy.util.AntBuilder.doInvokeMethod(AntBuilder.java:203)
[ant:taskdef] 	at org.gradle.api.internal.project.ant.BasicAntBuilder.doInvokeMethod(BasicAntBuilder.java:86)
[ant:taskdef] 	at groovy.util.BuilderSupport.invokeMethod(BuilderSupport.java:64)
[ant:taskdef] 	at org.codehaus.groovy.runtime.callsite.PogoMetaClassSite.call(PogoMetaClassSite.java:45)
[ant:taskdef] 	at org.codehaus.groovy.runtime.callsite.AbstractCallSite.call(AbstractCallSite.java:116)
[ant:taskdef] 	at org.eclipse.virgo.bundlor.BundlorPlugin$_apply_closure6_closure9.doCall(BundlorPlugin.groovy:95)
[ant:taskdef] 	at sun.reflect.GeneratedMethodAccessor288.invoke(Unknown Source)
[ant:taskdef] 	at sun.reflect.DelegatingMethodAccessorImpl.invoke(DelegatingMethodAccessorImpl.java:43)
[ant:taskdef] 	at java.lang.reflect.Method.invoke(Method.java:497)
[ant:taskdef] 	at org.codehaus.groovy.reflection.CachedMethod.invoke(CachedMethod.java:90)
[ant:taskdef] 	at groovy.lang.MetaMethod.doMethodInvoke(MetaMethod.java:233)
[ant:taskdef] 	at org.codehaus.groovy.runtime.metaclass.ClosureMetaClass.invokeMethod(ClosureMetaClass.java:272)
[ant:taskdef] 	at groovy.lang.MetaClassImpl.invokeMethod(MetaClassImpl.java:909)
[ant:taskdef] 	at groovy.lang.Closure.call(Closure.java:423)
[ant:taskdef] 	at groovy.lang.Closure.call(Closure.java:439)
[ant:taskdef] 	at org.gradle.api.internal.AbstractTask$ClosureTaskAction.execute(AbstractTask.java:539)
[ant:taskdef] 	at org.gradle.api.internal.AbstractTask$ClosureTaskAction.execute(AbstractTask.java:520)
[ant:taskdef] 	at org.gradle.api.internal.tasks.execution.ExecuteActionsTaskExecuter.executeAction(ExecuteActionsTaskExecuter.java:80)
[ant:taskdef] 	at org.gradle.api.internal.tasks.execution.ExecuteActionsTaskExecuter.executeActions(ExecuteActionsTaskExecuter.java:61)
[ant:taskdef] 	at org.gradle.api.internal.tasks.execution.ExecuteActionsTaskExecuter.execute(ExecuteActionsTaskExecuter.java:46)
[ant:taskdef] 	at org.gradle.api.internal.tasks.execution.PostExecutionAnalysisTaskExecuter.execute(PostExecutionAnalysisTaskExecuter.java:35)
[ant:taskdef] 	at org.gradle.api.internal.tasks.execution.SkipUpToDateTaskExecuter.execute(SkipUpToDateTaskExecuter.java:64)
[ant:taskdef] 	at org.gradle.api.internal.tasks.execution.ValidatingTaskExecuter.execute(ValidatingTaskExecuter.java:58)
[ant:taskdef] 	at org.gradle.api.internal.tasks.execution.SkipEmptySourceFilesTaskExecuter.execute(SkipEmptySourceFilesTaskExecuter.java:42)
[ant:taskdef] 	at org.gradle.api.internal.tasks.execution.SkipTaskWithNoActionsExecuter.execute(SkipTaskWithNoActionsExecuter.java:52)
[ant:taskdef] 	at org.gradle.api.internal.tasks.execution.SkipOnlyIfTaskExecuter.execute(SkipOnlyIfTaskExecuter.java:53)
[ant:taskdef] 	at org.gradle.api.internal.tasks.execution.ExecuteAtMostOnceTaskExecuter.execute(ExecuteAtMostOnceTaskExecuter.java:43)
[ant:taskdef] 	at org.gradle.api.internal.AbstractTask.executeWithoutThrowingTaskFailure(AbstractTask.java:296)
[ant:taskdef] 	at org.gradle.execution.taskgraph.AbstractTaskPlanExecutor$TaskExecutorWorker.executeTask(AbstractTaskPlanExecutor.java:79)
[ant:taskdef] 	at org.gradle.execution.taskgraph.AbstractTaskPlanExecutor$TaskExecutorWorker.processTask(AbstractTaskPlanExecutor.java:63)
[ant:taskdef] 	at org.gradle.execution.taskgraph.AbstractTaskPlanExecutor$TaskExecutorWorker.run(AbstractTaskPlanExecutor.java:51)
[ant:taskdef] 	at org.gradle.execution.taskgraph.DefaultTaskPlanExecutor.process(DefaultTaskPlanExecutor.java:23)
[ant:taskdef] 	at org.gradle.execution.taskgraph.DefaultTaskGraphExecuter.execute(DefaultTaskGraphExecuter.java:86)
[ant:taskdef] 	at org.gradle.execution.SelectedTaskExecutionAction.execute(SelectedTaskExecutionAction.java:29)
[ant:taskdef] 	at org.gradle.execution.DefaultBuildExecuter.execute(DefaultBuildExecuter.java:61)
[ant:taskdef] 	at org.gradle.execution.DefaultBuildExecuter.access$200(DefaultBuildExecuter.java:23)
[ant:taskdef] 	at org.gradle.execution.DefaultBuildExecuter$2.proceed(DefaultBuildExecuter.java:67)
[ant:taskdef] 	at org.gradle.execution.DryRunBuildExecutionAction.execute(DryRunBuildExecutionAction.java:32)
[ant:taskdef] 	at org.gradle.execution.DefaultBuildExecuter.execute(DefaultBuildExecuter.java:61)
[ant:taskdef] 	at org.gradle.execution.DefaultBuildExecuter.execute(DefaultBuildExecuter.java:54)
[ant:taskdef] 	at org.gradle.initialization.DefaultGradleLauncher.doBuildStages(DefaultGradleLauncher.java:148)
[ant:taskdef] 	at org.gradle.initialization.DefaultGradleLauncher.doBuild(DefaultGradleLauncher.java:105)
[ant:taskdef] 	at org.gradle.initialization.DefaultGradleLauncher.run(DefaultGradleLauncher.java:85)
[ant:taskdef] 	at org.gradle.launcher.exec.InProcessBuildActionExecuter$DefaultBuildController.run(InProcessBuildActionExecuter.java:81)
[ant:taskdef] 	at org.gradle.launcher.cli.ExecuteBuildAction.run(ExecuteBuildAction.java:33)
[ant:taskdef] 	at org.gradle.launcher.cli.ExecuteBuildAction.run(ExecuteBuildAction.java:24)
[ant:taskdef] 	at org.gradle.launcher.exec.InProcessBuildActionExecuter.execute(InProcessBuildActionExecuter.java:39)
[ant:taskdef] 	at org.gradle.launcher.exec.InProcessBuildActionExecuter.execute(InProcessBuildActionExecuter.java:29)
[ant:taskdef] 	at org.gradle.launcher.cli.RunBuildAction.run(RunBuildAction.java:50)
[ant:taskdef] 	at org.gradle.internal.Actions$RunnableActionAdapter.execute(Actions.java:171)
[ant:taskdef] 	at org.gradle.launcher.cli.CommandLineActionFactory$ParseAndBuildAction.execute(CommandLineActionFactory.java:237)
[ant:taskdef] 	at org.gradle.launcher.cli.CommandLineActionFactory$ParseAndBuildAction.execute(CommandLineActionFactory.java:210)
[ant:taskdef] 	at org.gradle.launcher.cli.JavaRuntimeValidationAction.execute(JavaRuntimeValidationAction.java:35)
[ant:taskdef] 	at org.gradle.launcher.cli.JavaRuntimeValidationAction.execute(JavaRuntimeValidationAction.java:24)
[ant:taskdef] 	at org.gradle.launcher.cli.CommandLineActionFactory$WithLogging.execute(CommandLineActionFactory.java:206)
[ant:taskdef] 	at org.gradle.launcher.cli.CommandLineActionFactory$WithLogging.execute(CommandLineActionFactory.java:169)
[ant:taskdef] 	at org.gradle.launcher.cli.ExceptionReportingAction.execute(ExceptionReportingAction.java:33)
[ant:taskdef] 	at org.gradle.launcher.cli.ExceptionReportingAction.execute(ExceptionReportingAction.java:22)
[ant:taskdef] 	at org.gradle.launcher.Main.doAction(Main.java:33)
[ant:taskdef] 	at org.gradle.launcher.bootstrap.EntryPoint.run(EntryPoint.java:45)
[ant:taskdef] 	at sun.reflect.NativeMethodAccessorImpl.invoke0(Native Method)
[ant:taskdef] 	at sun.reflect.NativeMethodAccessorImpl.invoke(NativeMethodAccessorImpl.java:62)
[ant:taskdef] 	at sun.reflect.DelegatingMethodAccessorImpl.invoke(DelegatingMethodAccessorImpl.java:43)
[ant:taskdef] 	at java.lang.reflect.Method.invoke(Method.java:497)
[ant:taskdef] 	at org.gradle.launcher.bootstrap.ProcessBootstrap.runNoExit(ProcessBootstrap.java:54)
[ant:taskdef] 	at org.gradle.launcher.bootstrap.ProcessBootstrap.run(ProcessBootstrap.java:35)
[ant:taskdef] 	at org.gradle.launcher.GradleMain.main(GradleMain.java:23)
[ant:taskdef] 	at sun.reflect.NativeMethodAccessorImpl.invoke0(Native Method)
[ant:taskdef] 	at sun.reflect.NativeMethodAccessorImpl.invoke(NativeMethodAccessorImpl.java:62)
[ant:taskdef] 	at sun.reflect.DelegatingMethodAccessorImpl.invoke(DelegatingMethodAccessorImpl.java:43)
[ant:taskdef] 	at java.lang.reflect.Method.invoke(Method.java:497)
[ant:taskdef] 	at org.gradle.wrapper.BootstrapMainStarter.start(BootstrapMainStarter.java:30)
[ant:taskdef] 	at org.gradle.wrapper.WrapperExecutor.execute(WrapperExecutor.java:127)
[ant:taskdef] 	at org.gradle.wrapper.GradleWrapperMain.main(GradleWrapperMain.java:56)
Unable to obtain resource from /opt/public/hipp/homes/genie.virgo/.gradle/caches/modules-2/files-2.1/org.apache.ant/com.springsource.org.apache.tools.ant.launch/1.7.0/2b8b815229aa8a61e483fb4ba0588b8b6c491890/license-1.7.0.txt: java.util.zip.ZipException: error in opening zip file
[ant:taskdef] Unable to obtain resource from /opt/public/hipp/homes/genie.virgo/.gradle/caches/modules-2/files-2.1/org.apache.ant/com.springsource.org.apache.tools.ant.launch/1.7.0/2b8b815229aa8a61e483fb4ba0588b8b6c491890/license-1.7.0.txt: 
[ant:taskdef] java.util.zip.ZipException: error in opening zip file
[ant:taskdef] 	at java.util.zip.ZipFile.open(Native Method)
[ant:taskdef] 	at java.util.zip.ZipFile.<init>(ZipFile.java:220)
[ant:taskdef] 	at java.util.zip.ZipFile.<init>(ZipFile.java:150)
[ant:taskdef] 	at java.util.jar.JarFile.<init>(JarFile.java:166)
[ant:taskdef] 	at java.util.jar.JarFile.<init>(JarFile.java:130)
[ant:taskdef] 	at org.apache.tools.ant.AntClassLoader.getResourceURL(AntClassLoader.java:1006)
[ant:taskdef] 	at org.apache.tools.ant.AntClassLoader$ResourceEnumeration.findNextResource(AntClassLoader.java:149)
[ant:taskdef] 	at org.apache.tools.ant.AntClassLoader$ResourceEnumeration.nextElement(AntClassLoader.java:134)
[ant:taskdef] 	at org.apache.tools.ant.AntClassLoader$ResourceEnumeration.nextElement(AntClassLoader.java:83)
[ant:taskdef] 	at org.apache.tools.ant.util.CollectionUtils$CompoundEnumeration.nextElement(CollectionUtils.java:239)
[ant:taskdef] 	at org.apache.tools.ant.taskdefs.Definer.execute(Definer.java:256)
[ant:taskdef] 	at org.apache.tools.ant.UnknownElement.execute(UnknownElement.java:292)
[ant:taskdef] 	at sun.reflect.GeneratedMethodAccessor265.invoke(Unknown Source)
[ant:taskdef] 	at sun.reflect.DelegatingMethodAccessorImpl.invoke(DelegatingMethodAccessorImpl.java:43)
[ant:taskdef] 	at java.lang.reflect.Method.invoke(Method.java:497)
[ant:taskdef] 	at org.apache.tools.ant.dispatch.DispatchUtils.execute(DispatchUtils.java:106)
[ant:taskdef] 	at groovy.util.AntBuilder.performTask(AntBuilder.java:319)
[ant:taskdef] 	at groovy.util.AntBuilder.nodeCompleted(AntBuilder.java:264)
[ant:taskdef] 	at org.gradle.api.internal.project.ant.BasicAntBuilder.nodeCompleted(BasicAntBuilder.java:71)
[ant:taskdef] 	at groovy.util.BuilderSupport.doInvokeMethod(BuilderSupport.java:147)
[ant:taskdef] 	at groovy.util.AntBuilder.doInvokeMethod(AntBuilder.java:203)
[ant:taskdef] 	at org.gradle.api.internal.project.ant.BasicAntBuilder.doInvokeMethod(BasicAntBuilder.java:86)
[ant:taskdef] 	at groovy.util.BuilderSupport.invokeMethod(BuilderSupport.java:64)
[ant:taskdef] 	at org.codehaus.groovy.runtime.callsite.PogoMetaClassSite.call(PogoMetaClassSite.java:45)
[ant:taskdef] 	at org.codehaus.groovy.runtime.callsite.AbstractCallSite.call(AbstractCallSite.java:116)
[ant:taskdef] 	at org.eclipse.virgo.bundlor.BundlorPlugin$_apply_closure6_closure9.doCall(BundlorPlugin.groovy:95)
[ant:taskdef] 	at sun.reflect.GeneratedMethodAccessor288.invoke(Unknown Source)
[ant:taskdef] 	at sun.reflect.DelegatingMethodAccessorImpl.invoke(DelegatingMethodAccessorImpl.java:43)
[ant:taskdef] 	at java.lang.reflect.Method.invoke(Method.java:497)
[ant:taskdef] 	at org.codehaus.groovy.reflection.CachedMethod.invoke(CachedMethod.java:90)
[ant:taskdef] 	at groovy.lang.MetaMethod.doMethodInvoke(MetaMethod.java:233)
[ant:taskdef] 	at org.codehaus.groovy.runtime.metaclass.ClosureMetaClass.invokeMethod(ClosureMetaClass.java:272)
[ant:taskdef] 	at groovy.lang.MetaClassImpl.invokeMethod(MetaClassImpl.java:909)
[ant:taskdef] 	at groovy.lang.Closure.call(Closure.java:423)
[ant:taskdef] 	at groovy.lang.Closure.call(Closure.java:439)
[ant:taskdef] 	at org.gradle.api.internal.AbstractTask$ClosureTaskAction.execute(AbstractTask.java:539)
[ant:taskdef] 	at org.gradle.api.internal.AbstractTask$ClosureTaskAction.execute(AbstractTask.java:520)
[ant:taskdef] 	at org.gradle.api.internal.tasks.execution.ExecuteActionsTaskExecuter.executeAction(ExecuteActionsTaskExecuter.java:80)
[ant:taskdef] 	at org.gradle.api.internal.tasks.execution.ExecuteActionsTaskExecuter.executeActions(ExecuteActionsTaskExecuter.java:61)
[ant:taskdef] 	at org.gradle.api.internal.tasks.execution.ExecuteActionsTaskExecuter.execute(ExecuteActionsTaskExecuter.java:46)
[ant:taskdef] 	at org.gradle.api.internal.tasks.execution.PostExecutionAnalysisTaskExecuter.execute(PostExecutionAnalysisTaskExecuter.java:35)
[ant:taskdef] 	at org.gradle.api.internal.tasks.execution.SkipUpToDateTaskExecuter.execute(SkipUpToDateTaskExecuter.java:64)
[ant:taskdef] 	at org.gradle.api.internal.tasks.execution.ValidatingTaskExecuter.execute(ValidatingTaskExecuter.java:58)
[ant:taskdef] 	at org.gradle.api.internal.tasks.execution.SkipEmptySourceFilesTaskExecuter.execute(SkipEmptySourceFilesTaskExecuter.java:42)
[ant:taskdef] 	at org.gradle.api.internal.tasks.execution.SkipTaskWithNoActionsExecuter.execute(SkipTaskWithNoActionsExecuter.java:52)
[ant:taskdef] 	at org.gradle.api.internal.tasks.execution.SkipOnlyIfTaskExecuter.execute(SkipOnlyIfTaskExecuter.java:53)
[ant:taskdef] 	at org.gradle.api.internal.tasks.execution.ExecuteAtMostOnceTaskExecuter.execute(ExecuteAtMostOnceTaskExecuter.java:43)
[ant:taskdef] 	at org.gradle.api.internal.AbstractTask.executeWithoutThrowingTaskFailure(AbstractTask.java:296)
[ant:taskdef] 	at org.gradle.execution.taskgraph.AbstractTaskPlanExecutor$TaskExecutorWorker.executeTask(AbstractTaskPlanExecutor.java:79)
[ant:taskdef] 	at org.gradle.execution.taskgraph.AbstractTaskPlanExecutor$TaskExecutorWorker.processTask(AbstractTaskPlanExecutor.java:63)
[ant:taskdef] 	at org.gradle.execution.taskgraph.AbstractTaskPlanExecutor$TaskExecutorWorker.run(AbstractTaskPlanExecutor.java:51)
[ant:taskdef] 	at org.gradle.execution.taskgraph.DefaultTaskPlanExecutor.process(DefaultTaskPlanExecutor.java:23)
[ant:taskdef] 	at org.gradle.execution.taskgraph.DefaultTaskGraphExecuter.execute(DefaultTaskGraphExecuter.java:86)
[ant:taskdef] 	at org.gradle.execution.SelectedTaskExecutionAction.execute(SelectedTaskExecutionAction.java:29)
[ant:taskdef] 	at org.gradle.execution.DefaultBuildExecuter.execute(DefaultBuildExecuter.java:61)
[ant:taskdef] 	at org.gradle.execution.DefaultBuildExecuter.access$200(DefaultBuildExecuter.java:23)
[ant:taskdef] 	at org.gradle.execution.DefaultBuildExecuter$2.proceed(DefaultBuildExecuter.java:67)
[ant:taskdef] 	at org.gradle.execution.DryRunBuildExecutionAction.execute(DryRunBuildExecutionAction.java:32)
[ant:taskdef] 	at org.gradle.execution.DefaultBuildExecuter.execute(DefaultBuildExecuter.java:61)
[ant:taskdef] 	at org.gradle.execution.DefaultBuildExecuter.execute(DefaultBuildExecuter.java:54)
[ant:taskdef] 	at org.gradle.initialization.DefaultGradleLauncher.doBuildStages(DefaultGradleLauncher.java:148)
[ant:taskdef] 	at org.gradle.initialization.DefaultGradleLauncher.doBuild(DefaultGradleLauncher.java:105)
[ant:taskdef] 	at org.gradle.initialization.DefaultGradleLauncher.run(DefaultGradleLauncher.java:85)
[ant:taskdef] 	at org.gradle.launcher.exec.InProcessBuildActionExecuter$DefaultBuildController.run(InProcessBuildActionExecuter.java:81)
[ant:taskdef] 	at org.gradle.launcher.cli.ExecuteBuildAction.run(ExecuteBuildAction.java:33)
[ant:taskdef] 	at org.gradle.launcher.cli.ExecuteBuildAction.run(ExecuteBuildAction.java:24)
[ant:taskdef] 	at org.gradle.launcher.exec.InProcessBuildActionExecuter.execute(InProcessBuildActionExecuter.java:39)
[ant:taskdef] 	at org.gradle.launcher.exec.InProcessBuildActionExecuter.execute(InProcessBuildActionExecuter.java:29)
[ant:taskdef] 	at org.gradle.launcher.cli.RunBuildAction.run(RunBuildAction.java:50)
[ant:taskdef] 	at org.gradle.internal.Actions$RunnableActionAdapter.execute(Actions.java:171)
[ant:taskdef] 	at org.gradle.launcher.cli.CommandLineActionFactory$ParseAndBuildAction.execute(CommandLineActionFactory.java:237)
[ant:taskdef] 	at org.gradle.launcher.cli.CommandLineActionFactory$ParseAndBuildAction.execute(CommandLineActionFactory.java:210)
[ant:taskdef] 	at org.gradle.launcher.cli.JavaRuntimeValidationAction.execute(JavaRuntimeValidationAction.java:35)
[ant:taskdef] 	at org.gradle.launcher.cli.JavaRuntimeValidationAction.execute(JavaRuntimeValidationAction.java:24)
[ant:taskdef] 	at org.gradle.launcher.cli.CommandLineActionFactory$WithLogging.execute(CommandLineActionFactory.java:206)
[ant:taskdef] 	at org.gradle.launcher.cli.CommandLineActionFactory$WithLogging.execute(CommandLineActionFactory.java:169)
[ant:taskdef] 	at org.gradle.launcher.cli.ExceptionReportingAction.execute(ExceptionReportingAction.java:33)
[ant:taskdef] 	at org.gradle.launcher.cli.ExceptionReportingAction.execute(ExceptionReportingAction.java:22)
[ant:taskdef] 	at org.gradle.launcher.Main.doAction(Main.java:33)
[ant:taskdef] 	at org.gradle.launcher.bootstrap.EntryPoint.run(EntryPoint.java:45)
[ant:taskdef] 	at sun.reflect.NativeMethodAccessorImpl.invoke0(Native Method)
[ant:taskdef] 	at sun.reflect.NativeMethodAccessorImpl.invoke(NativeMethodAccessorImpl.java:62)
[ant:taskdef] 	at sun.reflect.DelegatingMethodAccessorImpl.invoke(DelegatingMethodAccessorImpl.java:43)
[ant:taskdef] 	at java.lang.reflect.Method.invoke(Method.java:497)
[ant:taskdef] 	at org.gradle.launcher.bootstrap.ProcessBootstrap.runNoExit(ProcessBootstrap.java:54)
[ant:taskdef] 	at org.gradle.launcher.bootstrap.ProcessBootstrap.run(ProcessBootstrap.java:35)
[ant:taskdef] 	at org.gradle.launcher.GradleMain.main(GradleMain.java:23)
[ant:taskdef] 	at sun.reflect.NativeMethodAccessorImpl.invoke0(Native Method)
[ant:taskdef] 	at sun.reflect.NativeMethodAccessorImpl.invoke(NativeMethodAccessorImpl.java:62)
[ant:taskdef] 	at sun.reflect.DelegatingMethodAccessorImpl.invoke(DelegatingMethodAccessorImpl.java:43)
[ant:taskdef] 	at java.lang.reflect.Method.invoke(Method.java:497)
[ant:taskdef] 	at org.gradle.wrapper.BootstrapMainStarter.start(BootstrapMainStarter.java:30)
[ant:taskdef] 	at org.gradle.wrapper.WrapperExecutor.execute(WrapperExecutor.java:127)
[ant:taskdef] 	at org.gradle.wrapper.GradleWrapperMain.main(GradleWrapperMain.java:56)
Unable to obtain resource from /opt/public/hipp/homes/genie.virgo/.gradle/caches/modules-2/files-2.1/org.apache.ant/com.springsource.org.apache.tools.ant.launch/1.7.0/cb832720fcc4a4c22df3d40db4134d9e8bea5955/notice-1.7.0.txt: java.util.zip.ZipException: error in opening zip file
[ant:taskdef] Unable to obtain resource from /opt/public/hipp/homes/genie.virgo/.gradle/caches/modules-2/files-2.1/org.apache.ant/com.springsource.org.apache.tools.ant.launch/1.7.0/cb832720fcc4a4c22df3d40db4134d9e8bea5955/notice-1.7.0.txt: 
[ant:taskdef] java.util.zip.ZipException: error in opening zip file
[ant:taskdef] 	at java.util.zip.ZipFile.open(Native Method)
[ant:taskdef] 	at java.util.zip.ZipFile.<init>(ZipFile.java:220)
[ant:taskdef] 	at java.util.zip.ZipFile.<init>(ZipFile.java:150)
[ant:taskdef] 	at java.util.jar.JarFile.<init>(JarFile.java:166)
[ant:taskdef] 	at java.util.jar.JarFile.<init>(JarFile.java:130)
[ant:taskdef] 	at org.apache.tools.ant.AntClassLoader.getResourceURL(AntClassLoader.java:1006)
[ant:taskdef] 	at org.apache.tools.ant.AntClassLoader$ResourceEnumeration.findNextResource(AntClassLoader.java:149)
[ant:taskdef] 	at org.apache.tools.ant.AntClassLoader$ResourceEnumeration.nextElement(AntClassLoader.java:134)
[ant:taskdef] 	at org.apache.tools.ant.AntClassLoader$ResourceEnumeration.nextElement(AntClassLoader.java:83)
[ant:taskdef] 	at org.apache.tools.ant.util.CollectionUtils$CompoundEnumeration.nextElement(CollectionUtils.java:239)
[ant:taskdef] 	at org.apache.tools.ant.taskdefs.Definer.execute(Definer.java:256)
[ant:taskdef] 	at org.apache.tools.ant.UnknownElement.execute(UnknownElement.java:292)
[ant:taskdef] 	at sun.reflect.GeneratedMethodAccessor265.invoke(Unknown Source)
[ant:taskdef] 	at sun.reflect.DelegatingMethodAccessorImpl.invoke(DelegatingMethodAccessorImpl.java:43)
[ant:taskdef] 	at java.lang.reflect.Method.invoke(Method.java:497)
[ant:taskdef] 	at org.apache.tools.ant.dispatch.DispatchUtils.execute(DispatchUtils.java:106)
[ant:taskdef] 	at groovy.util.AntBuilder.performTask(AntBuilder.java:319)
[ant:taskdef] 	at groovy.util.AntBuilder.nodeCompleted(AntBuilder.java:264)
[ant:taskdef] 	at org.gradle.api.internal.project.ant.BasicAntBuilder.nodeCompleted(BasicAntBuilder.java:71)
[ant:taskdef] 	at groovy.util.BuilderSupport.doInvokeMethod(BuilderSupport.java:147)
[ant:taskdef] 	at groovy.util.AntBuilder.doInvokeMethod(AntBuilder.java:203)
[ant:taskdef] 	at org.gradle.api.internal.project.ant.BasicAntBuilder.doInvokeMethod(BasicAntBuilder.java:86)
[ant:taskdef] 	at groovy.util.BuilderSupport.invokeMethod(BuilderSupport.java:64)
[ant:taskdef] 	at org.codehaus.groovy.runtime.callsite.PogoMetaClassSite.call(PogoMetaClassSite.java:45)
[ant:taskdef] 	at org.codehaus.groovy.runtime.callsite.AbstractCallSite.call(AbstractCallSite.java:116)
[ant:taskdef] 	at org.eclipse.virgo.bundlor.BundlorPlugin$_apply_closure6_closure9.doCall(BundlorPlugin.groovy:95)
[ant:taskdef] 	at sun.reflect.GeneratedMethodAccessor288.invoke(Unknown Source)
[ant:taskdef] 	at sun.reflect.DelegatingMethodAccessorImpl.invoke(DelegatingMethodAccessorImpl.java:43)
[ant:taskdef] 	at java.lang.reflect.Method.invoke(Method.java:497)
[ant:taskdef] 	at org.codehaus.groovy.reflection.CachedMethod.invoke(CachedMethod.java:90)
[ant:taskdef] 	at groovy.lang.MetaMethod.doMethodInvoke(MetaMethod.java:233)
[ant:taskdef] 	at org.codehaus.groovy.runtime.metaclass.ClosureMetaClass.invokeMethod(ClosureMetaClass.java:272)
[ant:taskdef] 	at groovy.lang.MetaClassImpl.invokeMethod(MetaClassImpl.java:909)
[ant:taskdef] 	at groovy.lang.Closure.call(Closure.java:423)
[ant:taskdef] 	at groovy.lang.Closure.call(Closure.java:439)
[ant:taskdef] 	at org.gradle.api.internal.AbstractTask$ClosureTaskAction.execute(AbstractTask.java:539)
[ant:taskdef] 	at org.gradle.api.internal.AbstractTask$ClosureTaskAction.execute(AbstractTask.java:520)
[ant:taskdef] 	at org.gradle.api.internal.tasks.execution.ExecuteActionsTaskExecuter.executeAction(ExecuteActionsTaskExecuter.java:80)
[ant:taskdef] 	at org.gradle.api.internal.tasks.execution.ExecuteActionsTaskExecuter.executeActions(ExecuteActionsTaskExecuter.java:61)
[ant:taskdef] 	at org.gradle.api.internal.tasks.execution.ExecuteActionsTaskExecuter.execute(ExecuteActionsTaskExecuter.java:46)
[ant:taskdef] 	at org.gradle.api.internal.tasks.execution.PostExecutionAnalysisTaskExecuter.execute(PostExecutionAnalysisTaskExecuter.java:35)
[ant:taskdef] 	at org.gradle.api.internal.tasks.execution.SkipUpToDateTaskExecuter.execute(SkipUpToDateTaskExecuter.java:64)
[ant:taskdef] 	at org.gradle.api.internal.tasks.execution.ValidatingTaskExecuter.execute(ValidatingTaskExecuter.java:58)
[ant:taskdef] 	at org.gradle.api.internal.tasks.execution.SkipEmptySourceFilesTaskExecuter.execute(SkipEmptySourceFilesTaskExecuter.java:42)
[ant:taskdef] 	at org.gradle.api.internal.tasks.execution.SkipTaskWithNoActionsExecuter.execute(SkipTaskWithNoActionsExecuter.java:52)
[ant:taskdef] 	at org.gradle.api.internal.tasks.execution.SkipOnlyIfTaskExecuter.execute(SkipOnlyIfTaskExecuter.java:53)
[ant:taskdef] 	at org.gradle.api.internal.tasks.execution.ExecuteAtMostOnceTaskExecuter.execute(ExecuteAtMostOnceTaskExecuter.java:43)
[ant:taskdef] 	at org.gradle.api.internal.AbstractTask.executeWithoutThrowingTaskFailure(AbstractTask.java:296)
[ant:taskdef] 	at org.gradle.execution.taskgraph.AbstractTaskPlanExecutor$TaskExecutorWorker.executeTask(AbstractTaskPlanExecutor.java:79)
[ant:taskdef] 	at org.gradle.execution.taskgraph.AbstractTaskPlanExecutor$TaskExecutorWorker.processTask(AbstractTaskPlanExecutor.java:63)
[ant:taskdef] 	at org.gradle.execution.taskgraph.AbstractTaskPlanExecutor$TaskExecutorWorker.run(AbstractTaskPlanExecutor.java:51)
[ant:taskdef] 	at org.gradle.execution.taskgraph.DefaultTaskPlanExecutor.process(DefaultTaskPlanExecutor.java:23)
[ant:taskdef] 	at org.gradle.execution.taskgraph.DefaultTaskGraphExecuter.execute(DefaultTaskGraphExecuter.java:86)
[ant:taskdef] 	at org.gradle.execution.SelectedTaskExecutionAction.execute(SelectedTaskExecutionAction.java:29)
[ant:taskdef] 	at org.gradle.execution.DefaultBuildExecuter.execute(DefaultBuildExecuter.java:61)
[ant:taskdef] 	at org.gradle.execution.DefaultBuildExecuter.access$200(DefaultBuildExecuter.java:23)
[ant:taskdef] 	at org.gradle.execution.DefaultBuildExecuter$2.proceed(DefaultBuildExecuter.java:67)
[ant:taskdef] 	at org.gradle.execution.DryRunBuildExecutionAction.execute(DryRunBuildExecutionAction.java:32)
[ant:taskdef] 	at org.gradle.execution.DefaultBuildExecuter.execute(DefaultBuildExecuter.java:61)
[ant:taskdef] 	at org.gradle.execution.DefaultBuildExecuter.execute(DefaultBuildExecuter.java:54)
[ant:taskdef] 	at org.gradle.initialization.DefaultGradleLauncher.doBuildStages(DefaultGradleLauncher.java:148)
[ant:taskdef] 	at org.gradle.initialization.DefaultGradleLauncher.doBuild(DefaultGradleLauncher.java:105)
[ant:taskdef] 	at org.gradle.initialization.DefaultGradleLauncher.run(DefaultGradleLauncher.java:85)
[ant:taskdef] 	at org.gradle.launcher.exec.InProcessBuildActionExecuter$DefaultBuildController.run(InProcessBuildActionExecuter.java:81)
[ant:taskdef] 	at org.gradle.launcher.cli.ExecuteBuildAction.run(ExecuteBuildAction.java:33)
[ant:taskdef] 	at org.gradle.launcher.cli.ExecuteBuildAction.run(ExecuteBuildAction.java:24)
[ant:taskdef] 	at org.gradle.launcher.exec.InProcessBuildActionExecuter.execute(InProcessBuildActionExecuter.java:39)
[ant:taskdef] 	at org.gradle.launcher.exec.InProcessBuildActionExecuter.execute(InProcessBuildActionExecuter.java:29)
[ant:taskdef] 	at org.gradle.launcher.cli.RunBuildAction.run(RunBuildAction.java:50)
[ant:taskdef] 	at org.gradle.internal.Actions$RunnableActionAdapter.execute(Actions.java:171)
[ant:taskdef] 	at org.gradle.launcher.cli.CommandLineActionFactory$ParseAndBuildAction.execute(CommandLineActionFactory.java:237)
[ant:taskdef] 	at org.gradle.launcher.cli.CommandLineActionFactory$ParseAndBuildAction.execute(CommandLineActionFactory.java:210)
[ant:taskdef] 	at org.gradle.launcher.cli.JavaRuntimeValidationAction.execute(JavaRuntimeValidationAction.java:35)
[ant:taskdef] 	at org.gradle.launcher.cli.JavaRuntimeValidationAction.execute(JavaRuntimeValidationAction.java:24)
[ant:taskdef] 	at org.gradle.launcher.cli.CommandLineActionFactory$WithLogging.execute(CommandLineActionFactory.java:206)
[ant:taskdef] 	at org.gradle.launcher.cli.CommandLineActionFactory$WithLogging.execute(CommandLineActionFactory.java:169)
[ant:taskdef] 	at org.gradle.launcher.cli.ExceptionReportingAction.execute(ExceptionReportingAction.java:33)
[ant:taskdef] 	at org.gradle.launcher.cli.ExceptionReportingAction.execute(ExceptionReportingAction.java:22)
[ant:taskdef] 	at org.gradle.launcher.Main.doAction(Main.java:33)
[ant:taskdef] 	at org.gradle.launcher.bootstrap.EntryPoint.run(EntryPoint.java:45)
[ant:taskdef] 	at sun.reflect.NativeMethodAccessorImpl.invoke0(Native Method)
[ant:taskdef] 	at sun.reflect.NativeMethodAccessorImpl.invoke(NativeMethodAccessorImpl.java:62)
[ant:taskdef] 	at sun.reflect.DelegatingMethodAccessorImpl.invoke(DelegatingMethodAccessorImpl.java:43)
[ant:taskdef] 	at java.lang.reflect.Method.invoke(Method.java:497)
[ant:taskdef] 	at org.gradle.launcher.bootstrap.ProcessBootstrap.runNoExit(ProcessBootstrap.java:54)
[ant:taskdef] 	at org.gradle.launcher.bootstrap.ProcessBootstrap.run(ProcessBootstrap.java:35)
[ant:taskdef] 	at org.gradle.launcher.GradleMain.main(GradleMain.java:23)
[ant:taskdef] 	at sun.reflect.NativeMethodAccessorImpl.invoke0(Native Method)
[ant:taskdef] 	at sun.reflect.NativeMethodAccessorImpl.invoke(NativeMethodAccessorImpl.java:62)
[ant:taskdef] 	at sun.reflect.DelegatingMethodAccessorImpl.invoke(DelegatingMethodAccessorImpl.java:43)
[ant:taskdef] 	at java.lang.reflect.Method.invoke(Method.java:497)
[ant:taskdef] 	at org.gradle.wrapper.BootstrapMainStarter.start(BootstrapMainStarter.java:30)
[ant:taskdef] 	at org.gradle.wrapper.WrapperExecutor.execute(WrapperExecutor.java:127)
[ant:taskdef] 	at org.gradle.wrapper.GradleWrapperMain.main(GradleWrapperMain.java:56)
:web:org.eclipse.virgo.web.war.deployer:jar
:org.eclipse.virgo.site:copyBundles
:org.eclipse.virgo.site:normalizeBundles
:org.eclipse.virgo.site:signBundles
Skipping local signing process!
:org.eclipse.virgo.site:compressBundles
:org.eclipse.virgo.site:createP2Repository
Generating metadata for ..
Generation completed with success [3 seconds].
Generating metadata for ..
Status ERROR: this code=0 publishing result null children=[Status ERROR: org.eclipse.equinox.p2.updatesite code=0 Error generating category xml action. org.eclipse.equinox.p2.core.ProvisionException: Error reading update site file:/jobs/genie.virgo/3.7.0.M02%2520(update-site)/workspace/org.eclipse.virgo.site/category.xml.]
Product publisher application was executed with the following arguments:
-metadataRepository
file:/jobs/genie.virgo/3.7.0.M02%20(update-site)/workspace/org.eclipse.virgo.site/build/repository
-categoryDefinition
file:/jobs/genie.virgo/3.7.0.M02%20(update-site)/workspace/org.eclipse.virgo.site/category.xml
-compress
:org.eclipse.virgo.site:createP2Repository FAILED

FAILURE: Build failed with an exception.

* What went wrong:
Execution failed for task ':org.eclipse.virgo.site:createP2Repository'.
> Process 'command '/opt/public/common/jdk1.8.0_51/bin/java'' finished with non-zero exit value 1

* Try:
Run with --info or --debug option to get more log output.

* Exception is:
org.gradle.api.tasks.TaskExecutionException: Execution failed for task ':org.eclipse.virgo.site:createP2Repository'.
	at org.gradle.api.internal.tasks.execution.ExecuteActionsTaskExecuter.executeActions(ExecuteActionsTaskExecuter.java:69)
	at org.gradle.api.internal.tasks.execution.ExecuteActionsTaskExecuter.execute(ExecuteActionsTaskExecuter.java:46)
	at org.gradle.api.internal.tasks.execution.PostExecutionAnalysisTaskExecuter.execute(PostExecutionAnalysisTaskExecuter.java:35)
	at org.gradle.api.internal.tasks.execution.SkipUpToDateTaskExecuter.execute(SkipUpToDateTaskExecuter.java:64)
	at org.gradle.api.internal.tasks.execution.ValidatingTaskExecuter.execute(ValidatingTaskExecuter.java:58)
	at org.gradle.api.internal.tasks.execution.SkipEmptySourceFilesTaskExecuter.execute(SkipEmptySourceFilesTaskExecuter.java:42)
	at org.gradle.api.internal.tasks.execution.SkipTaskWithNoActionsExecuter.execute(SkipTaskWithNoActionsExecuter.java:52)
	at org.gradle.api.internal.tasks.execution.SkipOnlyIfTaskExecuter.execute(SkipOnlyIfTaskExecuter.java:53)
	at org.gradle.api.internal.tasks.execution.ExecuteAtMostOnceTaskExecuter.execute(ExecuteAtMostOnceTaskExecuter.java:43)
	at org.gradle.api.internal.AbstractTask.executeWithoutThrowingTaskFailure(AbstractTask.java:296)
	at org.gradle.execution.taskgraph.AbstractTaskPlanExecutor$TaskExecutorWorker.executeTask(AbstractTaskPlanExecutor.java:79)
	at org.gradle.execution.taskgraph.AbstractTaskPlanExecutor$TaskExecutorWorker.processTask(AbstractTaskPlanExecutor.java:63)
	at org.gradle.execution.taskgraph.AbstractTaskPlanExecutor$TaskExecutorWorker.run(AbstractTaskPlanExecutor.java:51)
	at org.gradle.execution.taskgraph.DefaultTaskPlanExecutor.process(DefaultTaskPlanExecutor.java:23)
	at org.gradle.execution.taskgraph.DefaultTaskGraphExecuter.execute(DefaultTaskGraphExecuter.java:86)
	at org.gradle.execution.SelectedTaskExecutionAction.execute(SelectedTaskExecutionAction.java:29)
	at org.gradle.execution.DefaultBuildExecuter.execute(DefaultBuildExecuter.java:61)
	at org.gradle.execution.DefaultBuildExecuter.access$200(DefaultBuildExecuter.java:23)
	at org.gradle.execution.DefaultBuildExecuter$2.proceed(DefaultBuildExecuter.java:67)
	at org.gradle.execution.DryRunBuildExecutionAction.execute(DryRunBuildExecutionAction.java:32)
	at org.gradle.execution.DefaultBuildExecuter.execute(DefaultBuildExecuter.java:61)
	at org.gradle.execution.DefaultBuildExecuter.execute(DefaultBuildExecuter.java:54)
	at org.gradle.initialization.DefaultGradleLauncher.doBuildStages(DefaultGradleLauncher.java:148)
	at org.gradle.initialization.DefaultGradleLauncher.doBuild(DefaultGradleLauncher.java:105)
	at org.gradle.initialization.DefaultGradleLauncher.run(DefaultGradleLauncher.java:85)
	at org.gradle.launcher.exec.InProcessBuildActionExecuter$DefaultBuildController.run(InProcessBuildActionExecuter.java:81)
	at org.gradle.launcher.cli.ExecuteBuildAction.run(ExecuteBuildAction.java:33)
	at org.gradle.launcher.cli.ExecuteBuildAction.run(ExecuteBuildAction.java:24)
	at org.gradle.launcher.exec.InProcessBuildActionExecuter.execute(InProcessBuildActionExecuter.java:39)
	at org.gradle.launcher.exec.InProcessBuildActionExecuter.execute(InProcessBuildActionExecuter.java:29)
	at org.gradle.launcher.cli.RunBuildAction.run(RunBuildAction.java:50)
	at org.gradle.internal.Actions$RunnableActionAdapter.execute(Actions.java:171)
	at org.gradle.launcher.cli.CommandLineActionFactory$ParseAndBuildAction.execute(CommandLineActionFactory.java:237)
	at org.gradle.launcher.cli.CommandLineActionFactory$ParseAndBuildAction.execute(CommandLineActionFactory.java:210)
	at org.gradle.launcher.cli.JavaRuntimeValidationAction.execute(JavaRuntimeValidationAction.java:35)
	at org.gradle.launcher.cli.JavaRuntimeValidationAction.execute(JavaRuntimeValidationAction.java:24)
	at org.gradle.launcher.cli.CommandLineActionFactory$WithLogging.execute(CommandLineActionFactory.java:206)
	at org.gradle.launcher.cli.CommandLineActionFactory$WithLogging.execute(CommandLineActionFactory.java:169)
	at org.gradle.launcher.cli.ExceptionReportingAction.execute(ExceptionReportingAction.java:33)
	at org.gradle.launcher.cli.ExceptionReportingAction.execute(ExceptionReportingAction.java:22)
	at org.gradle.launcher.Main.doAction(Main.java:33)
	at org.gradle.launcher.bootstrap.EntryPoint.run(EntryPoint.java:45)
	at org.gradle.launcher.bootstrap.ProcessBootstrap.runNoExit(ProcessBootstrap.java:54)
	at org.gradle.launcher.bootstrap.ProcessBootstrap.run(ProcessBootstrap.java:35)
	at org.gradle.launcher.GradleMain.main(GradleMain.java:23)
	at org.gradle.wrapper.BootstrapMainStarter.start(BootstrapMainStarter.java:30)
	at org.gradle.wrapper.WrapperExecutor.execute(WrapperExecutor.java:127)
	at org.gradle.wrapper.GradleWrapperMain.main(GradleWrapperMain.java:56)
Caused by: org.gradle.process.internal.ExecException: Process 'command '/opt/public/common/jdk1.8.0_51/bin/java'' finished with non-zero exit value 1
	at org.gradle.process.internal.DefaultExecHandle$ExecResultImpl.assertNormalExitValue(DefaultExecHandle.java:365)
	at org.gradle.process.internal.DefaultJavaExecAction.execute(DefaultJavaExecAction.java:31)
	at org.gradle.api.internal.file.DefaultFileOperations.javaexec(DefaultFileOperations.java:159)
	at org.gradle.api.internal.project.AbstractProject.javaexec(AbstractProject.java:749)
	at org.gradle.api.Project$javaexec$10.call(Unknown Source)
	at virgobuild.UpdateSitePlugin.publishContentToLocalP2Repository(UpdateSitePlugin.groovy:329)
	at virgobuild.UpdateSitePlugin$publishContentToLocalP2Repository$6.callStatic(Unknown Source)
	at virgobuild.UpdateSitePlugin.createP2Repository(UpdateSitePlugin.groovy:293)
	at virgobuild.UpdateSitePlugin$_addTaskCreateP2Repository_closure15_closure29.doCall(UpdateSitePlugin.groovy:277)
	at org.gradle.api.internal.AbstractTask$ClosureTaskAction.execute(AbstractTask.java:539)
	at org.gradle.api.internal.AbstractTask$ClosureTaskAction.execute(AbstractTask.java:520)
	at org.gradle.api.internal.tasks.execution.ExecuteActionsTaskExecuter.executeAction(ExecuteActionsTaskExecuter.java:80)
	at org.gradle.api.internal.tasks.execution.ExecuteActionsTaskExecuter.executeActions(ExecuteActionsTaskExecuter.java:61)
	... 47 more


BUILD FAILED

Total time: 4 mins 32.585 secs
[locks-and-latches] Releasing all the locks
[locks-and-latches] All the locks released
Archiving artifacts
Sending e-mails to: fwaibel@eclipsesource.com
Finished: FAILURE

Powered by Hudson Open Source Continuous Integration Server from the Eclipse Foundation