FailedConsole Output

Skipping 2,887 KB.. Full Log
jexLDVPzxdEhicW5WXmpfvll6S2fNly5fzGzauYGBgqihikoFqS8/OK83NS9ZwhNEghAwQwghQWAACwxA+XYgAAAA==[WARNING] /jobs/genie.tracecompass/tracecompass-stable-nightly/workspace/analysis/org.eclipse.tracecompass.analysis.os.linux.ui/src/org/eclipse/tracecompass/internal/analysis/os/linux/ui/views/memory/MemoryUsageTreeViewer.java:[17] 
10:55:32 	import org.eclipse.tracecompass.internal.provisional.tmf.core.model.filters.FilterTimeQueryFilter;
10:55:32 	       ^^^^^^^^^^^^^^^^^^^^^^^^^^^^^^^^^^^^^^^^^^^^^^^^^^^^^^^^^^^^^^^^^^^^^^^^^^^^^^^^^^^^^^^^^^
10:55:32 Discouraged access: The type 'FilterTimeQueryFilter' is not API (restriction on classpath entry '/jobs/genie.tracecompass/tracecompass-stable-nightly/workspace/tmf/org.eclipse.tracecompass.tmf.core/target/classes')
10:55:32 [WARNING] /jobs/genie.tracecompass/tracecompass-stable-nightly/workspace/analysis/org.eclipse.tracecompass.analysis.os.linux.ui/src/org/eclipse/tracecompass/internal/analysis/os/linux/ui/views/memory/MemoryUsageTreeViewer.java:[18] 
10:55:32 	import org.eclipse.tracecompass.internal.provisional.tmf.core.model.filters.TimeQueryFilter;
10:55:32 	       ^^^^^^^^^^^^^^^^^^^^^^^^^^^^^^^^^^^^^^^^^^^^^^^^^^^^^^^^^^^^^^^^^^^^^^^^^^^^^^^^^^^^
10:55:32 Discouraged access: The type 'TimeQueryFilter' is not API (restriction on classpath entry '/jobs/genie.tracecompass/tracecompass-stable-nightly/workspace/tmf/org.eclipse.tracecompass.tmf.core/target/classes')
10:55:32 [WARNING] /jobs/genie.tracecompass/tracecompass-stable-nightly/workspace/analysis/org.eclipse.tracecompass.analysis.os.linux.ui/src/org/eclipse/tracecompass/internal/analysis/os/linux/ui/views/memory/MemoryUsageTreeViewer.java:[45] 
10:55:32 	TmfGenericTreeEntry<MemoryUsageTreeModel> obj = (TmfGenericTreeEntry<MemoryUsageTreeModel>) element;
10:55:32 	                                                ^^^^^^^^^^^^^^^^^^^^^^^^^^^^^^^^^^^^^^^^^^^^^^^^^^^
10:55:32 Type safety: Unchecked cast from Object to TmfGenericTreeEntry<MemoryUsageTreeModel>
10:55:32 [WARNING] /jobs/genie.tracecompass/tracecompass-stable-nightly/workspace/analysis/org.eclipse.tracecompass.analysis.os.linux.ui/src/org/eclipse/tracecompass/internal/analysis/os/linux/ui/views/memory/MemoryUsageTreeViewer.java:[61] 
10:55:32 	TmfGenericTreeEntry<MemoryUsageTreeModel> entry = (TmfGenericTreeEntry<MemoryUsageTreeModel>) element;
10:55:32 	                                                  ^^^^^^^^^^^^^^^^^^^^^^^^^^^^^^^^^^^^^^^^^^^^^^^^^^^
10:55:32 Type safety: Unchecked cast from Object to TmfGenericTreeEntry<MemoryUsageTreeModel>
10:55:32 [WARNING] /jobs/genie.tracecompass/tracecompass-stable-nightly/workspace/analysis/org.eclipse.tracecompass.analysis.os.linux.ui/src/org/eclipse/tracecompass/internal/analysis/os/linux/ui/views/memory/MemoryUsageTreeViewer.java:[90] 
10:55:32 	protected @Nullable TimeQueryFilter getFilter(long start, long end, boolean isSelection) {
10:55:32 	                    ^^^^^^^^^^^^^^^
10:55:32 Discouraged access: The type 'TimeQueryFilter' is not API (restriction on classpath entry '/jobs/genie.tracecompass/tracecompass-stable-nightly/workspace/tmf/org.eclipse.tracecompass.tmf.core/target/classes')
10:55:32 [WARNING] /jobs/genie.tracecompass/tracecompass-stable-nightly/workspace/analysis/org.eclipse.tracecompass.analysis.os.linux.ui/src/org/eclipse/tracecompass/internal/analysis/os/linux/ui/views/memory/MemoryUsageTreeViewer.java:[91] 
10:55:32 	return new FilterTimeQueryFilter(start, end, 2, fFiltered);
10:55:32 	       ^^^^^^^^^^^^^^^^^^^^^^^^^^^^^^^^^^^^^^^^^^^^^^^^^^^
10:55:32 Discouraged access: The constructor 'FilterTimeQueryFilter(long, long, int, boolean)' is not API (restriction on classpath entry '/jobs/genie.tracecompass/tracecompass-stable-nightly/workspace/tmf/org.eclipse.tracecompass.tmf.core/target/classes')
10:55:32 [WARNING] /jobs/genie.tracecompass/tracecompass-stable-nightly/workspace/analysis/org.eclipse.tracecompass.analysis.os.linux.ui/src/org/eclipse/tracecompass/internal/analysis/os/linux/ui/views/memory/MemoryUsageTreeViewer.java:[91] 
10:55:32 	return new FilterTimeQueryFilter(start, end, 2, fFiltered);
10:55:32 	           ^^^^^^^^^^^^^^^^^^^^^
10:55:32 Discouraged access: The type 'FilterTimeQueryFilter' is not API (restriction on classpath entry '/jobs/genie.tracecompass/tracecompass-stable-nightly/workspace/tmf/org.eclipse.tracecompass.tmf.core/target/classes')
10:55:32 [WARNING] /jobs/genie.tracecompass/tracecompass-stable-nightly/workspace/analysis/org.eclipse.tracecompass.analysis.os.linux.ui/src/org/eclipse/tracecompass/internal/analysis/os/linux/ui/views/controlflow/ControlFlowView.java:[738] 
10:55:32 	zoomEntries(entries, ssq.getStartTime(), end, resolution, monitor);
10:55:32 	            ^^^^^^^
10:55:32 Null type safety (type annotations): The expression of type 'Iterable<TimeGraphEntry>' needs unchecked conversion to conform to '@NonNull Iterable<@NonNull TimeGraphEntry>'
10:55:32 [WARNING] /jobs/genie.tracecompass/tracecompass-stable-nightly/workspace/analysis/org.eclipse.tracecompass.analysis.os.linux.ui/src/org/eclipse/tracecompass/internal/analysis/os/linux/ui/views/controlflow/ControlFlowView.java:[776] 
10:55:32 	StreamFlattener<TimeGraphEntry> sf = new StreamFlattener<>(entry -> entry.getChildren().stream());
10:55:32 	                                                                    ^^^^^^^^^^^^^^^^^^^^^^^^^^^^
10:55:32 Null type safety (type annotations): The expression of type 'Stream<@NonNull TimeGraphEntry>' needs unchecked conversion to conform to '@NonNull Stream<TimeGraphEntry>'
10:55:32 [WARNING] /jobs/genie.tracecompass/tracecompass-stable-nightly/workspace/analysis/org.eclipse.tracecompass.analysis.os.linux.ui/src/org/eclipse/tracecompass/internal/analysis/os/linux/ui/views/cpuusage/CpuUsageView.java:[118] 
10:55:32 	protected static @NonNull Set<@NonNull Integer> getCpus(@NonNull ITmfTrace trace) {
10:55:32 	                                                ^^^^^^^^^^^^^^^^^^^^^^^^^^^^^^^^^
10:55:32 Javadoc: Missing comment for protected declaration
10:55:32 [WARNING] /jobs/genie.tracecompass/tracecompass-stable-nightly/workspace/analysis/org.eclipse.tracecompass.analysis.os.linux.ui/src/org/eclipse/tracecompass/internal/analysis/os/linux/ui/views/cpuusage/CpuUsageView.java:[119] 
10:55:32 	Set<@NonNull Integer> data = (Set<@NonNull Integer>) getData(trace, CpuUsageView.CPU_USAGE_FOLLOW_CPU);
10:55:32 	                             ^^^^^^^^^^^^^^^^^^^^^^^^^^^^^^^^^^^^^^^^^^^^^^^^^^^^^^^^^^^^^^^^^^^^^^^^^
10:55:32 Type safety: Unchecked cast from Object to Set<Integer>
10:55:32 [WARNING] /jobs/genie.tracecompass/tracecompass-stable-nightly/workspace/analysis/org.eclipse.tracecompass.analysis.os.linux.ui/src/org/eclipse/tracecompass/internal/analysis/os/linux/ui/views/cpuusage/CpuUsageView.java:[144] 
10:55:32 	Set<Integer> data = (Set<Integer>) getData(trace, CPU_USAGE_FOLLOW_CPU);
10:55:32 	                    ^^^^^^^^^^^^^^^^^^^^^^^^^^^^^^^^^^^^^^^^^^^^^^^^^^^
10:55:32 Type safety: Unchecked cast from Object to Set<Integer>
10:55:32 [WARNING] /jobs/genie.tracecompass/tracecompass-stable-nightly/workspace/analysis/org.eclipse.tracecompass.analysis.os.linux.ui/src/org/eclipse/tracecompass/internal/analysis/os/linux/ui/views/latency/SystemCallLatencyScatterView.java:[62] 
10:55:32 	return super.getChartViewer();
10:55:32 	       ^^^^^^^^^^^^^^^^^^^^^^
10:55:32 Null type safety (type annotations): The expression of type 'TmfXYChartViewer' needs unchecked conversion to conform to '@NonNull TmfXYChartViewer'
10:55:32 [WARNING] /jobs/genie.tracecompass/tracecompass-stable-nightly/workspace/analysis/org.eclipse.tracecompass.analysis.os.linux.ui/src/org/eclipse/tracecompass/internal/analysis/os/linux/ui/views/memory/MemoryUsageView.java:[17] 
10:55:32 	import org.eclipse.tracecompass.internal.provisional.tmf.core.presentation.IYAppearance;
10:55:32 	       ^^^^^^^^^^^^^^^^^^^^^^^^^^^^^^^^^^^^^^^^^^^^^^^^^^^^^^^^^^^^^^^^^^^^^^^^^^^^^^^^
10:55:32 Discouraged access: The type 'IYAppearance' is not API (restriction on classpath entry '/jobs/genie.tracecompass/tracecompass-stable-nightly/workspace/tmf/org.eclipse.tracecompass.tmf.core/target/classes')
10:55:32 [WARNING] /jobs/genie.tracecompass/tracecompass-stable-nightly/workspace/analysis/org.eclipse.tracecompass.analysis.os.linux.ui/src/org/eclipse/tracecompass/internal/analysis/os/linux/ui/views/memory/MemoryUsageView.java:[63] 
10:55:32 	public @NonNull IYAppearance getSeriesAppearance(String seriesName) {
10:55:32 	                ^^^^^^^^^^^^
10:55:32 Discouraged access: The type 'IYAppearance' is not API (restriction on classpath entry '/jobs/genie.tracecompass/tracecompass-stable-nightly/workspace/tmf/org.eclipse.tracecompass.tmf.core/target/classes')
10:55:32 [WARNING] /jobs/genie.tracecompass/tracecompass-stable-nightly/workspace/analysis/org.eclipse.tracecompass.analysis.os.linux.ui/src/org/eclipse/tracecompass/internal/analysis/os/linux/ui/views/memory/MemoryUsageView.java:[65] 
10:55:32 	return getPresentationProvider().getAppearance(seriesName, IYAppearance.Type.LINE, width);
10:55:32 	       ^^^^^^^^^^^^^^^^^^^^^^^^^^^^^^^^^^^^^^^^^^^^^^^^^^^^^^^^^^^^^^^^^^^^^^^^^^^^^^^^^^
10:55:32 Discouraged access: The method 'IXYPresentationProvider.getAppearance(String, String, int)' is not API (restriction on classpath entry '/jobs/genie.tracecompass/tracecompass-stable-nightly/workspace/tmf/org.eclipse.tracecompass.tmf.core/target/classes')
10:55:32 [WARNING] /jobs/genie.tracecompass/tracecompass-stable-nightly/workspace/analysis/org.eclipse.tracecompass.analysis.os.linux.ui/src/org/eclipse/tracecompass/internal/analysis/os/linux/ui/views/memory/MemoryUsageView.java:[65] 
10:55:32 	return getPresentationProvider().getAppearance(seriesName, IYAppearance.Type.LINE, width);
10:55:32 	                                                           ^^^^^^^^^^^^^^^^^^^^^^
10:55:32 Discouraged access: The type 'IYAppearance' is not API (restriction on classpath entry '/jobs/genie.tracecompass/tracecompass-stable-nightly/workspace/tmf/org.eclipse.tracecompass.tmf.core/target/classes')
10:55:32 [WARNING] /jobs/genie.tracecompass/tracecompass-stable-nightly/workspace/analysis/org.eclipse.tracecompass.analysis.os.linux.ui/src/org/eclipse/tracecompass/internal/analysis/os/linux/ui/views/memory/MemoryUsageView.java:[65] 
10:55:32 	return getPresentationProvider().getAppearance(seriesName, IYAppearance.Type.LINE, width);
10:55:32 	                                                           ^^^^^^^^^^^^^^^^^^^^^^
10:55:32 Discouraged access: The type 'IYAppearance.Type' is not API (restriction on classpath entry '/jobs/genie.tracecompass/tracecompass-stable-nightly/workspace/tmf/org.eclipse.tracecompass.tmf.core/target/classes')
10:55:32 [WARNING] /jobs/genie.tracecompass/tracecompass-stable-nightly/workspace/analysis/org.eclipse.tracecompass.analysis.os.linux.ui/src/org/eclipse/tracecompass/internal/analysis/os/linux/ui/views/memory/MemoryUsageView.java:[65] 
10:55:32 	return getPresentationProvider().getAppearance(seriesName, IYAppearance.Type.LINE, width);
10:55:32 	                                                                             ^^^^
10:55:32 Discouraged access: The field 'IYAppearance.Type.LINE' is not API (restriction on classpath entry '/jobs/genie.tracecompass/tracecompass-stable-nightly/workspace/tmf/org.eclipse.tracecompass.tmf.core/target/classes')
10:55:32 [WARNING] /jobs/genie.tracecompass/tracecompass-stable-nightly/workspace/analysis/org.eclipse.tracecompass.analysis.os.linux.ui/src/org/eclipse/tracecompass/internal/analysis/os/linux/ui/views/cpuusage/CpuUsageXYViewer.java:[56] 
10:55:32 	return new SelectedCpuQueryFilter(start, end, nb, getSelected(), CpuUsageView.getCpus(getTrace()));
10:55:32 	                                                                                      ^^^^^^^^^^
10:55:32 Null type safety (type annotations): The expression of type 'ITmfTrace' needs unchecked conversion to conform to '@NonNull ITmfTrace'
10:55:32 [WARNING] /jobs/genie.tracecompass/tracecompass-stable-nightly/workspace/analysis/org.eclipse.tracecompass.analysis.os.linux.ui/src/org/eclipse/tracecompass/internal/analysis/os/linux/ui/views/cpuusage/CpuUsageXYViewer.java:[72] 
10:55:32 	Set<Integer> cpus = CpuUsageView.getCpus(getTrace());
10:55:32 	                                         ^^^^^^^^^^
10:55:32 Null type safety (type annotations): The expression of type 'ITmfTrace' needs unchecked conversion to conform to '@NonNull ITmfTrace'
10:55:32 [WARNING] /jobs/genie.tracecompass/tracecompass-stable-nightly/workspace/analysis/org.eclipse.tracecompass.analysis.os.linux.ui/src/org/eclipse/tracecompass/internal/analysis/os/linux/ui/views/cpuusage/CpuUsageTreeViewer.java:[27] 
10:55:32 	import org.eclipse.tracecompass.internal.provisional.tmf.core.model.filters.SelectedCpuQueryFilter;
10:55:32 	       ^^^^^^^^^^^^^^^^^^^^^^^^^^^^^^^^^^^^^^^^^^^^^^^^^^^^^^^^^^^^^^^^^^^^^^^^^^^^^^^^^^^^^^^^^^^
10:55:32 Discouraged access: The type 'SelectedCpuQueryFilter' is not API (restriction on classpath entry '/jobs/genie.tracecompass/tracecompass-stable-nightly/workspace/tmf/org.eclipse.tracecompass.tmf.core/target/classes')
10:55:32 [WARNING] /jobs/genie.tracecompass/tracecompass-stable-nightly/workspace/analysis/org.eclipse.tracecompass.analysis.os.linux.ui/src/org/eclipse/tracecompass/internal/analysis/os/linux/ui/views/cpuusage/CpuUsageTreeViewer.java:[28] 
10:55:32 	import org.eclipse.tracecompass.internal.provisional.tmf.core.model.filters.TimeQueryFilter;
10:55:32 	       ^^^^^^^^^^^^^^^^^^^^^^^^^^^^^^^^^^^^^^^^^^^^^^^^^^^^^^^^^^^^^^^^^^^^^^^^^^^^^^^^^^^^
10:55:32 Discouraged access: The type 'TimeQueryFilter' is not API (restriction on classpath entry '/jobs/genie.tracecompass/tracecompass-stable-nightly/workspace/tmf/org.eclipse.tracecompass.tmf.core/target/classes')
10:55:32 [WARNING] /jobs/genie.tracecompass/tracecompass-stable-nightly/workspace/analysis/org.eclipse.tracecompass.analysis.os.linux.ui/src/org/eclipse/tracecompass/internal/analysis/os/linux/ui/views/cpuusage/CpuUsageTreeViewer.java:[29] 
10:55:32 	import org.eclipse.tracecompass.internal.provisional.tmf.core.model.tree.TmfTreeDataModel;
10:55:32 	       ^^^^^^^^^^^^^^^^^^^^^^^^^^^^^^^^^^^^^^^^^^^^^^^^^^^^^^^^^^^^^^^^^^^^^^^^^^^^^^^^^^
10:55:32 Discouraged access: The type 'TmfTreeDataModel' is not API (restriction on classpath entry '/jobs/genie.tracecompass/tracecompass-stable-nightly/workspace/tmf/org.eclipse.tracecompass.tmf.core/target/classes')
10:55:32 [WARNING] /jobs/genie.tracecompass/tracecompass-stable-nightly/workspace/analysis/org.eclipse.tracecompass.analysis.os.linux.ui/src/org/eclipse/tracecompass/internal/analysis/os/linux/ui/views/cpuusage/CpuUsageTreeViewer.java:[79] 
10:55:32 	return getLegendImage(CpuUsageDataProvider.TOTAL + model.getName());
10:55:32 	                                                   ^^^^^^^^^^^^^^^
10:55:32 Discouraged access: The method 'TmfTreeDataModel.getName()' is not API (restriction on classpath entry '/jobs/genie.tracecompass/tracecompass-stable-nightly/workspace/tmf/org.eclipse.tracecompass.tmf.core/target/classes')
10:55:32 [WARNING] /jobs/genie.tracecompass/tracecompass-stable-nightly/workspace/analysis/org.eclipse.tracecompass.analysis.os.linux.ui/src/org/eclipse/tracecompass/internal/analysis/os/linux/ui/views/cpuusage/CpuUsageTreeViewer.java:[83] 
10:55:32 	return getLegendImage(parent.getModel().getName() + ':' + model.getTid());
10:55:32 	                      ^^^^^^^^^^^^^^^^^^^^^^^^^^^
10:55:32 Discouraged access: The method 'TmfTreeDataModel.getName()' is not API (restriction on classpath entry '/jobs/genie.tracecompass/tracecompass-stable-nightly/workspace/tmf/org.eclipse.tracecompass.tmf.core/target/classes')
10:55:32 [WARNING] /jobs/genie.tracecompass/tracecompass-stable-nightly/workspace/analysis/org.eclipse.tracecompass.analysis.os.linux.ui/src/org/eclipse/tracecompass/internal/analysis/os/linux/ui/views/cpuusage/CpuUsageTreeViewer.java:[115] 
10:55:32 	protected @Nullable TimeQueryFilter getFilter(long start, long end, boolean isSelection) {
10:55:32 	                    ^^^^^^^^^^^^^^^
10:55:32 Discouraged access: The type 'TimeQueryFilter' is not API (restriction on classpath entry '/jobs/genie.tracecompass/tracecompass-stable-nightly/workspace/tmf/org.eclipse.tracecompass.tmf.core/target/classes')
10:55:32 [WARNING] /jobs/genie.tracecompass/tracecompass-stable-nightly/workspace/analysis/org.eclipse.tracecompass.analysis.os.linux.ui/src/org/eclipse/tracecompass/internal/analysis/os/linux/ui/views/cpuusage/CpuUsageTreeViewer.java:[122] 
10:55:32 	return new SelectedCpuQueryFilter(newStart, newEnd, 2, Collections.emptyList(), CpuUsageView.getCpus(getTrace()));
10:55:32 	       ^^^^^^^^^^^^^^^^^^^^^^^^^^^^^^^^^^^^^^^^^^^^^^^^^^^^^^^^^^^^^^^^^^^^^^^^^^^^^^^^^^^^^^^^^^^^^^^^^^^^^^^^^^
10:55:32 Discouraged access: The constructor 'SelectedCpuQueryFilter(long, long, int, Collection<Long>, Set<Integer>)' is not API (restriction on classpath entry '/jobs/genie.tracecompass/tracecompass-stable-nightly/workspace/tmf/org.eclipse.tracecompass.tmf.core/target/classes')
10:55:32 [WARNING] /jobs/genie.tracecompass/tracecompass-stable-nightly/workspace/analysis/org.eclipse.tracecompass.analysis.os.linux.ui/src/org/eclipse/tracecompass/internal/analysis/os/linux/ui/views/cpuusage/CpuUsageTreeViewer.java:[122] 
10:55:32 	return new SelectedCpuQueryFilter(newStart, newEnd, 2, Collections.emptyList(), CpuUsageView.getCpus(getTrace()));
10:55:32 	           ^^^^^^^^^^^^^^^^^^^^^^
10:55:32 Discouraged access: The type 'SelectedCpuQueryFilter' is not API (restriction on classpath entry '/jobs/genie.tracecompass/tracecompass-stable-nightly/workspace/tmf/org.eclipse.tracecompass.tmf.core/target/classes')
10:55:32 [WARNING] /jobs/genie.tracecompass/tracecompass-stable-nightly/workspace/analysis/org.eclipse.tracecompass.analysis.os.linux.ui/src/org/eclipse/tracecompass/internal/analysis/os/linux/ui/views/cpuusage/CpuUsageTreeViewer.java:[122] 
10:55:32 	return new SelectedCpuQueryFilter(newStart, newEnd, 2, Collections.emptyList(), CpuUsageView.getCpus(getTrace()));
10:55:32 	                                                                                                     ^^^^^^^^^^
10:55:32 Null type safety (type annotations): The expression of type 'ITmfTrace' needs unchecked conversion to conform to '@NonNull ITmfTrace'
10:55:32 [WARNING] /jobs/genie.tracecompass/tracecompass-stable-nightly/workspace/analysis/org.eclipse.tracecompass.analysis.os.linux.ui/src/org/eclipse/tracecompass/internal/analysis/os/linux/ui/views/cpuusage/CpuUsageTreeViewer.java:[126] 
10:55:32 	protected ITmfTreeViewerEntry modelToTree(long start, long end, List<TmfTreeDataModel> model) {
10:55:32 	                                                                     ^^^^^^^^^^^^^^^^
10:55:32 Discouraged access: The type 'TmfTreeDataModel' is not API (restriction on classpath entry '/jobs/genie.tracecompass/tracecompass-stable-nightly/workspace/tmf/org.eclipse.tracecompass.tmf.core/target/classes')
10:55:32 [WARNING] /jobs/genie.tracecompass/tracecompass-stable-nightly/workspace/analysis/org.eclipse.tracecompass.analysis.os.linux.ui/src/org/eclipse/tracecompass/internal/analysis/os/linux/ui/views/cpuusage/CpuUsageTreeViewer.java:[135] 
10:55:32 	map.put(entryModel.getId(), cpuUsageEntry);
10:55:32 	        ^^^^^^^^^^^^^^^^^^
10:55:32 Discouraged access: The method 'TmfTreeDataModel.getId()' is not API (restriction on classpath entry '/jobs/genie.tracecompass/tracecompass-stable-nightly/workspace/tmf/org.eclipse.tracecompass.tmf.core/target/classes')
10:55:32 [WARNING] /jobs/genie.tracecompass/tracecompass-stable-nightly/workspace/analysis/org.eclipse.tracecompass.analysis.os.linux.ui/src/org/eclipse/tracecompass/internal/analysis/os/linux/ui/views/cpuusage/CpuUsageTreeViewer.java:[137] 
10:55:32 	TmfTreeViewerEntry parent = map.get(entryModel.getParentId());
10:55:32 	                                    ^^^^^^^^^^^^^^^^^^^^^^^^
10:55:32 Discouraged access: The method 'TmfTreeDataModel.getParentId()' is not API (restriction on classpath entry '/jobs/genie.tracecompass/tracecompass-stable-nightly/workspace/tmf/org.eclipse.tracecompass.tmf.core/target/classes')
10:55:32 [WARNING] /jobs/genie.tracecompass/tracecompass-stable-nightly/workspace/analysis/org.eclipse.tracecompass.analysis.os.linux.ui/src/org/eclipse/tracecompass/internal/analysis/os/linux/ui/views/io/diskioactivity/DiskIOActivityTreeViewer.java:[18] 
10:55:32 	import org.eclipse.tracecompass.internal.provisional.tmf.core.model.tree.TmfTreeDataModel;
10:55:32 	       ^^^^^^^^^^^^^^^^^^^^^^^^^^^^^^^^^^^^^^^^^^^^^^^^^^^^^^^^^^^^^^^^^^^^^^^^^^^^^^^^^^
10:55:32 Discouraged access: The type 'TmfTreeDataModel' is not API (restriction on classpath entry '/jobs/genie.tracecompass/tracecompass-stable-nightly/workspace/tmf/org.eclipse.tracecompass.tmf.core/target/classes')
10:55:32 [WARNING] /jobs/genie.tracecompass/tracecompass-stable-nightly/workspace/analysis/org.eclipse.tracecompass.analysis.os.linux.ui/src/org/eclipse/tracecompass/internal/analysis/os/linux/ui/views/io/diskioactivity/DiskIOActivityTreeViewer.java:[38] 
10:55:32 	TmfGenericTreeEntry<TmfTreeDataModel> entry = (TmfGenericTreeEntry<TmfTreeDataModel>) element;
10:55:32 	                    ^^^^^^^^^^^^^^^^
10:55:32 Discouraged access: The type 'TmfTreeDataModel' is not API (restriction on classpath entry '/jobs/genie.tracecompass/tracecompass-stable-nightly/workspace/tmf/org.eclipse.tracecompass.tmf.core/target/classes')
10:55:32 [WARNING] /jobs/genie.tracecompass/tracecompass-stable-nightly/workspace/analysis/org.eclipse.tracecompass.analysis.os.linux.ui/src/org/eclipse/tracecompass/internal/analysis/os/linux/ui/views/io/diskioactivity/DiskIOActivityTreeViewer.java:[38] 
10:55:32 	TmfGenericTreeEntry<TmfTreeDataModel> entry = (TmfGenericTreeEntry<TmfTreeDataModel>) element;
10:55:32 	                                              ^^^^^^^^^^^^^^^^^^^^^^^^^^^^^^^^^^^^^^^^^^^^^^^
10:55:32 Type safety: Unchecked cast from Object to TmfGenericTreeEntry<TmfTreeDataModel>
10:55:32 [WARNING] /jobs/genie.tracecompass/tracecompass-stable-nightly/workspace/analysis/org.eclipse.tracecompass.analysis.os.linux.ui/src/org/eclipse/tracecompass/internal/analysis/os/linux/ui/views/io/diskioactivity/DiskIOActivityTreeViewer.java:[38] 
10:55:32 	TmfGenericTreeEntry<TmfTreeDataModel> entry = (TmfGenericTreeEntry<TmfTreeDataModel>) element;
10:55:32 	                                                                   ^^^^^^^^^^^^^^^^
10:55:32 Discouraged access: The type 'TmfTreeDataModel' is not API (restriction on classpath entry '/jobs/genie.tracecompass/tracecompass-stable-nightly/workspace/tmf/org.eclipse.tracecompass.tmf.core/target/classes')
10:55:32 37 problems (37 warnings)
10:55:32 [INFO] 
10:55:32 [INFO] --- maven-resources-plugin:3.0.2:testResources (default-testResources) @ org.eclipse.tracecompass.analysis.os.linux.ui ---
10:55:32 [INFO] Using 'UTF-8' encoding to copy filtered resources.
10:55:32 [INFO] skip non existing resourceDirectory /jobs/genie.tracecompass/tracecompass-stable-nightly/workspace/analysis/org.eclipse.tracecompass.analysis.os.linux.ui/src/test/resources
10:55:32 [INFO] 
10:55:32 [INFO] --- tycho-source-plugin:1.0.0:plugin-source (plugin-source) @ org.eclipse.tracecompass.analysis.os.linux.ui ---
10:55:32 [INFO] Building jar: /jobs/genie.tracecompass/tracecompass-stable-nightly/workspace/analysis/org.eclipse.tracecompass.analysis.os.linux.ui/target/org.eclipse.tracecompass.analysis.os.linux.ui-2.2.0-SNAPSHOT-sources.jar
10:55:32 [INFO] 
10:55:32 [INFO] --- target-platform-configuration:1.0.0:target-platform (default-target-platform) @ org.eclipse.tracecompass.analysis.os.linux.ui ---
10:55:32 [INFO] 
10:55:32 [INFO] --- tycho-packaging-plugin:1.0.0:package-plugin (default-package-plugin) @ org.eclipse.tracecompass.analysis.os.linux.ui ---
10:55:32 [INFO] Building jar: /jobs/genie.tracecompass/tracecompass-stable-nightly/workspace/analysis/org.eclipse.tracecompass.analysis.os.linux.ui/target/org.eclipse.tracecompass.analysis.os.linux.ui-2.2.0-SNAPSHOT.jar
10:55:32 [INFO] 
10:55:32 [INFO] --- tycho-p2-plugin:1.0.0:p2-metadata-default (default-p2-metadata-default) @ org.eclipse.tracecompass.analysis.os.linux.ui ---
10:55:32 [INFO] 
10:55:32 [INFO] --- tycho-source-feature-plugin:1.0.0:source-feature (source-feature) @ org.eclipse.tracecompass.analysis.os.linux.ui ---
10:55:32 [INFO] 
10:55:32 [INFO] --- tycho-pack200a-plugin:1.0.0:normalize (pack200-normalize) @ org.eclipse.tracecompass.analysis.os.linux.ui ---
10:55:32 [INFO] Pack200 normalizing jar /jobs/genie.tracecompass/tracecompass-stable-nightly/workspace/analysis/org.eclipse.tracecompass.analysis.os.linux.ui/target/org.eclipse.tracecompass.analysis.os.linux.ui-2.2.0-SNAPSHOT.jar
10:55:32 [INFO] 
10:55:32 [INFO] --- eclipse-jarsigner-plugin:1.1.3:sign (sign) @ org.eclipse.tracecompass.analysis.os.linux.ui ---
10:55:32 [INFO] Signing jar: /jobs/genie.tracecompass/tracecompass-stable-nightly/workspace/analysis/org.eclipse.tracecompass.analysis.os.linux.ui/target/org.eclipse.tracecompass.analysis.os.linux.ui-2.2.0-SNAPSHOT.jar
10:55:33 [INFO] Signing jar: /jobs/genie.tracecompass/tracecompass-stable-nightly/workspace/analysis/org.eclipse.tracecompass.analysis.os.linux.ui/target/org.eclipse.tracecompass.analysis.os.linux.ui-2.2.0-SNAPSHOT-sources.jar
10:55:34 [INFO] 
10:55:34 [INFO] --- tycho-pack200b-plugin:1.0.0:pack (pack200-pack) @ org.eclipse.tracecompass.analysis.os.linux.ui ---
10:55:34 [INFO] Pack200 packing jar /jobs/genie.tracecompass/tracecompass-stable-nightly/workspace/analysis/org.eclipse.tracecompass.analysis.os.linux.ui/target/org.eclipse.tracecompass.analysis.os.linux.ui-2.2.0-SNAPSHOT.jar
10:55:34 [INFO] 
10:55:34 [INFO] --- tycho-p2-plugin:1.0.0:p2-metadata (p2-metadata) @ org.eclipse.tracecompass.analysis.os.linux.ui ---
10:55:34 [INFO] 
10:55:34 [INFO] --- jacoco-maven-plugin:0.7.9:report (post-test) @ org.eclipse.tracecompass.analysis.os.linux.ui ---
10:55:34 [INFO] Loading execution data file /jobs/genie.tracecompass/tracecompass-stable-nightly/workspace/analysis/org.eclipse.tracecompass.analysis.os.linux.ui/../../target/jacoco.exec
10:55:34 [INFO] Analyzed bundle 'org.eclipse.tracecompass.analysis.os.linux.ui' with 72 classes
10:55:34 [INFO] 
10:55:34 [INFO] --- maven-install-plugin:2.5.2:install (default-install) @ org.eclipse.tracecompass.analysis.os.linux.ui ---
10:55:34 [INFO] Installing /jobs/genie.tracecompass/tracecompass-stable-nightly/workspace/analysis/org.eclipse.tracecompass.analysis.os.linux.ui/target/org.eclipse.tracecompass.analysis.os.linux.ui-2.2.0-SNAPSHOT.jar to /home/hudson/genie.tracecompass/.jenkins/jobs/tracecompass-stable-nightly/workspace/.repository/org/eclipse/tracecompass/org.eclipse.tracecompass.analysis.os.linux.ui/2.2.0-SNAPSHOT/org.eclipse.tracecompass.analysis.os.linux.ui-2.2.0-SNAPSHOT.jar
10:55:34 [INFO] Installing /jobs/genie.tracecompass/tracecompass-stable-nightly/workspace/analysis/org.eclipse.tracecompass.analysis.os.linux.ui/.polyglot.build.properties to /home/hudson/genie.tracecompass/.jenkins/jobs/tracecompass-stable-nightly/workspace/.repository/org/eclipse/tracecompass/org.eclipse.tracecompass.analysis.os.linux.ui/2.2.0-SNAPSHOT/org.eclipse.tracecompass.analysis.os.linux.ui-2.2.0-SNAPSHOT.pom
10:55:34 [INFO] Installing /jobs/genie.tracecompass/tracecompass-stable-nightly/workspace/analysis/org.eclipse.tracecompass.analysis.os.linux.ui/target/org.eclipse.tracecompass.analysis.os.linux.ui-2.2.0-SNAPSHOT-sources.jar to /home/hudson/genie.tracecompass/.jenkins/jobs/tracecompass-stable-nightly/workspace/.repository/org/eclipse/tracecompass/org.eclipse.tracecompass.analysis.os.linux.ui/2.2.0-SNAPSHOT/org.eclipse.tracecompass.analysis.os.linux.ui-2.2.0-SNAPSHOT-sources.jar
10:55:34 [INFO] Installing /jobs/genie.tracecompass/tracecompass-stable-nightly/workspace/analysis/org.eclipse.tracecompass.analysis.os.linux.ui/target/org.eclipse.tracecompass.analysis.os.linux.ui-2.2.0-SNAPSHOT.jar.pack.gz to /home/hudson/genie.tracecompass/.jenkins/jobs/tracecompass-stable-nightly/workspace/.repository/org/eclipse/tracecompass/org.eclipse.tracecompass.analysis.os.linux.ui/2.2.0-SNAPSHOT/org.eclipse.tracecompass.analysis.os.linux.ui-2.2.0-SNAPSHOT-pack200.jar.pack.gz
10:55:34 [INFO] Installing /jobs/genie.tracecompass/tracecompass-stable-nightly/workspace/analysis/org.eclipse.tracecompass.analysis.os.linux.ui/target/p2content.xml to /home/hudson/genie.tracecompass/.jenkins/jobs/tracecompass-stable-nightly/workspace/.repository/org/eclipse/tracecompass/org.eclipse.tracecompass.analysis.os.linux.ui/2.2.0-SNAPSHOT/org.eclipse.tracecompass.analysis.os.linux.ui-2.2.0-SNAPSHOT-p2metadata.xml
10:55:34 [INFO] Installing /jobs/genie.tracecompass/tracecompass-stable-nightly/workspace/analysis/org.eclipse.tracecompass.analysis.os.linux.ui/target/p2artifacts.xml to /home/hudson/genie.tracecompass/.jenkins/jobs/tracecompass-stable-nightly/workspace/.repository/org/eclipse/tracecompass/org.eclipse.tracecompass.analysis.os.linux.ui/2.2.0-SNAPSHOT/org.eclipse.tracecompass.analysis.os.linux.ui-2.2.0-SNAPSHOT-p2artifacts.xml
10:55:34 [INFO] 
10:55:34 [INFO] --- tycho-p2-plugin:1.0.0:update-local-index (default-update-local-index) @ org.eclipse.tracecompass.analysis.os.linux.ui ---
10:55:34 [INFO] 
10:55:34 [INFO] ------------------------------------------------------------------------
10:55:34 [INFO] Building org.eclipse.tracecompass.analysis.os.linux.ui.tests 1.0.3-SNAPSHOT
10:55:34 [INFO] ------------------------------------------------------------------------
10:55:34 [INFO] 
10:55:34 [INFO] --- maven-clean-plugin:3.0.0:clean (default-clean) @ org.eclipse.tracecompass.analysis.os.linux.ui.tests ---
10:55:34 [INFO] Deleting /jobs/genie.tracecompass/tracecompass-stable-nightly/workspace/analysis/org.eclipse.tracecompass.analysis.os.linux.ui.tests/target
10:55:34 [INFO] 
10:55:34 [INFO] --- tycho-packaging-plugin:1.0.0:build-qualifier (default-build-qualifier) @ org.eclipse.tracecompass.analysis.os.linux.ui.tests ---
10:55:34 [INFO] The project's OSGi version is 1.0.3.201801311519
10:55:34 [INFO] 
10:55:34 [INFO] --- tycho-packaging-plugin:1.0.0:validate-id (default-validate-id) @ org.eclipse.tracecompass.analysis.os.linux.ui.tests ---
10:55:34 [INFO] 
10:55:34 [INFO] --- tycho-packaging-plugin:1.0.0:validate-version (default-validate-version) @ org.eclipse.tracecompass.analysis.os.linux.ui.tests ---
10:55:34 [INFO] 
10:55:34 [INFO] --- maven-enforcer-plugin:1.4.1:enforce (enforce-maven-version) @ org.eclipse.tracecompass.analysis.os.linux.ui.tests ---
10:55:34 [INFO] 
10:55:34 [INFO] --- jacoco-maven-plugin:0.7.9:prepare-agent (pre-test) @ org.eclipse.tracecompass.analysis.os.linux.ui.tests ---
10:55:34 [INFO] tycho.testArgLine set to -javaagent:/home/hudson/genie.tracecompass/.jenkins/jobs/tracecompass-stable-nightly/workspace/.repository/org/jacoco/org.jacoco.agent/0.7.9/org.jacoco.agent-0.7.9-runtime.jar=destfile=/jobs/genie.tracecompass/tracecompass-stable-nightly/workspace/analysis/org.eclipse.tracecompass.analysis.os.linux.ui.tests/../../target/jacoco.exec,append=true,includes=org.eclipse.tracecompass.*
10:55:34 [INFO] 
10:55:34 [INFO] --- maven-resources-plugin:3.0.2:resources (default-resources) @ org.eclipse.tracecompass.analysis.os.linux.ui.tests ---
10:55:34 [INFO] Using 'UTF-8' encoding to copy filtered resources.
10:55:34 [INFO] skip non existing resourceDirectory /jobs/genie.tracecompass/tracecompass-stable-nightly/workspace/analysis/org.eclipse.tracecompass.analysis.os.linux.ui.tests/src/main/resources
10:55:34 [INFO] 
10:55:34 [INFO] --- tycho-compiler-plugin:1.0.0:compile (default-compile) @ org.eclipse.tracecompass.analysis.os.linux.ui.tests ---
10:55:34 [INFO] Compiling 2 source files to /jobs/genie.tracecompass/tracecompass-stable-nightly/workspace/analysis/org.eclipse.tracecompass.analysis.os.linux.ui.tests/target/classes
10:55:35 [INFO] 
10:55:35 [INFO] --- maven-resources-plugin:3.0.2:testResources (default-testResources) @ org.eclipse.tracecompass.analysis.os.linux.ui.tests ---
10:55:35 [INFO] Using 'UTF-8' encoding to copy filtered resources.
10:55:35 [INFO] skip non existing resourceDirectory /jobs/genie.tracecompass/tracecompass-stable-nightly/workspace/analysis/org.eclipse.tracecompass.analysis.os.linux.ui.tests/src/test/resources
10:55:35 [INFO] 
10:55:35 [INFO] --- tycho-source-plugin:1.0.0:plugin-source (plugin-source) @ org.eclipse.tracecompass.analysis.os.linux.ui.tests ---
10:55:35 [INFO] Building jar: /jobs/genie.tracecompass/tracecompass-stable-nightly/workspace/analysis/org.eclipse.tracecompass.analysis.os.linux.ui.tests/target/org.eclipse.tracecompass.analysis.os.linux.ui.tests-1.0.3-SNAPSHOT-sources.jar
10:55:35 [INFO] 
10:55:35 [INFO] --- target-platform-configuration:1.0.0:target-platform (default-target-platform) @ org.eclipse.tracecompass.analysis.os.linux.ui.tests ---
10:55:35 [INFO] 
10:55:35 [INFO] --- tycho-packaging-plugin:1.0.0:package-plugin (default-package-plugin) @ org.eclipse.tracecompass.analysis.os.linux.ui.tests ---
10:55:35 [INFO] Building jar: /jobs/genie.tracecompass/tracecompass-stable-nightly/workspace/analysis/org.eclipse.tracecompass.analysis.os.linux.ui.tests/target/org.eclipse.tracecompass.analysis.os.linux.ui.tests-1.0.3-SNAPSHOT.jar
10:55:35 [INFO] 
10:55:35 [INFO] --- tycho-p2-plugin:1.0.0:p2-metadata-default (default-p2-metadata-default) @ org.eclipse.tracecompass.analysis.os.linux.ui.tests ---
10:55:35 [INFO] 
10:55:35 [INFO] --- tycho-source-feature-plugin:1.0.0:source-feature (source-feature) @ org.eclipse.tracecompass.analysis.os.linux.ui.tests ---
10:55:35 [INFO] 
10:55:35 [INFO] --- tycho-pack200a-plugin:1.0.0:normalize (pack200-normalize) @ org.eclipse.tracecompass.analysis.os.linux.ui.tests ---
10:55:35 [INFO] Pack200 normalizing jar /jobs/genie.tracecompass/tracecompass-stable-nightly/workspace/analysis/org.eclipse.tracecompass.analysis.os.linux.ui.tests/target/org.eclipse.tracecompass.analysis.os.linux.ui.tests-1.0.3-SNAPSHOT.jar
10:55:35 [INFO] 
10:55:35 [INFO] --- eclipse-jarsigner-plugin:1.1.3:sign (sign) @ org.eclipse.tracecompass.analysis.os.linux.ui.tests ---
10:55:35 [INFO] Signing jar: /jobs/genie.tracecompass/tracecompass-stable-nightly/workspace/analysis/org.eclipse.tracecompass.analysis.os.linux.ui.tests/target/org.eclipse.tracecompass.analysis.os.linux.ui.tests-1.0.3-SNAPSHOT.jar
10:55:36 [INFO] Signing jar: /jobs/genie.tracecompass/tracecompass-stable-nightly/workspace/analysis/org.eclipse.tracecompass.analysis.os.linux.ui.tests/target/org.eclipse.tracecompass.analysis.os.linux.ui.tests-1.0.3-SNAPSHOT-sources.jar
10:55:37 [INFO] 
10:55:37 [INFO] --- tycho-pack200b-plugin:1.0.0:pack (pack200-pack) @ org.eclipse.tracecompass.analysis.os.linux.ui.tests ---
10:55:37 [INFO] Pack200 packing jar /jobs/genie.tracecompass/tracecompass-stable-nightly/workspace/analysis/org.eclipse.tracecompass.analysis.os.linux.ui.tests/target/org.eclipse.tracecompass.analysis.os.linux.ui.tests-1.0.3-SNAPSHOT.jar
10:55:37 [INFO] 
10:55:37 [INFO] --- tycho-p2-plugin:1.0.0:p2-metadata (p2-metadata) @ org.eclipse.tracecompass.analysis.os.linux.ui.tests ---
10:55:37 [INFO] 
10:55:37 [INFO] --- tycho-surefire-plugin:1.0.0:test (default-test) @ org.eclipse.tracecompass.analysis.os.linux.ui.tests ---
10:55:37 [INFO] Expected eclipse log file: /jobs/genie.tracecompass/tracecompass-stable-nightly/workspace/analysis/org.eclipse.tracecompass.analysis.os.linux.ui.tests/target/work/data/.metadata/.log
10:55:37 [INFO] Command line:
10:55:37 	[/opt/public/common/java/oracle/jdk1.8.0_162_x64/jre/bin/java, -Dosgi.noShutdown=false, -Dosgi.os=linux, -Dosgi.ws=gtk, -Dosgi.arch=x86_64, -javaagent:/home/hudson/genie.tracecompass/.jenkins/jobs/tracecompass-stable-nightly/workspace/.repository/org/jacoco/org.jacoco.agent/0.7.9/org.jacoco.agent-0.7.9-runtime.jar=destfile=/jobs/genie.tracecompass/tracecompass-stable-nightly/workspace/analysis/org.eclipse.tracecompass.analysis.os.linux.ui.tests/../../target/jacoco.exec,append=true,includes=org.eclipse.tracecompass.*, -Dorg.eclipse.swt.browser.DefaultType=mozilla, -Xms512m, -Xmx1024m, -Dosgi.clean=true, -jar, /jobs/genie.tracecompass/tracecompass-stable-nightly/workspace/.repository/p2/osgi/bundle/org.eclipse.equinox.launcher/1.4.0.v20161219-1356/org.eclipse.equinox.launcher-1.4.0.v20161219-1356.jar, -data, /jobs/genie.tracecompass/tracecompass-stable-nightly/workspace/analysis/org.eclipse.tracecompass.analysis.os.linux.ui.tests/target/work/data, -install, /jobs/genie.tracecompass/tracecompass-stable-nightly/workspace/analysis/org.eclipse.tracecompass.analysis.os.linux.ui.tests/target/work, -configuration, /jobs/genie.tracecompass/tracecompass-stable-nightly/workspace/analysis/org.eclipse.tracecompass.analysis.os.linux.ui.tests/target/work/configuration, -application, org.eclipse.tycho.surefire.osgibooter.uitest, -testproperties, /jobs/genie.tracecompass/tracecompass-stable-nightly/workspace/analysis/org.eclipse.tracecompass.analysis.os.linux.ui.tests/target/surefire.properties, -product, org.eclipse.platform.ide, -consoleLog]
10:55:45 !SESSION 2018-01-31 10:55:37.843 -----------------------------------------------
10:55:45 eclipse.buildId=unknown
10:55:45 java.version=1.8.0_162
10:55:45 java.vendor=Oracle Corporation
10:55:45 BootLoader constants: OS=linux, ARCH=x86_64, WS=gtk, NL=en_US
10:55:45 Framework arguments:  -application org.eclipse.tycho.surefire.osgibooter.uitest -testproperties /jobs/genie.tracecompass/tracecompass-stable-nightly/workspace/analysis/org.eclipse.tracecompass.analysis.os.linux.ui.tests/target/surefire.properties -product org.eclipse.platform.ide
10:55:45 Command-line arguments:  -data /jobs/genie.tracecompass/tracecompass-stable-nightly/workspace/analysis/org.eclipse.tracecompass.analysis.os.linux.ui.tests/target/work/data -application org.eclipse.tycho.surefire.osgibooter.uitest -testproperties /jobs/genie.tracecompass/tracecompass-stable-nightly/workspace/analysis/org.eclipse.tracecompass.analysis.os.linux.ui.tests/target/surefire.properties -product org.eclipse.platform.ide -consoleLog
10:55:45 
10:55:45 !ENTRY org.eclipse.compare.win32 4 0 2018-01-31 10:55:45.106
10:55:45 !MESSAGE FrameworkEvent ERROR
10:55:45 !STACK 0
10:55:45 org.osgi.framework.BundleException: Could not resolve module: org.eclipse.compare.win32 [56]
10:55:45   Unresolved requirement: Require-Capability: eclipse.platform; filter:="(osgi.os=win32)"
10:55:45 
10:55:45 	at org.eclipse.osgi.container.Module.start(Module.java:444)
10:55:45 	at org.eclipse.osgi.container.ModuleContainer$ContainerStartLevel.incStartLevel(ModuleContainer.java:1634)
10:55:45 	at org.eclipse.osgi.container.ModuleContainer$ContainerStartLevel.incStartLevel(ModuleContainer.java:1613)
10:55:45 	at org.eclipse.osgi.container.ModuleContainer$ContainerStartLevel.doContainerStartLevel(ModuleContainer.java:1585)
10:55:45 	at org.eclipse.osgi.container.ModuleContainer$ContainerStartLevel.dispatchEvent(ModuleContainer.java:1528)
10:55:45 	at org.eclipse.osgi.container.ModuleContainer$ContainerStartLevel.dispatchEvent(ModuleContainer.java:1)
10:55:45 	at org.eclipse.osgi.framework.eventmgr.EventManager.dispatchEvent(EventManager.java:230)
10:55:45 	at org.eclipse.osgi.framework.eventmgr.EventManager$EventThread.run(EventManager.java:340)
10:55:52 
10:55:52 -------------------------------------------------------
10:55:52  T E S T S
10:55:52 -------------------------------------------------------
10:55:52 Running org.eclipse.tracecompass.analysis.os.linux.ui.tests.view.controlflow.ControlFlowEntryComparatorTest
10:55:53 Tests run: 12, Failures: 0, Errors: 0, Skipped: 0, Time elapsed: 0.934 sec - in org.eclipse.tracecompass.analysis.os.linux.ui.tests.view.controlflow.ControlFlowEntryComparatorTest
10:55:53 tidColumnComparatorTest(org.eclipse.tracecompass.analysis.os.linux.ui.tests.view.controlflow.ControlFlowEntryComparatorTest)  Time elapsed: 0.012 sec
10:55:53 tidSecondaryTimeColumnComparatorTest(org.eclipse.tracecompass.analysis.os.linux.ui.tests.view.controlflow.ControlFlowEntryComparatorTest)  Time elapsed: 0 sec
10:55:53 execNameColumnComparatorTest(org.eclipse.tracecompass.analysis.os.linux.ui.tests.view.controlflow.ControlFlowEntryComparatorTest)  Time elapsed: 0.001 sec
10:55:53 ptidComparatorTest(org.eclipse.tracecompass.analysis.os.linux.ui.tests.view.controlflow.ControlFlowEntryComparatorTest)  Time elapsed: 0 sec
10:55:53 tidComparatorTest(org.eclipse.tracecompass.analysis.os.linux.ui.tests.view.controlflow.ControlFlowEntryComparatorTest)  Time elapsed: 0 sec
10:55:53 ptidColumnComparatorTest(org.eclipse.tracecompass.analysis.os.linux.ui.tests.view.controlflow.ControlFlowEntryComparatorTest)  Time elapsed: 0 sec
10:55:53 birthTimeColumnComparatorTest(org.eclipse.tracecompass.analysis.os.linux.ui.tests.view.controlflow.ControlFlowEntryComparatorTest)  Time elapsed: 0 sec
10:55:53 birthTimeSecondaryTimeColumnComparatorTest(org.eclipse.tracecompass.analysis.os.linux.ui.tests.view.controlflow.ControlFlowEntryComparatorTest)  Time elapsed: 0 sec
10:55:53 execNameSecondaryTimeColumnComparatorTest(org.eclipse.tracecompass.analysis.os.linux.ui.tests.view.controlflow.ControlFlowEntryComparatorTest)  Time elapsed: 0.001 sec
10:55:53 ptidSecondaryTimeColumnComparatorTest(org.eclipse.tracecompass.analysis.os.linux.ui.tests.view.controlflow.ControlFlowEntryComparatorTest)  Time elapsed: 0 sec
10:55:53 birthTimeComparatorTest(org.eclipse.tracecompass.analysis.os.linux.ui.tests.view.controlflow.ControlFlowEntryComparatorTest)  Time elapsed: 0 sec
10:55:53 execNameComparatorTest(org.eclipse.tracecompass.analysis.os.linux.ui.tests.view.controlflow.ControlFlowEntryComparatorTest)  Time elapsed: 0 sec
10:55:53 Running org.eclipse.tracecompass.analysis.os.linux.ui.tests.view.controlflow.ControlFlowOptimizerTest
10:55:53 Tests run: 9, Failures: 0, Errors: 0, Skipped: 0, Time elapsed: 0.152 sec - in org.eclipse.tracecompass.analysis.os.linux.ui.tests.view.controlflow.ControlFlowOptimizerTest
10:55:53 testEmpty(org.eclipse.tracecompass.analysis.os.linux.ui.tests.view.controlflow.ControlFlowOptimizerTest)  Time elapsed: 0.006 sec
10:55:53 testMany(org.eclipse.tracecompass.analysis.os.linux.ui.tests.view.controlflow.ControlFlowOptimizerTest)  Time elapsed: 0.138 sec
10:55:53 testDoubleOtherOrder(org.eclipse.tracecompass.analysis.os.linux.ui.tests.view.controlflow.ControlFlowOptimizerTest)  Time elapsed: 0.001 sec
10:55:53 test9OutOfOrder(org.eclipse.tracecompass.analysis.os.linux.ui.tests.view.controlflow.ControlFlowOptimizerTest)  Time elapsed: 0.001 sec
10:55:53 test9InOrder(org.eclipse.tracecompass.analysis.os.linux.ui.tests.view.controlflow.ControlFlowOptimizerTest)  Time elapsed: 0 sec
10:55:53 testDouble(org.eclipse.tracecompass.analysis.os.linux.ui.tests.view.controlflow.ControlFlowOptimizerTest)  Time elapsed: 0 sec
10:55:53 testSingleInvalid(org.eclipse.tracecompass.analysis.os.linux.ui.tests.view.controlflow.ControlFlowOptimizerTest)  Time elapsed: 0 sec
10:55:53 testSingle(org.eclipse.tracecompass.analysis.os.linux.ui.tests.view.controlflow.ControlFlowOptimizerTest)  Time elapsed: 0.001 sec
10:55:53 test9InOrder10Times(org.eclipse.tracecompass.analysis.os.linux.ui.tests.view.controlflow.ControlFlowOptimizerTest)  Time elapsed: 0.001 sec
10:55:53 
10:55:53 Results :
10:55:53 
10:55:53 Tests run: 21, Failures: 0, Errors: 0, Skipped: 0
10:55:53 
10:55:55 [INFO] All tests passed!
10:55:55 [INFO] 
10:55:55 [INFO] --- jacoco-maven-plugin:0.7.9:report (post-test) @ org.eclipse.tracecompass.analysis.os.linux.ui.tests ---
10:55:55 [INFO] Loading execution data file /jobs/genie.tracecompass/tracecompass-stable-nightly/workspace/analysis/org.eclipse.tracecompass.analysis.os.linux.ui.tests/../../target/jacoco.exec
10:55:55 [INFO] Analyzed bundle 'org.eclipse.tracecompass.analysis.os.linux.ui.tests' with 2 classes
10:55:55 [INFO] 
10:55:55 [INFO] --- maven-install-plugin:2.5.2:install (default-install) @ org.eclipse.tracecompass.analysis.os.linux.ui.tests ---
10:55:55 [INFO] Installing /jobs/genie.tracecompass/tracecompass-stable-nightly/workspace/analysis/org.eclipse.tracecompass.analysis.os.linux.ui.tests/target/org.eclipse.tracecompass.analysis.os.linux.ui.tests-1.0.3-SNAPSHOT.jar to /home/hudson/genie.tracecompass/.jenkins/jobs/tracecompass-stable-nightly/workspace/.repository/org/eclipse/tracecompass/org.eclipse.tracecompass.analysis.os.linux.ui.tests/1.0.3-SNAPSHOT/org.eclipse.tracecompass.analysis.os.linux.ui.tests-1.0.3-SNAPSHOT.jar
10:55:55 [INFO] Installing /jobs/genie.tracecompass/tracecompass-stable-nightly/workspace/analysis/org.eclipse.tracecompass.analysis.os.linux.ui.tests/.polyglot.build.properties to /home/hudson/genie.tracecompass/.jenkins/jobs/tracecompass-stable-nightly/workspace/.repository/org/eclipse/tracecompass/org.eclipse.tracecompass.analysis.os.linux.ui.tests/1.0.3-SNAPSHOT/org.eclipse.tracecompass.analysis.os.linux.ui.tests-1.0.3-SNAPSHOT.pom
10:55:55 [INFO] Installing /jobs/genie.tracecompass/tracecompass-stable-nightly/workspace/analysis/org.eclipse.tracecompass.analysis.os.linux.ui.tests/target/org.eclipse.tracecompass.analysis.os.linux.ui.tests-1.0.3-SNAPSHOT-sources.jar to /home/hudson/genie.tracecompass/.jenkins/jobs/tracecompass-stable-nightly/workspace/.repository/org/eclipse/tracecompass/org.eclipse.tracecompass.analysis.os.linux.ui.tests/1.0.3-SNAPSHOT/org.eclipse.tracecompass.analysis.os.linux.ui.tests-1.0.3-SNAPSHOT-sources.jar
10:55:55 [INFO] Installing /jobs/genie.tracecompass/tracecompass-stable-nightly/workspace/analysis/org.eclipse.tracecompass.analysis.os.linux.ui.tests/target/org.eclipse.tracecompass.analysis.os.linux.ui.tests-1.0.3-SNAPSHOT.jar.pack.gz to /home/hudson/genie.tracecompass/.jenkins/jobs/tracecompass-stable-nightly/workspace/.repository/org/eclipse/tracecompass/org.eclipse.tracecompass.analysis.os.linux.ui.tests/1.0.3-SNAPSHOT/org.eclipse.tracecompass.analysis.os.linux.ui.tests-1.0.3-SNAPSHOT-pack200.jar.pack.gz
10:55:55 [INFO] Installing /jobs/genie.tracecompass/tracecompass-stable-nightly/workspace/analysis/org.eclipse.tracecompass.analysis.os.linux.ui.tests/target/p2content.xml to /home/hudson/genie.tracecompass/.jenkins/jobs/tracecompass-stable-nightly/workspace/.repository/org/eclipse/tracecompass/org.eclipse.tracecompass.analysis.os.linux.ui.tests/1.0.3-SNAPSHOT/org.eclipse.tracecompass.analysis.os.linux.ui.tests-1.0.3-SNAPSHOT-p2metadata.xml
10:55:55 [INFO] Installing /jobs/genie.tracecompass/tracecompass-stable-nightly/workspace/analysis/org.eclipse.tracecompass.analysis.os.linux.ui.tests/target/p2artifacts.xml to /home/hudson/genie.tracecompass/.jenkins/jobs/tracecompass-stable-nightly/workspace/.repository/org/eclipse/tracecompass/org.eclipse.tracecompass.analysis.os.linux.ui.tests/1.0.3-SNAPSHOT/org.eclipse.tracecompass.analysis.os.linux.ui.tests-1.0.3-SNAPSHOT-p2artifacts.xml
10:55:55 [INFO] 
10:55:55 [INFO] --- tycho-p2-plugin:1.0.0:update-local-index (default-update-local-index) @ org.eclipse.tracecompass.analysis.os.linux.ui.tests ---
10:55:55 [INFO] 
10:55:55 [INFO] ------------------------------------------------------------------------
10:55:55 [INFO] Building org.eclipse.tracecompass.analysis.timing.core.tests 1.0.2-SNAPSHOT
10:55:55 [INFO] ------------------------------------------------------------------------
10:55:55 [INFO] 
10:55:55 [INFO] --- maven-clean-plugin:3.0.0:clean (default-clean) @ org.eclipse.tracecompass.analysis.timing.core.tests ---
10:55:55 [INFO] Deleting /jobs/genie.tracecompass/tracecompass-stable-nightly/workspace/analysis/org.eclipse.tracecompass.analysis.timing.core.tests/target
10:55:55 [INFO] 
10:55:55 [INFO] --- tycho-packaging-plugin:1.0.0:build-qualifier (default-build-qualifier) @ org.eclipse.tracecompass.analysis.timing.core.tests ---
10:55:55 [INFO] The project's OSGi version is 1.0.2.201801311519
10:55:55 [INFO] 
10:55:55 [INFO] --- tycho-packaging-plugin:1.0.0:validate-id (default-validate-id) @ org.eclipse.tracecompass.analysis.timing.core.tests ---
10:55:55 [INFO] 
10:55:55 [INFO] --- tycho-packaging-plugin:1.0.0:validate-version (default-validate-version) @ org.eclipse.tracecompass.analysis.timing.core.tests ---
10:55:55 [INFO] 
10:55:55 [INFO] --- maven-enforcer-plugin:1.4.1:enforce (enforce-maven-version) @ org.eclipse.tracecompass.analysis.timing.core.tests ---
10:55:55 [INFO] 
10:55:55 [INFO] --- jacoco-maven-plugin:0.7.9:prepare-agent (pre-test) @ org.eclipse.tracecompass.analysis.timing.core.tests ---
10:55:55 [INFO] tycho.testArgLine set to -javaagent:/home/hudson/genie.tracecompass/.jenkins/jobs/tracecompass-stable-nightly/workspace/.repository/org/jacoco/org.jacoco.agent/0.7.9/org.jacoco.agent-0.7.9-runtime.jar=destfile=/jobs/genie.tracecompass/tracecompass-stable-nightly/workspace/analysis/org.eclipse.tracecompass.analysis.timing.core.tests/../../target/jacoco.exec,append=true,includes=org.eclipse.tracecompass.*
10:55:55 [INFO] 
10:55:55 [INFO] --- maven-resources-plugin:3.0.2:resources (default-resources) @ org.eclipse.tracecompass.analysis.timing.core.tests ---
10:55:55 [INFO] Using 'UTF-8' encoding to copy filtered resources.
10:55:55 [INFO] skip non existing resourceDirectory /jobs/genie.tracecompass/tracecompass-stable-nightly/workspace/analysis/org.eclipse.tracecompass.analysis.timing.core.tests/src/main/resources
10:55:55 [INFO] 
10:55:55 [INFO] --- tycho-compiler-plugin:1.0.0:compile (default-compile) @ org.eclipse.tracecompass.analysis.timing.core.tests ---
10:55:55 [INFO] Compiling 13 source files to /jobs/genie.tracecompass/tracecompass-stable-nightly/workspace/analysis/org.eclipse.tracecompass.analysis.timing.core.tests/target/classes
10:55:56 [WARNING] /jobs/genie.tracecompass/tracecompass-stable-nightly/workspace/analysis/org.eclipse.tracecompass.analysis.timing.core.tests/src/org/eclipse/tracecompass/analysis/timing/core/tests/statistics/OfflineStatisticsCalculator.java:[84] 
10:55:56 	Long value = fMapper.apply(element);
10:55:56 	             ^^^^^^^^^^^^^^^^^^^^^^
10:55:56 Unsafe interpretation of method return type as '@NonNull' based on the receiver type '@NonNull Function<@NonNull E,@NonNull Long>'. Type 'Function<T,R>' doesn't seem to be designed with null type annotations in mind
10:55:56 [WARNING] /jobs/genie.tracecompass/tracecompass-stable-nightly/workspace/analysis/org.eclipse.tracecompass.analysis.timing.core.tests/src/org/eclipse/tracecompass/analysis/timing/core/tests/statistics/OfflineStatisticsCalculator.java:[85] 
10:55:56 	if (value <= fMapper.apply(obj)) {
10:55:56 	             ^^^^^^^^^^^^^^^^^^
10:55:56 Unsafe interpretation of method return type as '@NonNull' based on the receiver type '@NonNull Function<@NonNull E,@NonNull Long>'. Type 'Function<T,R>' doesn't seem to be designed with null type annotations in mind
10:55:56 [WARNING] /jobs/genie.tracecompass/tracecompass-stable-nightly/workspace/analysis/org.eclipse.tracecompass.analysis.timing.core.tests/src/org/eclipse/tracecompass/analysis/timing/core/tests/statistics/OfflineStatisticsCalculator.java:[103] 
10:55:56 	Long value = fMapper.apply(element);
10:55:56 	             ^^^^^^^^^^^^^^^^^^^^^^
10:55:56 Unsafe interpretation of method return type as '@NonNull' based on the receiver type '@NonNull Function<@NonNull E,@NonNull Long>'. Type 'Function<T,R>' doesn't seem to be designed with null type annotations in mind
10:55:56 [WARNING] /jobs/genie.tracecompass/tracecompass-stable-nightly/workspace/analysis/org.eclipse.tracecompass.analysis.timing.core.tests/src/org/eclipse/tracecompass/analysis/timing/core/tests/statistics/OfflineStatisticsCalculator.java:[104] 
10:55:56 	if (value >= fMapper.apply(obj)) {
10:55:56 	             ^^^^^^^^^^^^^^^^^^
10:55:56 Unsafe interpretation of method return type as '@NonNull' based on the receiver type '@NonNull Function<@NonNull E,@NonNull Long>'. Type 'Function<T,R>' doesn't seem to be designed with null type annotations in mind
10:55:56 [WARNING] /jobs/genie.tracecompass/tracecompass-stable-nightly/workspace/analysis/org.eclipse.tracecompass.analysis.timing.core.tests/src/org/eclipse/tracecompass/analysis/timing/core/tests/statistics/AbstractStatisticsTest.java:[366] 
10:55:56 	Statistics<E>::update, Statistics<E>::merge);
10:55:56 	                       ^^^^^^^^^^^^^^^^^^^^
10:55:56 Null type safety: parameter 1 provided via method descriptor BiConsumer<Statistics<E>,Statistics<E>>.accept(Statistics<E>, Statistics<E>) needs unchecked conversion to conform to '@NonNull IStatistics<@NonNull E>'
10:55:56 [WARNING] /jobs/genie.tracecompass/tracecompass-stable-nightly/workspace/analysis/org.eclipse.tracecompass.analysis.timing.core.tests/src/org/eclipse/tracecompass/analysis/timing/core/tests/statistics/AbstractStatisticsTest.java:[384] 
10:55:56 	Statistics<E>::update, Statistics<E>::merge);
10:55:56 	                       ^^^^^^^^^^^^^^^^^^^^
10:55:56 Null type safety: parameter 1 provided via method descriptor BiConsumer<Statistics<E>,Statistics<E>>.accept(Statistics<E>, Statistics<E>) needs unchecked conversion to conform to '@NonNull IStatistics<@NonNull E>'
10:55:56 6 problems (6 warnings)
10:55:56 [INFO] 
10:55:56 [INFO] --- maven-resources-plugin:3.0.2:testResources (default-testResources) @ org.eclipse.tracecompass.analysis.timing.core.tests ---
10:55:56 [INFO] Using 'UTF-8' encoding to copy filtered resources.
10:55:56 [INFO] skip non existing resourceDirectory /jobs/genie.tracecompass/tracecompass-stable-nightly/workspace/analysis/org.eclipse.tracecompass.analysis.timing.core.tests/src/test/resources
10:55:56 [INFO] 
10:55:56 [INFO] --- tycho-source-plugin:1.0.0:plugin-source (plugin-source) @ org.eclipse.tracecompass.analysis.timing.core.tests ---
10:55:56 [INFO] Building jar: /jobs/genie.tracecompass/tracecompass-stable-nightly/workspace/analysis/org.eclipse.tracecompass.analysis.timing.core.tests/target/org.eclipse.tracecompass.analysis.timing.core.tests-1.0.2-SNAPSHOT-sources.jar
10:55:56 [INFO] 
10:55:56 [INFO] --- target-platform-configuration:1.0.0:target-platform (default-target-platform) @ org.eclipse.tracecompass.analysis.timing.core.tests ---
10:55:56 [INFO] 
10:55:56 [INFO] --- tycho-packaging-plugin:1.0.0:package-plugin (default-package-plugin) @ org.eclipse.tracecompass.analysis.timing.core.tests ---
10:55:56 [INFO] Building jar: /jobs/genie.tracecompass/tracecompass-stable-nightly/workspace/analysis/org.eclipse.tracecompass.analysis.timing.core.tests/target/org.eclipse.tracecompass.analysis.timing.core.tests-1.0.2-SNAPSHOT.jar
10:55:56 [INFO] 
10:55:56 [INFO] --- tycho-p2-plugin:1.0.0:p2-metadata-default (default-p2-metadata-default) @ org.eclipse.tracecompass.analysis.timing.core.tests ---
10:55:56 [INFO] 
10:55:56 [INFO] --- tycho-source-feature-plugin:1.0.0:source-feature (source-feature) @ org.eclipse.tracecompass.analysis.timing.core.tests ---
10:55:56 [INFO] 
10:55:56 [INFO] --- tycho-pack200a-plugin:1.0.0:normalize (pack200-normalize) @ org.eclipse.tracecompass.analysis.timing.core.tests ---
10:55:56 [INFO] Pack200 normalizing jar /jobs/genie.tracecompass/tracecompass-stable-nightly/workspace/analysis/org.eclipse.tracecompass.analysis.timing.core.tests/target/org.eclipse.tracecompass.analysis.timing.core.tests-1.0.2-SNAPSHOT.jar
10:55:56 [INFO] 
10:55:56 [INFO] --- eclipse-jarsigner-plugin:1.1.3:sign (sign) @ org.eclipse.tracecompass.analysis.timing.core.tests ---
10:55:56 [INFO] Signing jar: /jobs/genie.tracecompass/tracecompass-stable-nightly/workspace/analysis/org.eclipse.tracecompass.analysis.timing.core.tests/target/org.eclipse.tracecompass.analysis.timing.core.tests-1.0.2-SNAPSHOT.jar
10:55:57 [INFO] Signing jar: /jobs/genie.tracecompass/tracecompass-stable-nightly/workspace/analysis/org.eclipse.tracecompass.analysis.timing.core.tests/target/org.eclipse.tracecompass.analysis.timing.core.tests-1.0.2-SNAPSHOT-sources.jar
10:55:57 [INFO] 
10:55:57 [INFO] --- tycho-pack200b-plugin:1.0.0:pack (pack200-pack) @ org.eclipse.tracecompass.analysis.timing.core.tests ---
10:55:57 [INFO] Pack200 packing jar /jobs/genie.tracecompass/tracecompass-stable-nightly/workspace/analysis/org.eclipse.tracecompass.analysis.timing.core.tests/target/org.eclipse.tracecompass.analysis.timing.core.tests-1.0.2-SNAPSHOT.jar
10:55:57 [INFO] 
10:55:57 [INFO] --- tycho-p2-plugin:1.0.0:p2-metadata (p2-metadata) @ org.eclipse.tracecompass.analysis.timing.core.tests ---
10:55:57 [INFO] 
10:55:57 [INFO] --- tycho-surefire-plugin:1.0.0:test (default-test) @ org.eclipse.tracecompass.analysis.timing.core.tests ---
10:55:58 [INFO] Expected eclipse log file: /jobs/genie.tracecompass/tracecompass-stable-nightly/workspace/analysis/org.eclipse.tracecompass.analysis.timing.core.tests/target/work/data/.metadata/.log
10:55:58 [INFO] Command line:
10:55:58 	[/opt/public/common/java/oracle/jdk1.8.0_162_x64/jre/bin/java, -Dosgi.noShutdown=false, -Dosgi.os=linux, -Dosgi.ws=gtk, -Dosgi.arch=x86_64, -javaagent:/home/hudson/genie.tracecompass/.jenkins/jobs/tracecompass-stable-nightly/workspace/.repository/org/jacoco/org.jacoco.agent/0.7.9/org.jacoco.agent-0.7.9-runtime.jar=destfile=/jobs/genie.tracecompass/tracecompass-stable-nightly/workspace/analysis/org.eclipse.tracecompass.analysis.timing.core.tests/../../target/jacoco.exec,append=true,includes=org.eclipse.tracecompass.*, -Dorg.eclipse.swt.browser.DefaultType=mozilla, -Xms512m, -Xmx1024m, -Dosgi.clean=true, -jar, /jobs/genie.tracecompass/tracecompass-stable-nightly/workspace/.repository/p2/osgi/bundle/org.eclipse.equinox.launcher/1.4.0.v20161219-1356/org.eclipse.equinox.launcher-1.4.0.v20161219-1356.jar, -data, /jobs/genie.tracecompass/tracecompass-stable-nightly/workspace/analysis/org.eclipse.tracecompass.analysis.timing.core.tests/target/work/data, -install, /jobs/genie.tracecompass/tracecompass-stable-nightly/workspace/analysis/org.eclipse.tracecompass.analysis.timing.core.tests/target/work, -configuration, /jobs/genie.tracecompass/tracecompass-stable-nightly/workspace/analysis/org.eclipse.tracecompass.analysis.timing.core.tests/target/work/configuration, -application, org.eclipse.tycho.surefire.osgibooter.headlesstest, -testproperties, /jobs/genie.tracecompass/tracecompass-stable-nightly/workspace/analysis/org.eclipse.tracecompass.analysis.timing.core.tests/target/surefire.properties, -product, org.eclipse.platform.ide, -consoleLog]
10:56:04 !SESSION 2018-01-31 10:55:58.647 -----------------------------------------------
10:56:04 eclipse.buildId=unknown
10:56:04 java.version=1.8.0_162
10:56:04 java.vendor=Oracle Corporation
10:56:04 BootLoader constants: OS=linux, ARCH=x86_64, WS=gtk, NL=en_US
10:56:04 Framework arguments:  -application org.eclipse.tycho.surefire.osgibooter.headlesstest -testproperties /jobs/genie.tracecompass/tracecompass-stable-nightly/workspace/analysis/org.eclipse.tracecompass.analysis.timing.core.tests/target/surefire.properties -product org.eclipse.platform.ide
10:56:04 Command-line arguments:  -data /jobs/genie.tracecompass/tracecompass-stable-nightly/workspace/analysis/org.eclipse.tracecompass.analysis.timing.core.tests/target/work/data -application org.eclipse.tycho.surefire.osgibooter.headlesstest -testproperties /jobs/genie.tracecompass/tracecompass-stable-nightly/workspace/analysis/org.eclipse.tracecompass.analysis.timing.core.tests/target/surefire.properties -product org.eclipse.platform.ide -consoleLog
10:56:04 
10:56:04 !ENTRY org.eclipse.compare.win32 4 0 2018-01-31 10:56:04.626
10:56:04 !MESSAGE FrameworkEvent ERROR
10:56:04 !STACK 0
10:56:04 org.osgi.framework.BundleException: Could not resolve module: org.eclipse.compare.win32 [51]
10:56:04   Unresolved requirement: Require-Capability: eclipse.platform; filter:="(osgi.os=win32)"
10:56:04 
10:56:04 	at org.eclipse.osgi.container.Module.start(Module.java:444)
10:56:04 	at org.eclipse.osgi.container.ModuleContainer$ContainerStartLevel.incStartLevel(ModuleContainer.java:1634)
10:56:04 	at org.eclipse.osgi.container.ModuleContainer$ContainerStartLevel.incStartLevel(ModuleContainer.java:1613)
10:56:04 	at org.eclipse.osgi.container.ModuleContainer$ContainerStartLevel.doContainerStartLevel(ModuleContainer.java:1585)
10:56:04 	at org.eclipse.osgi.container.ModuleContainer$ContainerStartLevel.dispatchEvent(ModuleContainer.java:1528)
10:56:04 	at org.eclipse.osgi.container.ModuleContainer$ContainerStartLevel.dispatchEvent(ModuleContainer.java:1)
10:56:04 	at org.eclipse.osgi.framework.eventmgr.EventManager.dispatchEvent(EventManager.java:230)
10:56:04 	at org.eclipse.osgi.framework.eventmgr.EventManager$EventThread.run(EventManager.java:340)
10:56:05 
10:56:05 -------------------------------------------------------
10:56:05  T E S T S
10:56:05 -------------------------------------------------------
10:56:05 Running org.eclipse.tracecompass.analysis.timing.core.tests.segmentstore.statistics.SegmentStoreStatisticsTest
10:56:08 Tests run: 15, Failures: 0, Errors: 0, Skipped: 0, Time elapsed: 2.743 sec - in org.eclipse.tracecompass.analysis.timing.core.tests.segmentstore.statistics.SegmentStoreStatisticsTest
10:56:08 testDescending(org.eclipse.tracecompass.analysis.timing.core.tests.segmentstore.statistics.SegmentStoreStatisticsTest)  Time elapsed: 0.021 sec
10:56:08 testMergeStatisticsNodes(org.eclipse.tracecompass.analysis.timing.core.tests.segmentstore.statistics.SegmentStoreStatisticsTest)  Time elapsed: 0.003 sec
10:56:08 parallelStreamBuildingTest(org.eclipse.tracecompass.analysis.timing.core.tests.segmentstore.statistics.SegmentStoreStatisticsTest)  Time elapsed: 0.439 sec
10:56:08 testNoiseDataset(org.eclipse.tracecompass.analysis.timing.core.tests.segmentstore.statistics.SegmentStoreStatisticsTest)  Time elapsed: 0.908 sec
10:56:08 streamBuildingTest(org.eclipse.tracecompass.analysis.timing.core.tests.segmentstore.statistics.SegmentStoreStatisticsTest)  Time elapsed: 0.18 sec
10:56:08 testEmpty(org.eclipse.tracecompass.analysis.timing.core.tests.segmentstore.statistics.SegmentStoreStatisticsTest)  Time elapsed: 0 sec
10:56:08 testSmallDataset(org.eclipse.tracecompass.analysis.timing.core.tests.segmentstore.statistics.SegmentStoreStatisticsTest)  Time elapsed: 0.001 sec
10:56:08 gaussianNoiseTest(org.eclipse.tracecompass.analysis.timing.core.tests.segmentstore.statistics.SegmentStoreStatisticsTest)  Time elapsed: 0.535 sec
10:56:08 testLargeDataset(org.eclipse.tracecompass.analysis.timing.core.tests.segmentstore.statistics.SegmentStoreStatisticsTest)  Time elapsed: 0.527 sec
10:56:08 testAscending(org.eclipse.tracecompass.analysis.timing.core.tests.segmentstore.statistics.SegmentStoreStatisticsTest)  Time elapsed: 0 sec
10:56:08 testLimitDataset(org.eclipse.tracecompass.analysis.timing.core.tests.segmentstore.statistics.SegmentStoreStatisticsTest)  Time elapsed: 0 sec
10:56:08 mergeStatisticsCornerCaseNodesTest(org.eclipse.tracecompass.analysis.timing.core.tests.segmentstore.statistics.SegmentStoreStatisticsTest)  Time elapsed: 0.007 sec
10:56:08 testMergeStatisticsRandomNodes(org.eclipse.tracecompass.analysis.timing.core.tests.segmentstore.statistics.SegmentStoreStatisticsTest)  Time elapsed: 0.004 sec
10:56:08 testLargeDatasetNegative(org.eclipse.tracecompass.analysis.timing.core.tests.segmentstore.statistics.SegmentStoreStatisticsTest)  Time elapsed: 0 sec
10:56:08 testLimitDataset2(org.eclipse.tracecompass.analysis.timing.core.tests.segmentstore.statistics.SegmentStoreStatisticsTest)  Time elapsed: 0 sec
10:56:08 Running org.eclipse.tracecompass.analysis.timing.core.tests.segmentstore.statistics.AbstractStatsAnalysisTest
10:56:09 Tests run: 8, Failures: 0, Errors: 0, Skipped: 0, Time elapsed: 0.499 sec - in org.eclipse.tracecompass.analysis.timing.core.tests.segmentstore.statistics.AbstractStatsAnalysisTest
10:56:09 testPartialPerTypeStatsCancel(org.eclipse.tracecompass.analysis.timing.core.tests.segmentstore.statistics.AbstractStatsAnalysisTest)  Time elapsed: 0.275 sec
10:56:09 testExecute(org.eclipse.tracecompass.analysis.timing.core.tests.segmentstore.statistics.AbstractStatsAnalysisTest)  Time elapsed: 0.037 sec
10:56:09 testExecuteNoDepend(org.eclipse.tracecompass.analysis.timing.core.tests.segmentstore.statistics.AbstractStatsAnalysisTest)  Time elapsed: 0.022 sec
10:56:09 testTotalStats(org.eclipse.tracecompass.analysis.timing.core.tests.segmentstore.statistics.AbstractStatsAnalysisTest)  Time elapsed: 0.048 sec
10:56:09 testPerTypeStats(org.eclipse.tracecompass.analysis.timing.core.tests.segmentstore.statistics.AbstractStatsAnalysisTest)  Time elapsed: 0.035 sec
10:56:09 testPartialPerTypeStats(org.eclipse.tracecompass.analysis.timing.core.tests.segmentstore.statistics.AbstractStatsAnalysisTest)  Time elapsed: 0.031 sec
10:56:09 testExecuteNoTrace(org.eclipse.tracecompass.analysis.timing.core.tests.segmentstore.statistics.AbstractStatsAnalysisTest)  Time elapsed: 0.014 sec
10:56:09 testPartialStats(org.eclipse.tracecompass.analysis.timing.core.tests.segmentstore.statistics.AbstractStatsAnalysisTest)  Time elapsed: 0.031 sec
10:56:09 Running org.eclipse.tracecompass.analysis.timing.core.tests.statistics.ObjectStatisticsTest
10:56:11 Tests run: 15, Failures: 0, Errors: 0, Skipped: 0, Time elapsed: 2.052 sec - in org.eclipse.tracecompass.analysis.timing.core.tests.statistics.ObjectStatisticsTest
10:56:11 testDescending(org.eclipse.tracecompass.analysis.timing.core.tests.statistics.ObjectStatisticsTest)  Time elapsed: 0.003 sec
10:56:11 testMergeStatisticsNodes(org.eclipse.tracecompass.analysis.timing.core.tests.statistics.ObjectStatisticsTest)  Time elapsed: 0.001 sec
10:56:11 parallelStreamBuildingTest(org.eclipse.tracecompass.analysis.timing.core.tests.statistics.ObjectStatisticsTest)  Time elapsed: 0.482 sec
10:56:11 testNoiseDataset(org.eclipse.tracecompass.analysis.timing.core.tests.statistics.ObjectStatisticsTest)  Time elapsed: 0.452 sec
10:56:11 streamBuildingTest(org.eclipse.tracecompass.analysis.timing.core.tests.statistics.ObjectStatisticsTest)  Time elapsed: 0.164 sec
10:56:11 testEmpty(org.eclipse.tracecompass.analysis.timing.core.tests.statistics.ObjectStatisticsTest)  Time elapsed: 0 sec
10:56:11 testSmallDataset(org.eclipse.tracecompass.analysis.timing.core.tests.statistics.ObjectStatisticsTest)  Time elapsed: 0 sec
10:56:11 gaussianNoiseTest(org.eclipse.tracecompass.analysis.timing.core.tests.statistics.ObjectStatisticsTest)  Time elapsed: 0.285 sec
10:56:11 testLargeDataset(org.eclipse.tracecompass.analysis.timing.core.tests.statistics.ObjectStatisticsTest)  Time elapsed: 0.35 sec
10:56:11 testAscending(org.eclipse.tracecompass.analysis.timing.core.tests.statistics.ObjectStatisticsTest)  Time elapsed: 0 sec
10:56:11 testLimitDataset(org.eclipse.tracecompass.analysis.timing.core.tests.statistics.ObjectStatisticsTest)  Time elapsed: 0 sec
10:56:11 mergeStatisticsCornerCaseNodesTest(org.eclipse.tracecompass.analysis.timing.core.tests.statistics.ObjectStatisticsTest)  Time elapsed: 0 sec
10:56:11 testMergeStatisticsRandomNodes(org.eclipse.tracecompass.analysis.timing.core.tests.statistics.ObjectStatisticsTest)  Time elapsed: 0.001 sec
10:56:11 testLargeDatasetNegative(org.eclipse.tracecompass.analysis.timing.core.tests.statistics.ObjectStatisticsTest)  Time elapsed: 0.305 sec
10:56:11 testLimitDataset2(org.eclipse.tracecompass.analysis.timing.core.tests.statistics.ObjectStatisticsTest)  Time elapsed: 0 sec
10:56:11 Running org.eclipse.tracecompass.analysis.timing.core.tests.statistics.LongStatisticsTest
10:56:12 Tests run: 15, Failures: 0, Errors: 0, Skipped: 0, Time elapsed: 1.543 sec - in org.eclipse.tracecompass.analysis.timing.core.tests.statistics.LongStatisticsTest
10:56:12 testDescending(org.eclipse.tracecompass.analysis.timing.core.tests.statistics.LongStatisticsTest)  Time elapsed: 0.002 sec
10:56:12 testMergeStatisticsNodes(org.eclipse.tracecompass.analysis.timing.core.tests.statistics.LongStatisticsTest)  Time elapsed: 0.001 sec
10:56:12 parallelStreamBuildingTest(org.eclipse.tracecompass.analysis.timing.core.tests.statistics.LongStatisticsTest)  Time elapsed: 0.328 sec
10:56:12 testNoiseDataset(org.eclipse.tracecompass.analysis.timing.core.tests.statistics.LongStatisticsTest)  Time elapsed: 0.303 sec
10:56:12 streamBuildingTest(org.eclipse.tracecompass.analysis.timing.core.tests.statistics.LongStatisticsTest)  Time elapsed: 0.119 sec
10:56:12 testEmpty(org.eclipse.tracecompass.analysis.timing.core.tests.statistics.LongStatisticsTest)  Time elapsed: 0 sec
10:56:12 testSmallDataset(org.eclipse.tracecompass.analysis.timing.core.tests.statistics.LongStatisticsTest)  Time elapsed: 0 sec
10:56:12 gaussianNoiseTest(org.eclipse.tracecompass.analysis.timing.core.tests.statistics.LongStatisticsTest)  Time elapsed: 0.247 sec
10:56:12 testLargeDataset(org.eclipse.tracecompass.analysis.timing.core.tests.statistics.LongStatisticsTest)  Time elapsed: 0.26 sec
10:56:12 testAscending(org.eclipse.tracecompass.analysis.timing.core.tests.statistics.LongStatisticsTest)  Time elapsed: 0 sec
10:56:12 testLimitDataset(org.eclipse.tracecompass.analysis.timing.core.tests.statistics.LongStatisticsTest)  Time elapsed: 0 sec
10:56:12 mergeStatisticsCornerCaseNodesTest(org.eclipse.tracecompass.analysis.timing.core.tests.statistics.LongStatisticsTest)  Time elapsed: 0 sec
10:56:12 testMergeStatisticsRandomNodes(org.eclipse.tracecompass.analysis.timing.core.tests.statistics.LongStatisticsTest)  Time elapsed: 0.001 sec
10:56:12 testLargeDatasetNegative(org.eclipse.tracecompass.analysis.timing.core.tests.statistics.LongStatisticsTest)  Time elapsed: 0.275 sec
10:56:12 testLimitDataset2(org.eclipse.tracecompass.analysis.timing.core.tests.statistics.LongStatisticsTest)  Time elapsed: 0 sec
10:56:12 Running org.eclipse.tracecompass.analysis.timing.core.tests.flamegraph.AggregationTreeTest
10:56:13 Tests run: 8, Failures: 0, Errors: 0, Skipped: 0, Time elapsed: 0.383 sec - in org.eclipse.tracecompass.analysis.timing.core.tests.flamegraph.AggregationTreeTest
10:56:13 cascadeTest(org.eclipse.tracecompass.analysis.timing.core.tests.flamegraph.AggregationTreeTest)  Time elapsed: 0.068 sec
10:56:13 multiFunctionRootsTest(org.eclipse.tracecompass.analysis.timing.core.tests.flamegraph.AggregationTreeTest)  Time elapsed: 0.002 sec
10:56:13 emptyStateSystemTest(org.eclipse.tracecompass.analysis.timing.core.tests.flamegraph.AggregationTreeTest)  Time elapsed: 0.001 sec
10:56:13 largeTest(org.eclipse.tracecompass.analysis.timing.core.tests.flamegraph.AggregationTreeTest)  Time elapsed: 0.301 sec
10:56:13 multiFunctionRootsSecondTest(org.eclipse.tracecompass.analysis.timing.core.tests.flamegraph.AggregationTreeTest)  Time elapsed: 0.002 sec
10:56:13 mergeSecondLevelCalleesTest(org.eclipse.tracecompass.analysis.timing.core.tests.flamegraph.AggregationTreeTest)  Time elapsed: 0.001 sec
10:56:13 mergeFirstLevelCalleesTest(org.eclipse.tracecompass.analysis.timing.core.tests.flamegraph.AggregationTreeTest)  Time elapsed: 0.002 sec
10:56:13 treeTest(org.eclipse.tracecompass.analysis.timing.core.tests.flamegraph.AggregationTreeTest)  Time elapsed: 0.001 sec
10:56:13 Running org.eclipse.tracecompass.analysis.timing.core.tests.flamegraph.AggregatedCalledFunctionStatisticsTest
10:56:13 Tests run: 4, Failures: 0, Errors: 0, Skipped: 0, Time elapsed: 0.005 sec - in org.eclipse.tracecompass.analysis.timing.core.tests.flamegraph.AggregatedCalledFunctionStatisticsTest
10:56:13 multiFunctionRootsTest(org.eclipse.tracecompass.analysis.timing.core.tests.flamegraph.AggregatedCalledFunctionStatisticsTest)  Time elapsed: 0.002 sec
10:56:13 TreeStatisticsTest(org.eclipse.tracecompass.analysis.timing.core.tests.flamegraph.AggregatedCalledFunctionStatisticsTest)  Time elapsed: 0.001 sec
10:56:13 MergeSecondLevelCalleesTest(org.eclipse.tracecompass.analysis.timing.core.tests.flamegraph.AggregatedCalledFunctionStatisticsTest)  Time elapsed: 0 sec
10:56:13 MergeFirstLevelCalleesStatisticsTest(org.eclipse.tracecompass.analysis.timing.core.tests.flamegraph.AggregatedCalledFunctionStatisticsTest)  Time elapsed: 0 sec
10:56:13 Running org.eclipse.tracecompass.analysis.timing.core.tests.callgraph.CallGraphAnalysisTest
10:56:13 Tests run: 6, Failures: 0, Errors: 0, Skipped: 0, Time elapsed: 0.293 sec - in org.eclipse.tracecompass.analysis.timing.core.tests.callgraph.CallGraphAnalysisTest
10:56:13 PyramidTest(org.eclipse.tracecompass.analysis.timing.core.tests.callgraph.CallGraphAnalysisTest)  Time elapsed: 0.001 sec
10:56:13 LargeTest(org.eclipse.tracecompass.analysis.timing.core.tests.callgraph.CallGraphAnalysisTest)  Time elapsed: 0.285 sec
10:56:13 multiFunctionRootsTest(org.eclipse.tracecompass.analysis.timing.core.tests.callgraph.CallGraphAnalysisTest)  Time elapsed: 0.001 sec
10:56:13 EmptyStateSystemTest(org.eclipse.tracecompass.analysis.timing.core.tests.callgraph.CallGraphAnalysisTest)  Time elapsed: 0 sec
10:56:13 CascadeTest(org.eclipse.tracecompass.analysis.timing.core.tests.callgraph.CallGraphAnalysisTest)  Time elapsed: 0.001 sec
10:56:13 treeTest(org.eclipse.tracecompass.analysis.timing.core.tests.callgraph.CallGraphAnalysisTest)  Time elapsed: 0.003 sec
10:56:13 Running org.eclipse.tracecompass.analysis.timing.core.tests.callgraph.CalledFunctionTest
10:56:13 Tests run: 25, Failures: 0, Errors: 0, Skipped: 0, Time elapsed: 0.017 sec - in org.eclipse.tracecompass.analysis.timing.core.tests.callgraph.CalledFunctionTest
10:56:13 testGetSelfTime(org.eclipse.tracecompass.analysis.timing.core.tests.callgraph.CalledFunctionTest)  Time elapsed: 0 sec
10:56:13 testGetDepth(org.eclipse.tracecompass.analysis.timing.core.tests.callgraph.CalledFunctionTest)  Time elapsed: 0 sec
10:56:13 testGetStart(org.eclipse.tracecompass.analysis.timing.core.tests.callgraph.CalledFunctionTest)  Time elapsed: 0 sec
10:56:13 testGetChildren(org.eclipse.tracecompass.analysis.timing.core.tests.callgraph.CalledFunctionTest)  Time elapsed: 0.001 sec
10:56:13 testToString(org.eclipse.tracecompass.analysis.timing.core.tests.callgraph.CalledFunctionTest)  Time elapsed: 0.001 sec
10:56:13 createInvalidTimeRangeStateLong(org.eclipse.tracecompass.analysis.timing.core.tests.callgraph.CalledFunctionTest)  Time elapsed: 0.001 sec
10:56:13 testCompareTo(org.eclipse.tracecompass.analysis.timing.core.tests.callgraph.CalledFunctionTest)  Time elapsed: 0.001 sec
10:56:13 createInvalidNull(org.eclipse.tracecompass.analysis.timing.core.tests.callgraph.CalledFunctionTest)  Time elapsed: 0 sec
10:56:13 testGetProcessId(org.eclipse.tracecompass.analysis.timing.core.tests.callgraph.CalledFunctionTest)  Time elapsed: 0 sec
10:56:13 createInvalidDouble(org.eclipse.tracecompass.analysis.timing.core.tests.callgraph.CalledFunctionTest)  Time elapsed: 0.001 sec
10:56:13 testAddChildOk1(org.eclipse.tracecompass.analysis.timing.core.tests.callgraph.CalledFunctionTest)  Time elapsed: 0.001 sec
10:56:13 testAddChildOk2(org.eclipse.tracecompass.analysis.timing.core.tests.callgraph.CalledFunctionTest)  Time elapsed: 0 sec
10:56:13 testAddChildOk3(org.eclipse.tracecompass.analysis.timing.core.tests.callgraph.CalledFunctionTest)  Time elapsed: 0 sec
10:56:13 createInvalidTimeRangeStateInteger(org.eclipse.tracecompass.analysis.timing.core.tests.callgraph.CalledFunctionTest)  Time elapsed: 0 sec
10:56:13 testAddChildSelf(org.eclipse.tracecompass.analysis.timing.core.tests.callgraph.CalledFunctionTest)  Time elapsed: 0 sec
10:56:13 testHashCode(org.eclipse.tracecompass.analysis.timing.core.tests.callgraph.CalledFunctionTest)  Time elapsed: 0.001 sec
10:56:13 testCompareToBad(org.eclipse.tracecompass.analysis.timing.core.tests.callgraph.CalledFunctionTest)  Time elapsed: 0 sec
10:56:13 testEquals(org.eclipse.tracecompass.analysis.timing.core.tests.callgraph.CalledFunctionTest)  Time elapsed: 0 sec
10:56:13 testGetParent(org.eclipse.tracecompass.analysis.timing.core.tests.callgraph.CalledFunctionTest)  Time elapsed: 0 sec
10:56:13 testGetEnd(org.eclipse.tracecompass.analysis.timing.core.tests.callgraph.CalledFunctionTest)  Time elapsed: 0.001 sec
10:56:13 createInvalidTimeRangeStateString(org.eclipse.tracecompass.analysis.timing.core.tests.callgraph.CalledFunctionTest)  Time elapsed: 0 sec
10:56:13 testAddChildCycle1(org.eclipse.tracecompass.analysis.timing.core.tests.callgraph.CalledFunctionTest)  Time elapsed: 0 sec
10:56:13 testAddChildCycle2(org.eclipse.tracecompass.analysis.timing.core.tests.callgraph.CalledFunctionTest)  Time elapsed: 0 sec
10:56:13 testAddChildCycle3(org.eclipse.tracecompass.analysis.timing.core.tests.callgraph.CalledFunctionTest)  Time elapsed: 0 sec
10:56:13 createInvalidTimeRange(org.eclipse.tracecompass.analysis.timing.core.tests.callgraph.CalledFunctionTest)  Time elapsed: 0.001 sec
10:56:13 
10:56:13 Results :
10:56:13 
10:56:13 Tests run: 96, Failures: 0, Errors: 0, Skipped: 0
10:56:13 
10:56:14 [INFO] All tests passed!
10:56:14 [INFO] 
10:56:14 [INFO] --- jacoco-maven-plugin:0.7.9:report (post-test) @ org.eclipse.tracecompass.analysis.timing.core.tests ---
10:56:14 [INFO] Loading execution data file /jobs/genie.tracecompass/tracecompass-stable-nightly/workspace/analysis/org.eclipse.tracecompass.analysis.timing.core.tests/../../target/jacoco.exec
10:56:14 [INFO] Analyzed bundle 'org.eclipse.tracecompass.analysis.timing.core.tests' with 18 classes
10:56:14 [INFO] 
10:56:14 [INFO] --- maven-install-plugin:2.5.2:install (default-install) @ org.eclipse.tracecompass.analysis.timing.core.tests ---
10:56:14 [INFO] Installing /jobs/genie.tracecompass/tracecompass-stable-nightly/workspace/analysis/org.eclipse.tracecompass.analysis.timing.core.tests/target/org.eclipse.tracecompass.analysis.timing.core.tests-1.0.2-SNAPSHOT.jar to /home/hudson/genie.tracecompass/.jenkins/jobs/tracecompass-stable-nightly/workspace/.repository/org/eclipse/tracecompass/org.eclipse.tracecompass.analysis.timing.core.tests/1.0.2-SNAPSHOT/org.eclipse.tracecompass.analysis.timing.core.tests-1.0.2-SNAPSHOT.jar
10:56:14 [INFO] Installing /jobs/genie.tracecompass/tracecompass-stable-nightly/workspace/analysis/org.eclipse.tracecompass.analysis.timing.core.tests/.polyglot.build.properties to /home/hudson/genie.tracecompass/.jenkins/jobs/tracecompass-stable-nightly/workspace/.repository/org/eclipse/tracecompass/org.eclipse.tracecompass.analysis.timing.core.tests/1.0.2-SNAPSHOT/org.eclipse.tracecompass.analysis.timing.core.tests-1.0.2-SNAPSHOT.pom
10:56:14 [INFO] Installing /jobs/genie.tracecompass/tracecompass-stable-nightly/workspace/analysis/org.eclipse.tracecompass.analysis.timing.core.tests/target/org.eclipse.tracecompass.analysis.timing.core.tests-1.0.2-SNAPSHOT-sources.jar to /home/hudson/genie.tracecompass/.jenkins/jobs/tracecompass-stable-nightly/workspace/.repository/org/eclipse/tracecompass/org.eclipse.tracecompass.analysis.timing.core.tests/1.0.2-SNAPSHOT/org.eclipse.tracecompass.analysis.timing.core.tests-1.0.2-SNAPSHOT-sources.jar
10:56:14 [INFO] Installing /jobs/genie.tracecompass/tracecompass-stable-nightly/workspace/analysis/org.eclipse.tracecompass.analysis.timing.core.tests/target/org.eclipse.tracecompass.analysis.timing.core.tests-1.0.2-SNAPSHOT.jar.pack.gz to /home/hudson/genie.tracecompass/.jenkins/jobs/tracecompass-stable-nightly/workspace/.repository/org/eclipse/tracecompass/org.eclipse.tracecompass.analysis.timing.core.tests/1.0.2-SNAPSHOT/org.eclipse.tracecompass.analysis.timing.core.tests-1.0.2-SNAPSHOT-pack200.jar.pack.gz
10:56:14 [INFO] Installing /jobs/genie.tracecompass/tracecompass-stable-nightly/workspace/analysis/org.eclipse.tracecompass.analysis.timing.core.tests/target/p2content.xml to /home/hudson/genie.tracecompass/.jenkins/jobs/tracecompass-stable-nightly/workspace/.repository/org/eclipse/tracecompass/org.eclipse.tracecompass.analysis.timing.core.tests/1.0.2-SNAPSHOT/org.eclipse.tracecompass.analysis.timing.core.tests-1.0.2-SNAPSHOT-p2metadata.xml
10:56:14 [INFO] Installing /jobs/genie.tracecompass/tracecompass-stable-nightly/workspace/analysis/org.eclipse.tracecompass.analysis.timing.core.tests/target/p2artifacts.xml to /home/hudson/genie.tracecompass/.jenkins/jobs/tracecompass-stable-nightly/workspace/.repository/org/eclipse/tracecompass/org.eclipse.tracecompass.analysis.timing.core.tests/1.0.2-SNAPSHOT/org.eclipse.tracecompass.analysis.timing.core.tests-1.0.2-SNAPSHOT-p2artifacts.xml
10:56:14 [INFO] 
10:56:14 [INFO] --- tycho-p2-plugin:1.0.0:update-local-index (default-update-local-index) @ org.eclipse.tracecompass.analysis.timing.core.tests ---
10:56:14 [INFO] 
10:56:14 [INFO] ------------------------------------------------------------------------
10:56:14 [INFO] Building org.eclipse.tracecompass.tmf.ui.tests 1.0.4-SNAPSHOT
10:56:14 [INFO] ------------------------------------------------------------------------
10:56:14 [INFO] 
10:56:14 [INFO] --- maven-clean-plugin:3.0.0:clean (default-clean) @ org.eclipse.tracecompass.tmf.ui.tests ---
10:56:14 [INFO] Deleting /jobs/genie.tracecompass/tracecompass-stable-nightly/workspace/tmf/org.eclipse.tracecompass.tmf.ui.tests/target
10:56:15 [INFO] 
10:56:15 [INFO] --- tycho-packaging-plugin:1.0.0:build-qualifier (default-build-qualifier) @ org.eclipse.tracecompass.tmf.ui.tests ---
10:56:15 [INFO] The project's OSGi version is 1.0.4.201801311519
10:56:15 [INFO] 
10:56:15 [INFO] --- tycho-packaging-plugin:1.0.0:validate-id (default-validate-id) @ org.eclipse.tracecompass.tmf.ui.tests ---
10:56:15 [INFO] 
10:56:15 [INFO] --- tycho-packaging-plugin:1.0.0:validate-version (default-validate-version) @ org.eclipse.tracecompass.tmf.ui.tests ---
10:56:15 [INFO] 
10:56:15 [INFO] --- maven-enforcer-plugin:1.4.1:enforce (enforce-maven-version) @ org.eclipse.tracecompass.tmf.ui.tests ---
10:56:15 [INFO] 
10:56:15 [INFO] --- jacoco-maven-plugin:0.7.9:prepare-agent (pre-test) @ org.eclipse.tracecompass.tmf.ui.tests ---
10:56:15 [INFO] tycho.testArgLine set to -javaagent:/home/hudson/genie.tracecompass/.jenkins/jobs/tracecompass-stable-nightly/workspace/.repository/org/jacoco/org.jacoco.agent/0.7.9/org.jacoco.agent-0.7.9-runtime.jar=destfile=/jobs/genie.tracecompass/tracecompass-stable-nightly/workspace/tmf/org.eclipse.tracecompass.tmf.ui.tests/../../target/jacoco.exec,append=true,includes=org.eclipse.tracecompass.*
10:56:15 [INFO] 
10:56:15 [INFO] --- maven-resources-plugin:3.0.2:resources (default-resources) @ org.eclipse.tracecompass.tmf.ui.tests ---
10:56:15 [INFO] Using 'UTF-8' encoding to copy filtered resources.
10:56:15 [INFO] skip non existing resourceDirectory /jobs/genie.tracecompass/tracecompass-stable-nightly/workspace/tmf/org.eclipse.tracecompass.tmf.ui.tests/src/main/resources
10:56:15 [INFO] 
10:56:15 [INFO] --- tycho-compiler-plugin:1.0.0:compile (default-compile) @ org.eclipse.tracecompass.tmf.ui.tests ---
10:56:15 [INFO] Compiling 52 source files to /jobs/genie.tracecompass/tracecompass-stable-nightly/workspace/tmf/org.eclipse.tracecompass.tmf.ui.tests/target/classes
10:56:16 [WARNING] /jobs/genie.tracecompass/tracecompass-stable-nightly/workspace/tmf/org.eclipse.tracecompass.tmf.ui.tests/src/org/eclipse/tracecompass/tmf/ui/tests/actions/SelectTracesOperationTest.java:[202] 
10:56:16 	expectedTracesMap.put(new Pair<>(traceElement.getName(), traceElement.getLocation()), traceElement);
10:56:16 	                                 ^^^^^^^^^^^^^^^^^^^^^^
10:56:16 Null type safety (type annotations): The expression of type 'String' needs unchecked conversion to conform to '@NonNull String'
10:56:16 [WARNING] /jobs/genie.tracecompass/tracecompass-stable-nightly/workspace/tmf/org.eclipse.tracecompass.tmf.ui.tests/src/org/eclipse/tracecompass/tmf/ui/tests/actions/SelectTracesOperationTest.java:[202] 
10:56:16 	expectedTracesMap.put(new Pair<>(traceElement.getName(), traceElement.getLocation()), traceElement);
10:56:16 	                                                         ^^^^^^^^^^^^^^^^^^^^^^^^^^
10:56:16 Null type safety (type annotations): The expression of type 'URI' needs unchecked conversion to conform to '@NonNull URI'
10:56:16 [WARNING] /jobs/genie.tracecompass/tracecompass-stable-nightly/workspace/tmf/org.eclipse.tracecompass.tmf.ui.tests/src/org/eclipse/tracecompass/tmf/ui/tests/actions/SelectTracesOperationTest.java:[205] 
10:56:16 	actualTraces.forEach(actualTraceElement -> assertNotNull(expectedTracesMap.get(new Pair<>(actualTraceElement.getName(), actualTraceElement.getLocation()))));
10:56:16 	                                                                                          ^^^^^^^^^^^^^^^^^^^^^^^^^^^^
10:56:16 Null type safety (type annotations): The expression of type 'String' needs unchecked conversion to conform to '@NonNull String'
10:56:16 [WARNING] /jobs/genie.tracecompass/tracecompass-stable-nightly/workspace/tmf/org.eclipse.tracecompass.tmf.ui.tests/src/org/eclipse/tracecompass/tmf/ui/tests/actions/SelectTracesOperationTest.java:[205] 
10:56:16 	actualTraces.forEach(actualTraceElement -> assertNotNull(expectedTracesMap.get(new Pair<>(actualTraceElement.getName(), actualTraceElement.getLocation()))));
10:56:16 	                                                                                                                        ^^^^^^^^^^^^^^^^^^^^^^^^^^^^^^^^
10:56:16 Null type safety (type annotations): The expression of type 'URI' needs unchecked conversion to conform to '@NonNull URI'
10:56:16 [WARNING] /jobs/genie.tracecompass/tracecompass-stable-nightly/workspace/tmf/org.eclipse.tracecompass.tmf.ui.tests/widgetStubs/org/eclipse/tracecompass/tmf/ui/tests/uml2sd/trace/TmfUml2SDTestTrace.java:[105] 
10:56:16 	return tmfEvent;
10:56:16 	^^^^^^^^^^^^^^^^
10:56:16 Potential resource leak: 'stream' may not be closed at this location
10:56:16 [WARNING] /jobs/genie.tracecompass/tracecompass-stable-nightly/workspace/tmf/org.eclipse.tracecompass.tmf.ui.tests/widgetStubs/org/eclipse/tracecompass/tmf/ui/tests/uml2sd/trace/TmfUml2SDTestTrace.java:[109] 
10:56:16 	return null;
10:56:16 	^^^^^^^^^^^^
10:56:16 Potential resource leak: 'stream' may not be closed at this location
10:56:16 6 problems (6 warnings)
10:56:16 [INFO] 
10:56:16 [INFO] --- maven-resources-plugin:3.0.2:testResources (default-testResources) @ org.eclipse.tracecompass.tmf.ui.tests ---
10:56:16 [INFO] Using 'UTF-8' encoding to copy filtered resources.
10:56:16 [INFO] skip non existing resourceDirectory /jobs/genie.tracecompass/tracecompass-stable-nightly/workspace/tmf/org.eclipse.tracecompass.tmf.ui.tests/src/test/resources
10:56:16 [INFO] 
10:56:16 [INFO] --- tycho-source-plugin:1.0.0:plugin-source (plugin-source) @ org.eclipse.tracecompass.tmf.ui.tests ---
10:56:16 [INFO] Building jar: /jobs/genie.tracecompass/tracecompass-stable-nightly/workspace/tmf/org.eclipse.tracecompass.tmf.ui.tests/target/org.eclipse.tracecompass.tmf.ui.tests-1.0.4-SNAPSHOT-sources.jar
10:56:16 [INFO] 
10:56:16 [INFO] --- target-platform-configuration:1.0.0:target-platform (default-target-platform) @ org.eclipse.tracecompass.tmf.ui.tests ---
10:56:16 [INFO] 
10:56:16 [INFO] --- tycho-packaging-plugin:1.0.0:package-plugin (default-package-plugin) @ org.eclipse.tracecompass.tmf.ui.tests ---
10:56:16 [INFO] Building jar: /jobs/genie.tracecompass/tracecompass-stable-nightly/workspace/tmf/org.eclipse.tracecompass.tmf.ui.tests/target/org.eclipse.tracecompass.tmf.ui.tests-1.0.4-SNAPSHOT.jar
10:56:16 [INFO] 
10:56:16 [INFO] --- tycho-p2-plugin:1.0.0:p2-metadata-default (default-p2-metadata-default) @ org.eclipse.tracecompass.tmf.ui.tests ---
10:56:16 [INFO] 
10:56:16 [INFO] --- tycho-source-feature-plugin:1.0.0:source-feature (source-feature) @ org.eclipse.tracecompass.tmf.ui.tests ---
10:56:16 [INFO] 
10:56:16 [INFO] --- tycho-pack200a-plugin:1.0.0:normalize (pack200-normalize) @ org.eclipse.tracecompass.tmf.ui.tests ---
10:56:16 [INFO] Pack200 normalizing jar /jobs/genie.tracecompass/tracecompass-stable-nightly/workspace/tmf/org.eclipse.tracecompass.tmf.ui.tests/target/org.eclipse.tracecompass.tmf.ui.tests-1.0.4-SNAPSHOT.jar
10:56:17 [INFO] 
10:56:17 [INFO] --- eclipse-jarsigner-plugin:1.1.3:sign (sign) @ org.eclipse.tracecompass.tmf.ui.tests ---
10:56:17 [INFO] Signing jar: /jobs/genie.tracecompass/tracecompass-stable-nightly/workspace/tmf/org.eclipse.tracecompass.tmf.ui.tests/target/org.eclipse.tracecompass.tmf.ui.tests-1.0.4-SNAPSHOT.jar
10:56:18 [INFO] Signing jar: /jobs/genie.tracecompass/tracecompass-stable-nightly/workspace/tmf/org.eclipse.tracecompass.tmf.ui.tests/target/org.eclipse.tracecompass.tmf.ui.tests-1.0.4-SNAPSHOT-sources.jar
10:56:19 [INFO] 
10:56:19 [INFO] --- tycho-pack200b-plugin:1.0.0:pack (pack200-pack) @ org.eclipse.tracecompass.tmf.ui.tests ---
10:56:19 [INFO] Pack200 packing jar /jobs/genie.tracecompass/tracecompass-stable-nightly/workspace/tmf/org.eclipse.tracecompass.tmf.ui.tests/target/org.eclipse.tracecompass.tmf.ui.tests-1.0.4-SNAPSHOT.jar
10:56:20 [INFO] 
10:56:20 [INFO] --- tycho-p2-plugin:1.0.0:p2-metadata (p2-metadata) @ org.eclipse.tracecompass.tmf.ui.tests ---
10:56:20 [INFO] 
10:56:20 [INFO] --- tycho-surefire-plugin:1.0.0:test (default-test) @ org.eclipse.tracecompass.tmf.ui.tests ---
10:56:20 [INFO] Expected eclipse log file: /jobs/genie.tracecompass/tracecompass-stable-nightly/workspace/tmf/org.eclipse.tracecompass.tmf.ui.tests/target/work/data/.metadata/.log
10:56:20 [INFO] Command line:
10:56:20 	[/opt/public/common/java/oracle/jdk1.8.0_162_x64/jre/bin/java, -Dosgi.noShutdown=false, -Dosgi.os=linux, -Dosgi.ws=gtk, -Dosgi.arch=x86_64, -javaagent:/home/hudson/genie.tracecompass/.jenkins/jobs/tracecompass-stable-nightly/workspace/.repository/org/jacoco/org.jacoco.agent/0.7.9/org.jacoco.agent-0.7.9-runtime.jar=destfile=/jobs/genie.tracecompass/tracecompass-stable-nightly/workspace/tmf/org.eclipse.tracecompass.tmf.ui.tests/../../target/jacoco.exec,append=true,includes=org.eclipse.tracecompass.*, -Dorg.eclipse.swt.browser.DefaultType=mozilla, -Xms512m, -Xmx1024m, -Dosgi.clean=true, -jar, /jobs/genie.tracecompass/tracecompass-stable-nightly/workspace/.repository/p2/osgi/bundle/org.eclipse.equinox.launcher/1.4.0.v20161219-1356/org.eclipse.equinox.launcher-1.4.0.v20161219-1356.jar, -data, /jobs/genie.tracecompass/tracecompass-stable-nightly/workspace/tmf/org.eclipse.tracecompass.tmf.ui.tests/target/work/data, -install, /jobs/genie.tracecompass/tracecompass-stable-nightly/workspace/tmf/org.eclipse.tracecompass.tmf.ui.tests/target/work, -configuration, /jobs/genie.tracecompass/tracecompass-stable-nightly/workspace/tmf/org.eclipse.tracecompass.tmf.ui.tests/target/work/configuration, -application, org.eclipse.tycho.surefire.osgibooter.uitest, -testproperties, /jobs/genie.tracecompass/tracecompass-stable-nightly/workspace/tmf/org.eclipse.tracecompass.tmf.ui.tests/target/surefire.properties, -product, org.eclipse.platform.ide, -consoleLog]
10:56:26 !SESSION 2018-01-31 10:56:20.867 -----------------------------------------------
10:56:26 eclipse.buildId=unknown
10:56:26 java.version=1.8.0_162
10:56:26 java.vendor=Oracle Corporation
10:56:26 BootLoader constants: OS=linux, ARCH=x86_64, WS=gtk, NL=en_US
10:56:26 Framework arguments:  -application org.eclipse.tycho.surefire.osgibooter.uitest -testproperties /jobs/genie.tracecompass/tracecompass-stable-nightly/workspace/tmf/org.eclipse.tracecompass.tmf.ui.tests/target/surefire.properties -product org.eclipse.platform.ide
10:56:26 Command-line arguments:  -data /jobs/genie.tracecompass/tracecompass-stable-nightly/workspace/tmf/org.eclipse.tracecompass.tmf.ui.tests/target/work/data -application org.eclipse.tycho.surefire.osgibooter.uitest -testproperties /jobs/genie.tracecompass/tracecompass-stable-nightly/workspace/tmf/org.eclipse.tracecompass.tmf.ui.tests/target/surefire.properties -product org.eclipse.platform.ide -consoleLog
10:56:26 
10:56:26 !ENTRY org.eclipse.compare.win32 4 0 2018-01-31 10:56:26.621
10:56:26 !MESSAGE FrameworkEvent ERROR
10:56:26 !STACK 0
10:56:26 org.osgi.framework.BundleException: Could not resolve module: org.eclipse.compare.win32 [56]
10:56:26   Unresolved requirement: Require-Capability: eclipse.platform; filter:="(osgi.os=win32)"
10:56:26 
10:56:26 	at org.eclipse.osgi.container.Module.start(Module.java:444)
10:56:26 	at org.eclipse.osgi.container.ModuleContainer$ContainerStartLevel.incStartLevel(ModuleContainer.java:1634)
10:56:26 	at org.eclipse.osgi.container.ModuleContainer$ContainerStartLevel.incStartLevel(ModuleContainer.java:1613)
10:56:26 	at org.eclipse.osgi.container.ModuleContainer$ContainerStartLevel.doContainerStartLevel(ModuleContainer.java:1585)
10:56:26 	at org.eclipse.osgi.container.ModuleContainer$ContainerStartLevel.dispatchEvent(ModuleContainer.java:1528)
10:56:26 	at org.eclipse.osgi.container.ModuleContainer$ContainerStartLevel.dispatchEvent(ModuleContainer.java:1)
10:56:26 	at org.eclipse.osgi.framework.eventmgr.EventManager.dispatchEvent(EventManager.java:230)
10:56:26 	at org.eclipse.osgi.framework.eventmgr.EventManager$EventThread.run(EventManager.java:340)
10:56:32 
10:56:32 -------------------------------------------------------
10:56:32  T E S T S
10:56:32 -------------------------------------------------------
10:56:33 Running org.eclipse.tracecompass.tmf.ui.tests.views.uml2sd.loader.TmfUml2SDSyncLoaderFindTest
10:56:57 Tests run: 4, Failures: 0, Errors: 0, Skipped: 0, Time elapsed: 24.81 sec - in org.eclipse.tracecompass.tmf.ui.tests.views.uml2sd.loader.TmfUml2SDSyncLoaderFindTest
10:56:57 verifyFirstMessage(org.eclipse.tracecompass.tmf.ui.tests.views.uml2sd.loader.TmfUml2SDSyncLoaderFindTest)  Time elapsed: 6.074 sec
10:56:57 verifyFind(org.eclipse.tracecompass.tmf.ui.tests.views.uml2sd.loader.TmfUml2SDSyncLoaderFindTest)  Time elapsed: 5.033 sec
10:56:57 verifyISDGraphNodeSupporter(org.eclipse.tracecompass.tmf.ui.tests.views.uml2sd.loader.TmfUml2SDSyncLoaderFindTest)  Time elapsed: 1.301 sec
10:56:57 verifyCancelSearch(org.eclipse.tracecompass.tmf.ui.tests.views.uml2sd.loader.TmfUml2SDSyncLoaderFindTest)  Time elapsed: 2.674 sec
10:56:57 Running org.eclipse.tracecompass.tmf.ui.tests.views.uml2sd.loader.TmfUml2SDSyncLoaderFilterTest
10:57:22 Tests run: 5, Failures: 0, Errors: 0, Skipped: 0, Time elapsed: 24.729 sec - in org.eclipse.tracecompass.tmf.ui.tests.views.uml2sd.loader.TmfUml2SDSyncLoaderFilterTest
10:57:22 verifyMessageFilter(org.eclipse.tracecompass.tmf.ui.tests.views.uml2sd.loader.TmfUml2SDSyncLoaderFilterTest)  Time elapsed: 3.327 sec
10:57:22 verifyRemoval(org.eclipse.tracecompass.tmf.ui.tests.views.uml2sd.loader.TmfUml2SDSyncLoaderFilterTest)  Time elapsed: 4.331 sec
10:57:22 verifyFilter1of2(org.eclipse.tracecompass.tmf.ui.tests.views.uml2sd.loader.TmfUml2SDSyncLoaderFilterTest)  Time elapsed: 3.261 sec
10:57:22 verifyFilter1of3(org.eclipse.tracecompass.tmf.ui.tests.views.uml2sd.loader.TmfUml2SDSyncLoaderFilterTest)  Time elapsed: 3.703 sec
10:57:22 verifyFilter2of2(org.eclipse.tracecompass.tmf.ui.tests.views.uml2sd.loader.TmfUml2SDSyncLoaderFilterTest)  Time elapsed: 3.317 sec
10:57:22 Running org.eclipse.tracecompass.tmf.ui.tests.views.uml2sd.loader.TmfUml2SDSyncLoaderPagesTest
10:58:00 Tests run: 6, Failures: 0, Errors: 0, Skipped: 0, Time elapsed: 38.286 sec - in org.eclipse.tracecompass.tmf.ui.tests.views.uml2sd.loader.TmfUml2SDSyncLoaderPagesTest
10:58:00 verifyLastPage(org.eclipse.tracecompass.tmf.ui.tests.views.uml2sd.loader.TmfUml2SDSyncLoaderPagesTest)  Time elapsed: 2.463 sec
10:58:00 verifyPrevPage(org.eclipse.tracecompass.tmf.ui.tests.views.uml2sd.loader.TmfUml2SDSyncLoaderPagesTest)  Time elapsed: 11.884 sec
10:58:00 verifyPageNumberChanged(org.eclipse.tracecompass.tmf.ui.tests.views.uml2sd.loader.TmfUml2SDSyncLoaderPagesTest)  Time elapsed: 2.509 sec
10:58:00 verifyFirstPage(org.eclipse.tracecompass.tmf.ui.tests.views.uml2sd.loader.TmfUml2SDSyncLoaderPagesTest)  Time elapsed: 2.442 sec
10:58:00 verifyPagesCount(org.eclipse.tracecompass.tmf.ui.tests.views.uml2sd.loader.TmfUml2SDSyncLoaderPagesTest)  Time elapsed: 0 sec
10:58:00 verifyNextPage(org.eclipse.tracecompass.tmf.ui.tests.views.uml2sd.loader.TmfUml2SDSyncLoaderPagesTest)  Time elapsed: 12.013 sec
10:58:00 Running org.eclipse.tracecompass.tmf.ui.tests.views.uml2sd.loader.TmfUml2SDSyncLoaderSignalTest
10:58:11 Tests run: 2, Failures: 0, Errors: 0, Skipped: 0, Time elapsed: 10.88 sec - in org.eclipse.tracecompass.tmf.ui.tests.views.uml2sd.loader.TmfUml2SDSyncLoaderSignalTest
10:58:11 verifyFirstPageSignal(org.eclipse.tracecompass.tmf.ui.tests.views.uml2sd.loader.TmfUml2SDSyncLoaderSignalTest)  Time elapsed: 1.257 sec
10:58:11 verifySelectionSignal(org.eclipse.tracecompass.tmf.ui.tests.views.uml2sd.loader.TmfUml2SDSyncLoaderSignalTest)  Time elapsed: 1.006 sec
10:58:11 Running org.eclipse.tracecompass.tmf.ui.tests.views.uml2sd.loader.TmfUml2SDSyncLoaderExpTest
10:58:36 Tests run: 5, Failures: 0, Errors: 0, Skipped: 0, Time elapsed: 24.788 sec - in org.eclipse.tracecompass.tmf.ui.tests.views.uml2sd.loader.TmfUml2SDSyncLoaderExpTest
10:58:36 verifySetup(org.eclipse.tracecompass.tmf.ui.tests.views.uml2sd.loader.TmfUml2SDSyncLoaderExpTest)  Time elapsed: 2.048 sec
10:58:36 verifyCancel(org.eclipse.tracecompass.tmf.ui.tests.views.uml2sd.loader.TmfUml2SDSyncLoaderExpTest)  Time elapsed: 16.108 sec
10:58:36 verifyLoaderDispose(org.eclipse.tracecompass.tmf.ui.tests.views.uml2sd.loader.TmfUml2SDSyncLoaderExpTest)  Time elapsed: 0.062 sec
10:58:36 testSetViewer(org.eclipse.tracecompass.tmf.ui.tests.views.uml2sd.loader.TmfUml2SDSyncLoaderExpTest)  Time elapsed: 0.097 sec
10:58:36 verifyDispose(org.eclipse.tracecompass.tmf.ui.tests.views.uml2sd.loader.TmfUml2SDSyncLoaderExpTest)  Time elapsed: 0.001 sec
10:58:36 Running org.eclipse.tracecompass.tmf.ui.tests.views.uml2sd.loader.TmfUml2SDSyncLoaderTimeTest
10:58:55 Tests run: 9, Failures: 0, Errors: 0, Skipped: 0, Time elapsed: 19.118 sec - in org.eclipse.tracecompass.tmf.ui.tests.views.uml2sd.loader.TmfUml2SDSyncLoaderTimeTest
10:58:55 verifyTimeRangeSamePage(org.eclipse.tracecompass.tmf.ui.tests.views.uml2sd.loader.TmfUml2SDSyncLoaderTimeTest)  Time elapsed: 1.306 sec
10:58:55 verifyTimeRangeDifferentPages(org.eclipse.tracecompass.tmf.ui.tests.views.uml2sd.loader.TmfUml2SDSyncLoaderTimeTest)  Time elapsed: 1.385 sec
10:58:55 verifySynchToTimeEqualsLast(org.eclipse.tracecompass.tmf.ui.tests.views.uml2sd.loader.TmfUml2SDSyncLoaderTimeTest)  Time elapsed: 1.291 sec
10:58:55 verifySynchToTimeBeforeExpStart(org.eclipse.tracecompass.tmf.ui.tests.views.uml2sd.loader.TmfUml2SDSyncLoaderTimeTest)  Time elapsed: 1.216 sec
10:58:55 verifySynchToTimeAfterExpEnd(org.eclipse.tracecompass.tmf.ui.tests.views.uml2sd.loader.TmfUml2SDSyncLoaderTimeTest)  Time elapsed: 1.124 sec
10:58:55 verifySynchToTimeInPage(org.eclipse.tracecompass.tmf.ui.tests.views.uml2sd.loader.TmfUml2SDSyncLoaderTimeTest)  Time elapsed: 1.332 sec
10:58:55 verifySynchToTimeNonExisting(org.eclipse.tracecompass.tmf.ui.tests.views.uml2sd.loader.TmfUml2SDSyncLoaderTimeTest)  Time elapsed: 1.92 sec
10:58:55 verifySynchToTimeFirst(org.eclipse.tracecompass.tmf.ui.tests.views.uml2sd.loader.TmfUml2SDSyncLoaderTimeTest)  Time elapsed: 1.343 sec
10:58:55 verifySynchToTimeOutsidePage(org.eclipse.tracecompass.tmf.ui.tests.views.uml2sd.loader.TmfUml2SDSyncLoaderTimeTest)  Time elapsed: 1.394 sec
10:58:55 Running org.eclipse.tracecompass.tmf.ui.tests.views.uml2sd.load.LoadersManagerTest
10:58:56 Tests run: 1, Failures: 0, Errors: 0, Skipped: 0, Time elapsed: 1.097 sec - in org.eclipse.tracecompass.tmf.ui.tests.views.uml2sd.load.LoadersManagerTest
10:58:56 testLoaderManager(org.eclipse.tracecompass.tmf.ui.tests.views.uml2sd.load.LoadersManagerTest)  Time elapsed: 1.095 sec
10:58:56 Running org.eclipse.tracecompass.tmf.ui.tests.views.uml2sd.dialogs.CriteriaTest
10:58:56 Tests run: 8, Failures: 0, Errors: 0, Skipped: 0, Time elapsed: 0.004 sec - in org.eclipse.tracecompass.tmf.ui.tests.views.uml2sd.dialogs.CriteriaTest
10:58:56 testCriteria(org.eclipse.tracecompass.tmf.ui.tests.views.uml2sd.dialogs.CriteriaTest)  Time elapsed: 0 sec
10:58:56 testAccessors(org.eclipse.tracecompass.tmf.ui.tests.views.uml2sd.dialogs.CriteriaTest)  Time elapsed: 0 sec
10:58:56 testLoad(org.eclipse.tracecompass.tmf.ui.tests.views.uml2sd.dialogs.CriteriaTest)  Time elapsed: 0.001 sec
10:58:56 testSave(org.eclipse.tracecompass.tmf.ui.tests.views.uml2sd.dialogs.CriteriaTest)  Time elapsed: 0 sec
10:58:56 testCompareTo(org.eclipse.tracecompass.tmf.ui.tests.views.uml2sd.dialogs.CriteriaTest)  Time elapsed: 0 sec
10:58:56 testCriteriaCriteria(org.eclipse.tracecompass.tmf.ui.tests.views.uml2sd.dialogs.CriteriaTest)  Time elapsed: 0 sec
10:58:56 testMatches(org.eclipse.tracecompass.tmf.ui.tests.views.uml2sd.dialogs.CriteriaTest)  Time elapsed: 0 sec
10:58:56 testGetGraphNodeSummary(org.eclipse.tracecompass.tmf.ui.tests.views.uml2sd.dialogs.CriteriaTest)  Time elapsed: 0.001 sec
10:58:56 Running org.eclipse.tracecompass.tmf.ui.tests.views.TmfViewFactoryTest
10:58:56 Tests run: 2, Failures: 0, Errors: 0, Skipped: 0, Time elapsed: 0.118 sec - in org.eclipse.tracecompass.tmf.ui.tests.views.TmfViewFactoryTest
10:58:56 testGetBaseSecId(org.eclipse.tracecompass.tmf.ui.tests.views.TmfViewFactoryTest)  Time elapsed: 0.014 sec
10:58:56 testNewView(org.eclipse.tracecompass.tmf.ui.tests.views.TmfViewFactoryTest)  Time elapsed: 0.102 sec
10:58:56 Running org.eclipse.tracecompass.tmf.ui.tests.statistics.TmfBaseColumnDataProviderTest
10:58:57 Tests run: 1, Failures: 0, Errors: 0, Skipped: 0, Time elapsed: 0.044 sec - in org.eclipse.tracecompass.tmf.ui.tests.statistics.TmfBaseColumnDataProviderTest
10:58:57 testGetColumnData(org.eclipse.tracecompass.tmf.ui.tests.statistics.TmfBaseColumnDataProviderTest)  Time elapsed: 0.003 sec
10:58:57 Running org.eclipse.tracecompass.tmf.ui.tests.statistics.TmfBaseColumnDataTest
10:58:57 Tests run: 7, Failures: 0, Errors: 0, Skipped: 0, Time elapsed: 0.007 sec - in org.eclipse.tracecompass.tmf.ui.tests.statistics.TmfBaseColumnDataTest
10:58:57 testGetWidth(org.eclipse.tracecompass.tmf.ui.tests.statistics.TmfBaseColumnDataTest)  Time elapsed: 0.002 sec
10:58:57 testGetAlignment(org.eclipse.tracecompass.tmf.ui.tests.statistics.TmfBaseColumnDataTest)  Time elapsed: 0 sec
10:58:57 testGetLabelProvider(org.eclipse.tracecompass.tmf.ui.tests.statistics.TmfBaseColumnDataTest)  Time elapsed: 0.002 sec
10:58:57 testGetTooltip(org.eclipse.tracecompass.tmf.ui.tests.statistics.TmfBaseColumnDataTest)  Time elapsed: 0 sec
10:58:57 testGetComparator(org.eclipse.tracecompass.tmf.ui.tests.statistics.TmfBaseColumnDataTest)  Time elapsed: 0 sec
10:58:57 testGetPercentageProvider(org.eclipse.tracecompass.tmf.ui.tests.statistics.TmfBaseColumnDataTest)  Time elapsed: 0 sec
10:58:57 testGetHeader(org.eclipse.tracecompass.tmf.ui.tests.statistics.TmfBaseColumnDataTest)  Time elapsed: 0 sec
10:58:57 Running org.eclipse.tracecompass.tmf.ui.tests.statistics.TmfStatisticsTest
10:58:57 Tests run: 4, Failures: 0, Errors: 0, Skipped: 0, Time elapsed: 0.002 sec - in org.eclipse.tracecompass.tmf.ui.tests.statistics.TmfStatisticsTest
10:58:57 testResetPartial(org.eclipse.tracecompass.tmf.ui.tests.statistics.TmfStatisticsTest)  Time elapsed: 0.001 sec
10:58:57 testInitialState(org.eclipse.tracecompass.tmf.ui.tests.statistics.TmfStatisticsTest)  Time elapsed: 0 sec
10:58:57 testResetTotal(org.eclipse.tracecompass.tmf.ui.tests.statistics.TmfStatisticsTest)  Time elapsed: 0 sec
10:58:57 testSetValue(org.eclipse.tracecompass.tmf.ui.tests.statistics.TmfStatisticsTest)  Time elapsed: 0 sec
10:58:57 Running org.eclipse.tracecompass.tmf.ui.tests.statistics.TmfBaseStatisticsDataTest
10:58:57 Tests run: 6, Failures: 0, Errors: 0, Skipped: 0, Time elapsed: 0.004 sec - in org.eclipse.tracecompass.tmf.ui.tests.statistics.TmfBaseStatisticsDataTest
10:58:57 testGet(org.eclipse.tracecompass.tmf.ui.tests.statistics.TmfBaseStatisticsDataTest)  Time elapsed: 0 sec
10:58:57 testGetChildren(org.eclipse.tracecompass.tmf.ui.tests.statistics.TmfBaseStatisticsDataTest)  Time elapsed: 0 sec
10:58:57 testReset(org.eclipse.tracecompass.tmf.ui.tests.statistics.TmfBaseStatisticsDataTest)  Time elapsed: 0 sec
10:58:57 testRegisterEvent(org.eclipse.tracecompass.tmf.ui.tests.statistics.TmfBaseStatisticsDataTest)  Time elapsed: 0 sec
10:58:57 testGetParent(org.eclipse.tracecompass.tmf.ui.tests.statistics.TmfBaseStatisticsDataTest)  Time elapsed: 0 sec
10:58:57 testGetOrCreate(org.eclipse.tracecompass.tmf.ui.tests.statistics.TmfBaseStatisticsDataTest)  Time elapsed: 0.001 sec
10:58:57 Running org.eclipse.tracecompass.tmf.ui.tests.statistics.TmfStatisticsTreeManagerTest
10:58:57 Tests run: 6, Failures: 0, Errors: 0, Skipped: 0, Time elapsed: 0.005 sec - in org.eclipse.tracecompass.tmf.ui.tests.statistics.TmfStatisticsTreeManagerTest
10:58:57 testaddStatsTreeRoot(org.eclipse.tracecompass.tmf.ui.tests.statistics.TmfStatisticsTreeManagerTest)  Time elapsed: 0.001 sec
10:58:57 testGetStatTree(org.eclipse.tracecompass.tmf.ui.tests.statistics.TmfStatisticsTreeManagerTest)  Time elapsed: 0 sec
10:58:57 testContainsTreeRoot(org.eclipse.tracecompass.tmf.ui.tests.statistics.TmfStatisticsTreeManagerTest)  Time elapsed: 0 sec
10:58:57 testRemoveStatTreeRoot(org.eclipse.tracecompass.tmf.ui.tests.statistics.TmfStatisticsTreeManagerTest)  Time elapsed: 0 sec
10:58:57 testGetStatTreeRoot(org.eclipse.tracecompass.tmf.ui.tests.statistics.TmfStatisticsTreeManagerTest)  Time elapsed: 0.001 sec
10:58:57 testRemoveAll(org.eclipse.tracecompass.tmf.ui.tests.statistics.TmfStatisticsTreeManagerTest)  Time elapsed: 0 sec
10:58:57 Running org.eclipse.tracecompass.tmf.ui.tests.statistics.TmfStatisticsTreeNodeTest
10:58:57 Tests run: 11, Failures: 0, Errors: 0, Skipped: 0, Time elapsed: 0.004 sec - in org.eclipse.tracecompass.tmf.ui.tests.statistics.TmfStatisticsTreeNodeTest
10:58:57 testgetName(org.eclipse.tracecompass.tmf.ui.tests.statistics.TmfStatisticsTreeNodeTest)  Time elapsed: 0 sec
10:58:57 testGetValue(org.eclipse.tracecompass.tmf.ui.tests.statistics.TmfStatisticsTreeNodeTest)  Time elapsed: 0 sec
10:58:57 testResetTimeRangeValue(org.eclipse.tracecompass.tmf.ui.tests.statistics.TmfStatisticsTreeNodeTest)  Time elapsed: 0 sec
10:58:57 testGetChildren(org.eclipse.tracecompass.tmf.ui.tests.statistics.TmfStatisticsTreeNodeTest)  Time elapsed: 0.001 sec
10:58:57 testReset(org.eclipse.tracecompass.tmf.ui.tests.statistics.TmfStatisticsTreeNodeTest)  Time elapsed: 0 sec
10:58:57 testGetPath(org.eclipse.tracecompass.tmf.ui.tests.statistics.TmfStatisticsTreeNodeTest)  Time elapsed: 0 sec
10:58:57 testResetGlobalValue(org.eclipse.tracecompass.tmf.ui.tests.statistics.TmfStatisticsTreeNodeTest)  Time elapsed: 0 sec
10:58:57 testHasChildren(org.eclipse.tracecompass.tmf.ui.tests.statistics.TmfStatisticsTreeNodeTest)  Time elapsed: 0 sec
10:58:57 testContainsChild(org.eclipse.tracecompass.tmf.ui.tests.statistics.TmfStatisticsTreeNodeTest)  Time elapsed: 0 sec
10:58:57 testGetParent(org.eclipse.tracecompass.tmf.ui.tests.statistics.TmfStatisticsTreeNodeTest)  Time elapsed: 0 sec
10:58:57 testGetNbChildren(org.eclipse.tracecompass.tmf.ui.tests.statistics.TmfStatisticsTreeNodeTest)  Time elapsed: 0 sec
10:58:57 Running org.eclipse.tracecompass.tmf.ui.tests.statistics.TmfTreeContentProviderTest
10:58:57 Tests run: 4, Failures: 0, Errors: 0, Skipped: 0, Time elapsed: 0.003 sec - in org.eclipse.tracecompass.tmf.ui.tests.statistics.TmfTreeContentProviderTest
10:58:57 testGetChildren(org.eclipse.tracecompass.tmf.ui.tests.statistics.TmfTreeContentProviderTest)  Time elapsed: 0.001 sec
10:58:57 testHasChildren(org.eclipse.tracecompass.tmf.ui.tests.statistics.TmfTreeContentProviderTest)  Time elapsed: 0 sec
10:58:57 testGetParent(org.eclipse.tracecompass.tmf.ui.tests.statistics.TmfTreeContentProviderTest)  Time elapsed: 0 sec
10:58:57 testGetElements(org.eclipse.tracecompass.tmf.ui.tests.statistics.TmfTreeContentProviderTest)  Time elapsed: 0 sec
10:58:57 Running org.eclipse.tracecompass.tmf.ui.tests.actions.SelectTracesOperationTest
10:58:57 Tests run: 2, Failures: 1, Errors: 0, Skipped: 0, Time elapsed: 0.872 sec <<< FAILURE! - in org.eclipse.tracecompass.tmf.ui.tests.actions.SelectTracesOperationTest
10:58:57 testOperationTimeRange(org.eclipse.tracecompass.tmf.ui.tests.actions.SelectTracesOperationTest)  Time elapsed: 0.692 sec  <<< FAILURE!
10:58:57 java.lang.AssertionError: expected:<4> but was:<0>
10:58:57 	at org.junit.Assert.fail(Assert.java:88)
10:58:57 	at org.junit.Assert.failNotEquals(Assert.java:834)
10:58:57 	at org.junit.Assert.assertEquals(Assert.java:645)
10:58:57 	at org.junit.Assert.assertEquals(Assert.java:631)
10:58:57 	at org.eclipse.tracecompass.tmf.ui.tests.actions.SelectTracesOperationTest.validateTracesExperiment(SelectTracesOperationTest.java:182)
10:58:57 	at org.eclipse.tracecompass.tmf.ui.tests.actions.SelectTracesOperationTest.testOperationTimeRange(SelectTracesOperationTest.java:168)
10:58:57 
10:58:57 testBasicOperation(org.eclipse.tracecompass.tmf.ui.tests.actions.SelectTracesOperationTest)  Time elapsed: 0.177 sec
10:58:57 Running org.eclipse.tracecompass.tmf.ui.tests.actions.DownloadTraceHttpHelperTest
10:58:58 Tests run: 3, Failures: 0, Errors: 0, Skipped: 0, Time elapsed: 0.111 sec - in org.eclipse.tracecompass.tmf.ui.tests.actions.DownloadTraceHttpHelperTest
10:58:58 testTraceDownload(org.eclipse.tracecompass.tmf.ui.tests.actions.DownloadTraceHttpHelperTest)  Time elapsed: 0.096 sec
10:58:58 testArchiveTraceDownload(org.eclipse.tracecompass.tmf.ui.tests.actions.DownloadTraceHttpHelperTest)  Time elapsed: 0.005 sec
10:58:58 testMutlipleTracesDownload(org.eclipse.tracecompass.tmf.ui.tests.actions.DownloadTraceHttpHelperTest)  Time elapsed: 0.008 sec
10:58:58 Running org.eclipse.tracecompass.tmf.ui.tests.actions.TraceImportOperationTest
10:59:03 Tests run: 3, Failures: 1, Errors: 0, Skipped: 0, Time elapsed: 5.859 sec <<< FAILURE! - in org.eclipse.tracecompass.tmf.ui.tests.actions.TraceImportOperationTest
10:59:03 testTimeRangeFiltering(org.eclipse.tracecompass.tmf.ui.tests.actions.TraceImportOperationTest)  Time elapsed: 0.335 sec  <<< FAILURE!
10:59:03 java.lang.AssertionError: expected:<4> but was:<0>
10:59:03 	at org.junit.Assert.fail(Assert.java:88)
10:59:03 	at org.junit.Assert.failNotEquals(Assert.java:834)
10:59:03 	at org.junit.Assert.assertEquals(Assert.java:645)
10:59:03 	at org.junit.Assert.assertEquals(Assert.java:631)
10:59:03 	at org.eclipse.tracecompass.tmf.ui.tests.actions.TraceImportOperationTest.testTimeRangeFiltering(TraceImportOperationTest.java:168)
10:59:03 
10:59:03 test(org.eclipse.tracecompass.tmf.ui.tests.actions.TraceImportOperationTest)  Time elapsed: 0.945 sec
10:59:03 testSkipArchiveExtraction(org.eclipse.tracecompass.tmf.ui.tests.actions.TraceImportOperationTest)  Time elapsed: 1.302 sec
10:59:03 Running org.eclipse.tracecompass.tmf.ui.tests.actions.HttpTraceImportOperationTest
10:59:05 Cleaning up unclosed ZipFile for archive /jobs/genie.tracecompass/tracecompass-stable-nightly/workspace/tmf/org.eclipse.tracecompass.tmf.ui.tests/target/work/data/Test Project/.traceHttpImport/syslogs.zip
10:59:05 Tests run: 3, Failures: 0, Errors: 0, Skipped: 0, Time elapsed: 1.333 sec - in org.eclipse.tracecompass.tmf.ui.tests.actions.HttpTraceImportOperationTest
10:59:05 testTraceImport(org.eclipse.tracecompass.tmf.ui.tests.actions.HttpTraceImportOperationTest)  Time elapsed: 0.089 sec
10:59:05 testMultipleTracesImport(org.eclipse.tracecompass.tmf.ui.tests.actions.HttpTraceImportOperationTest)  Time elapsed: 0.405 sec
10:59:05 testArchiveImport(org.eclipse.tracecompass.tmf.ui.tests.actions.HttpTraceImportOperationTest)  Time elapsed: 0.477 sec
10:59:05 Running org.eclipse.tracecompass.tmf.ui.tests.symbols.BasicSymbolProviderTest
10:59:05 Tests run: 1, Failures: 0, Errors: 0, Skipped: 0, Time elapsed: 0.087 sec - in org.eclipse.tracecompass.tmf.ui.tests.symbols.BasicSymbolProviderTest
10:59:05 testBasicProvider(org.eclipse.tracecompass.tmf.ui.tests.symbols.BasicSymbolProviderTest)  Time elapsed: 0.086 sec
10:59:05 Running org.eclipse.tracecompass.tmf.ui.tests.project.model.TmfProjectRegistryTest
10:59:05 
10:59:05 !ENTRY org.eclipse.core.resources 4 372 2018-01-31 10:59:05.690
10:59:05 !MESSAGE Project 'SomeProject' is not open.
10:59:07 
10:59:07 !ENTRY org.eclipse.core.resources 2 2 2018-01-31 10:59:07.105
10:59:07 !MESSAGE Save operation warnings.
10:59:07 !SUBENTRY 1 org.eclipse.core.resources 2 234 2018-01-31 10:59:07.105
10:59:07 !MESSAGE The project description file (.project) for '.tracecompass-SomeProject' was missing.  This file contains important information about the project.  A new project description file has been created, but some information about the project may have been lost.
10:59:07 
10:59:07 !ENTRY org.eclipse.cdt.core 1 0 2018-01-31 10:59:07.124
10:59:07 !MESSAGE Indexed 'SomeProject2' (0 sources, 0 headers) in 0.001 sec: 0 declarations; 0 references; 0 unresolved inclusions; 0 syntax errors; 0 unresolved names (0%)
10:59:07 Tests run: 3, Failures: 0, Errors: 0, Skipped: 0, Time elapsed: 1.81 sec - in org.eclipse.tracecompass.tmf.ui.tests.project.model.TmfProjectRegistryTest
10:59:07 testAddingTracingNature(org.eclipse.tracecompass.tmf.ui.tests.project.model.TmfProjectRegistryTest)  Time elapsed: 1.53 sec
10:59:07 testCreateTracingProject(org.eclipse.tracecompass.tmf.ui.tests.project.model.TmfProjectRegistryTest)  Time elapsed: 0.025 sec
10:59:07 testAddingTracingNatureNotAllowed(org.eclipse.tracecompass.tmf.ui.tests.project.model.TmfProjectRegistryTest)  Time elapsed: 0.001 sec
10:59:07 Running org.eclipse.tracecompass.tmf.ui.tests.project.model.TraceAndExperimentTypeTest
10:59:11 Tests run: 5, Failures: 0, Errors: 0, Skipped: 0, Time elapsed: 4.414 sec - in org.eclipse.tracecompass.tmf.ui.tests.project.model.TraceAndExperimentTypeTest
10:59:11 testExperimentTypeAnalysis(org.eclipse.tracecompass.tmf.ui.tests.project.model.TraceAndExperimentTypeTest)  Time elapsed: 0.733 sec
10:59:11 testDefaultExperimentType(org.eclipse.tracecompass.tmf.ui.tests.project.model.TraceAndExperimentTypeTest)  Time elapsed: 0.652 sec
10:59:11 testNoExperimentTypeChildren(org.eclipse.tracecompass.tmf.ui.tests.project.model.TraceAndExperimentTypeTest)  Time elapsed: 1.563 sec
10:59:11 testExperimentType(org.eclipse.tracecompass.tmf.ui.tests.project.model.TraceAndExperimentTypeTest)  Time elapsed: 0.523 sec
10:59:11 testExperimentTypeChildren(org.eclipse.tracecompass.tmf.ui.tests.project.model.TraceAndExperimentTypeTest)  Time elapsed: 0.94 sec
10:59:11 Running org.eclipse.tracecompass.tmf.ui.tests.project.model.ProjectModelAnalysisTest
10:59:13 Tests run: 3, Failures: 0, Errors: 0, Skipped: 0, Time elapsed: 2.239 sec - in org.eclipse.tracecompass.tmf.ui.tests.project.model.ProjectModelAnalysisTest
10:59:13 testListAnalysis(org.eclipse.tracecompass.tmf.ui.tests.project.model.ProjectModelAnalysisTest)  Time elapsed: 0.227 sec
10:59:13 testPopulate(org.eclipse.tracecompass.tmf.ui.tests.project.model.ProjectModelAnalysisTest)  Time elapsed: 0.16 sec
10:59:13 testInstantiate(org.eclipse.tracecompass.tmf.ui.tests.project.model.ProjectModelAnalysisTest)  Time elapsed: 1.85 sec
10:59:13 Running org.eclipse.tracecompass.tmf.ui.tests.project.model.ProjectModelOutputTest
10:59:18 Tests run: 2, Failures: 0, Errors: 0, Skipped: 0, Time elapsed: 4.339 sec - in org.eclipse.tracecompass.tmf.ui.tests.project.model.ProjectModelOutputTest
10:59:18 testListOutputs(org.eclipse.tracecompass.tmf.ui.tests.project.model.ProjectModelOutputTest)  Time elapsed: 2.823 sec
10:59:18 testOpenView(org.eclipse.tracecompass.tmf.ui.tests.project.model.ProjectModelOutputTest)  Time elapsed: 1.515 sec
10:59:18 Running org.eclipse.tracecompass.tmf.ui.tests.project.model.ProjectModelTraceTest
10:59:18 Tests run: 1, Failures: 0, Errors: 0, Skipped: 0, Time elapsed: 0.418 sec - in org.eclipse.tracecompass.tmf.ui.tests.project.model.ProjectModelTraceTest
10:59:18 testOpenTrace(org.eclipse.tracecompass.tmf.ui.tests.project.model.ProjectModelTraceTest)  Time elapsed: 0.417 sec
10:59:18 Running org.eclipse.tracecompass.tmf.ui.tests.markers.ConfigurableMarkerEventSourceTest
10:59:18 Tests run: 1, Failures: 0, Errors: 0, Skipped: 0, Time elapsed: 0.222 sec - in org.eclipse.tracecompass.tmf.ui.tests.markers.ConfigurableMarkerEventSourceTest
10:59:18 test(org.eclipse.tracecompass.tmf.ui.tests.markers.ConfigurableMarkerEventSourceTest)  Time elapsed: 0.215 sec
10:59:18 Running org.eclipse.tracecompass.tmf.ui.tests.markers.PeriodicMarkerEventSourceTest
10:59:18 Tests run: 11, Failures: 0, Errors: 0, Skipped: 0, Time elapsed: 0.007 sec - in org.eclipse.tracecompass.tmf.ui.tests.markers.PeriodicMarkerEventSourceTest
10:59:18 testNextPreviousIncluded(org.eclipse.tracecompass.tmf.ui.tests.markers.PeriodicMarkerEventSourceTest)  Time elapsed: 0.001 sec
10:59:18 testInvalidRollover(org.eclipse.tracecompass.tmf.ui.tests.markers.PeriodicMarkerEventSourceTest)  Time elapsed: 0 sec
10:59:18 testSmallPeriod(org.eclipse.tracecompass.tmf.ui.tests.markers.PeriodicMarkerEventSourceTest)  Time elapsed: 0 sec
10:59:18 testIsApplicable(org.eclipse.tracecompass.tmf.ui.tests.markers.PeriodicMarkerEventSourceTest)  Time elapsed: 0.002 sec
10:59:18 testAlternateShadingMarkerEventSource(org.eclipse.tracecompass.tmf.ui.tests.markers.PeriodicMarkerEventSourceTest)  Time elapsed: 0 sec
10:59:18 testFractionalPeriod(org.eclipse.tracecompass.tmf.ui.tests.markers.PeriodicMarkerEventSourceTest)  Time elapsed: 0 sec
10:59:18 testReference(org.eclipse.tracecompass.tmf.ui.tests.markers.PeriodicMarkerEventSourceTest)  Time elapsed: 0.001 sec
10:59:18 testRollover(org.eclipse.tracecompass.tmf.ui.tests.markers.PeriodicMarkerEventSourceTest)  Time elapsed: 0 sec
10:59:18 testInvalidPeriod(org.eclipse.tracecompass.tmf.ui.tests.markers.PeriodicMarkerEventSourceTest)  Time elapsed: 0 sec
10:59:18 testLineMarkerEventSource(org.eclipse.tracecompass.tmf.ui.tests.markers.PeriodicMarkerEventSourceTest)  Time elapsed: 0 sec
10:59:18 testResolution(org.eclipse.tracecompass.tmf.ui.tests.markers.PeriodicMarkerEventSourceTest)  Time elapsed: 0.001 sec
10:59:18 Running org.eclipse.tracecompass.tmf.ui.tests.widgets.timegraph.widgets.FormatTimeUtilsTest
10:59:19 Tests run: 2, Failures: 0, Errors: 0, Skipped: 0, Time elapsed: 0.231 sec - in org.eclipse.tracecompass.tmf.ui.tests.widgets.timegraph.widgets.FormatTimeUtilsTest
10:59:19 testFormatTimeRelative(org.eclipse.tracecompass.tmf.ui.tests.widgets.timegraph.widgets.FormatTimeUtilsTest)  Time elapsed: 0.229 sec
10:59:19 testFormatTimeCalendar(org.eclipse.tracecompass.tmf.ui.tests.widgets.timegraph.widgets.FormatTimeUtilsTest)  Time elapsed: 0 sec
10:59:19 Running org.eclipse.tracecompass.tmf.ui.tests.widgets.timegraph.model.TimeGraphEntryTest
10:59:19 Tests run: 19, Failures: 0, Errors: 0, Skipped: 0, Time elapsed: 0.012 sec - in org.eclipse.tracecompass.tmf.ui.tests.widgets.timegraph.model.TimeGraphEntryTest
10:59:19 testAddChildOtherParent(org.eclipse.tracecompass.tmf.ui.tests.widgets.timegraph.model.TimeGraphEntryTest)  Time elapsed: 0.004 sec
10:59:19 testAddEventReplaceLast(org.eclipse.tracecompass.tmf.ui.tests.widgets.timegraph.model.TimeGraphEntryTest)  Time elapsed: 0.002 sec
10:59:19 testAddChildAtPosition(org.eclipse.tracecompass.tmf.ui.tests.widgets.timegraph.model.TimeGraphEntryTest)  Time elapsed: 0 sec
10:59:19 testGetTimeEventsIteratorMixedSplit(org.eclipse.tracecompass.tmf.ui.tests.widgets.timegraph.model.TimeGraphEntryTest)  Time elapsed: 0 sec
10:59:19 testSortChildren(org.eclipse.tracecompass.tmf.ui.tests.widgets.timegraph.model.TimeGraphEntryTest)  Time elapsed: 0.001 sec
10:59:19 testAddEventNulls(org.eclipse.tracecompass.tmf.ui.tests.widgets.timegraph.model.TimeGraphEntryTest)  Time elapsed: 0 sec
10:59:19 testRemoveChild(org.eclipse.tracecompass.tmf.ui.tests.widgets.timegraph.model.TimeGraphEntryTest)  Time elapsed: 0 sec
10:59:19 testGetTimeEventsIteratorMixed(org.eclipse.tracecompass.tmf.ui.tests.widgets.timegraph.model.TimeGraphEntryTest)  Time elapsed: 0 sec
10:59:19 testSortChildrenThenAdd(org.eclipse.tracecompass.tmf.ui.tests.widgets.timegraph.model.TimeGraphEntryTest)  Time elapsed: 0 sec
10:59:19 testAddChild(org.eclipse.tracecompass.tmf.ui.tests.widgets.timegraph.model.TimeGraphEntryTest)  Time elapsed: 0 sec
10:59:19 testAddEvent(org.eclipse.tracecompass.tmf.ui.tests.widgets.timegraph.model.TimeGraphEntryTest)  Time elapsed: 0 sec
10:59:19 testRemoveChildOtherParent(org.eclipse.tracecompass.tmf.ui.tests.widgets.timegraph.model.TimeGraphEntryTest)  Time elapsed: 0 sec
10:59:19 testaddZoomedEvent(org.eclipse.tracecompass.tmf.ui.tests.widgets.timegraph.model.TimeGraphEntryTest)  Time elapsed: 0 sec
10:59:19 testRemoveChildNoParent(org.eclipse.tracecompass.tmf.ui.tests.widgets.timegraph.model.TimeGraphEntryTest)  Time elapsed: 0 sec
10:59:19 testaddZoomedEventPartialRestart(org.eclipse.tracecompass.tmf.ui.tests.widgets.timegraph.model.TimeGraphEntryTest)  Time elapsed: 0 sec
10:59:19 testAddChildSameParent(org.eclipse.tracecompass.tmf.ui.tests.widgets.timegraph.model.TimeGraphEntryTest)  Time elapsed: 0 sec
10:59:19 testaddZoomedEventDuplicate(org.eclipse.tracecompass.tmf.ui.tests.widgets.timegraph.model.TimeGraphEntryTest)  Time elapsed: 0 sec
10:59:19 testaddZoomedEventReplaceLast(org.eclipse.tracecompass.tmf.ui.tests.widgets.timegraph.model.TimeGraphEntryTest)  Time elapsed: 0 sec
10:59:19 testAddZoomedEventNulls(org.eclipse.tracecompass.tmf.ui.tests.widgets.timegraph.model.TimeGraphEntryTest)  Time elapsed: 0 sec
10:59:19 Running org.eclipse.tracecompass.tmf.ui.tests.histogram.HistogramDataModelTest
10:59:19 Tests run: 27, Failures: 0, Errors: 0, Skipped: 0, Time elapsed: 0.037 sec - in org.eclipse.tracecompass.tmf.ui.tests.histogram.HistogramDataModelTest
10:59:19 testHistogramDataModelInt(org.eclipse.tracecompass.tmf.ui.tests.histogram.HistogramDataModelTest)  Time elapsed: 0.001 sec
10:59:19 testScaleTo_0(org.eclipse.tracecompass.tmf.ui.tests.histogram.HistogramDataModelTest)  Time elapsed: 0 sec
10:59:19 testScaleTo_1(org.eclipse.tracecompass.tmf.ui.tests.histogram.HistogramDataModelTest)  Time elapsed: 0.002 sec
10:59:19 testScaleTo_2(org.eclipse.tracecompass.tmf.ui.tests.histogram.HistogramDataModelTest)  Time elapsed: 0 sec
10:59:19 testScaleTo_3(org.eclipse.tracecompass.tmf.ui.tests.histogram.HistogramDataModelTest)  Time elapsed: 0.001 sec
10:59:19 testScaleTo_4(org.eclipse.tracecompass.tmf.ui.tests.histogram.HistogramDataModelTest)  Time elapsed: 0 sec
10:59:19 testScaleTo_5(org.eclipse.tracecompass.tmf.ui.tests.histogram.HistogramDataModelTest)  Time elapsed: 0.002 sec
10:59:19 testScaleTo_6(org.eclipse.tracecompass.tmf.ui.tests.histogram.HistogramDataModelTest)  Time elapsed: 0.001 sec
10:59:19 testScaleTo_7(org.eclipse.tracecompass.tmf.ui.tests.histogram.HistogramDataModelTest)  Time elapsed: 0.001 sec
10:59:19 testClear(org.eclipse.tracecompass.tmf.ui.tests.histogram.HistogramDataModelTest)  Time elapsed: 0 sec
10:59:19 testHistogramDataModel(org.eclipse.tracecompass.tmf.ui.tests.histogram.HistogramDataModelTest)  Time elapsed: 0 sec
10:59:19 testModelListener(org.eclipse.tracecompass.tmf.ui.tests.histogram.HistogramDataModelTest)  Time elapsed: 0.013 sec
10:59:19 testHistogramDataModelCopyConstructor(org.eclipse.tracecompass.tmf.ui.tests.histogram.HistogramDataModelTest)  Time elapsed: 0.004 sec
10:59:19 testLostEventsScaleTo_0(org.eclipse.tracecompass.tmf.ui.tests.histogram.HistogramDataModelTest)  Time elapsed: 0 sec
10:59:19 testLostEventsScaleTo_1(org.eclipse.tracecompass.tmf.ui.tests.histogram.HistogramDataModelTest)  Time elapsed: 0.001 sec
10:59:19 testLostEventsScaleTo_2(org.eclipse.tracecompass.tmf.ui.tests.histogram.HistogramDataModelTest)  Time elapsed: 0 sec
10:59:19 testLostEventsScaleTo_3(org.eclipse.tracecompass.tmf.ui.tests.histogram.HistogramDataModelTest)  Time elapsed: 0 sec
10:59:19 testLostEventsScaleTo_4(org.eclipse.tracecompass.tmf.ui.tests.histogram.HistogramDataModelTest)  Time elapsed: 0 sec
10:59:19 testCountEvent_0(org.eclipse.tracecompass.tmf.ui.tests.histogram.HistogramDataModelTest)  Time elapsed: 0 sec
10:59:19 testCountEvent_1(org.eclipse.tracecompass.tmf.ui.tests.histogram.HistogramDataModelTest)  Time elapsed: 0 sec
10:59:19 testCountEvent_2(org.eclipse.tracecompass.tmf.ui.tests.histogram.HistogramDataModelTest)  Time elapsed: 0 sec
10:59:19 testCountEvent_3(org.eclipse.tracecompass.tmf.ui.tests.histogram.HistogramDataModelTest)  Time elapsed: 0 sec
10:59:19 testCountEvent_4(org.eclipse.tracecompass.tmf.ui.tests.histogram.HistogramDataModelTest)  Time elapsed: 0.001 sec
10:59:19 testCountEvent_5(org.eclipse.tracecompass.tmf.ui.tests.histogram.HistogramDataModelTest)  Time elapsed: 0 sec
10:59:19 testCountEvent_6(org.eclipse.tracecompass.tmf.ui.tests.histogram.HistogramDataModelTest)  Time elapsed: 0 sec
10:59:19 testScaleToReverse_1(org.eclipse.tracecompass.tmf.ui.tests.histogram.HistogramDataModelTest)  Time elapsed: 0.003 sec
10:59:19 testScaleToReverse_2(org.eclipse.tracecompass.tmf.ui.tests.histogram.HistogramDataModelTest)  Time elapsed: 0.003 sec
10:59:19 
10:59:19 Results :
10:59:19 
10:59:19 Failed tests: 
10:59:19   SelectTracesOperationTest.testOperationTimeRange:168->validateTracesExperiment:182 expected:<4> but was:<0>
10:59:19   TraceImportOperationTest.testTimeRangeFiltering:168 expected:<4> but was:<0>
10:59:19 
10:59:19 Tests run: 167, Failures: 2, Errors: 0, Skipped: 0
10:59:19 
10:59:19 
10:59:19 !ENTRY org.eclipse.core.resources 2 10035 2018-01-31 10:59:19.496
10:59:19 !MESSAGE The workspace will exit with unsaved changes in this session.
10:59:35 [INFO] ------------------------------------------------------------------------
10:59:35 [INFO] Reactor Summary:
10:59:35 [INFO] 
10:59:35 [INFO] Trace Compass Parent ............................... SUCCESS [02:18 min]
10:59:35 [INFO] Trace Compass Tracetype-agnostic Analyses Parent ... SUCCESS [  0.016 s]
10:59:35 [INFO] Trace Compass Common Utilities Parent .............. SUCCESS [  0.015 s]
10:59:35 [INFO] org.eclipse.tracecompass.common.core ............... SUCCESS [ 27.100 s]
10:59:35 [INFO] Trace Compass State System Parent .................. SUCCESS [  0.014 s]
10:59:35 [INFO] org.eclipse.tracecompass.datastore.core ............ SUCCESS [  4.957 s]
10:59:35 [INFO] org.eclipse.tracecompass.segmentstore.core ......... SUCCESS [  4.149 s]
10:59:35 [INFO] org.eclipse.tracecompass.statesystem.core .......... SUCCESS [  8.712 s]
10:59:35 [INFO] Trace Compass TMF Parent ........................... SUCCESS [  0.377 s]
10:59:35 [INFO] org.eclipse.tracecompass.tmf.core .................. SUCCESS [ 12.618 s]
10:59:35 [INFO] org.eclipse.tracecompass.analysis.counters.core .... SUCCESS [  2.706 s]
10:59:35 [INFO] Trace Compass CTF Support Parent ................... SUCCESS [  0.014 s]
10:59:35 [INFO] Trace Compass CTF Parser Plug-in ................... SUCCESS [ 23.397 s]
10:59:35 [INFO] org.eclipse.tracecompass.ctf.core .................. SUCCESS [ 10.275 s]
10:59:35 [INFO] Trace Compass CTF Core Tests Plug-in ............... SUCCESS [01:39 min]
10:59:35 [INFO] org.eclipse.tracecompass.tmf.core.tests ............ SUCCESS [05:58 min]
10:59:35 [INFO] org.eclipse.tracecompass.tmf.ctf.core .............. SUCCESS [  6.530 s]
10:59:35 [INFO] org.eclipse.tracecompass.tmf.ctf.core.tests ........ SUCCESS [07:15 min]
10:59:35 [INFO] org.eclipse.tracecompass.analysis.counters.core.tests SUCCESS [ 20.397 s]
10:59:35 [INFO] org.eclipse.tracecompass.tmf.ui .................... SUCCESS [ 29.238 s]
10:59:35 [INFO] org.eclipse.tracecompass.analysis.counters.ui ...... SUCCESS [  2.797 s]
10:59:35 [INFO] org.eclipse.tracecompass.analysis.graph.core ....... SUCCESS [  2.526 s]
10:59:35 [INFO] org.eclipse.tracecompass.analysis.graph.core.tests . SUCCESS [ 37.528 s]
10:59:35 [INFO] org.eclipse.tracecompass.tmf.chart.core ............ SUCCESS [  3.294 s]
10:59:35 [INFO] org.eclipse.tracecompass.analysis.lami.core ........ SUCCESS [ 12.242 s]
10:59:35 [INFO] org.eclipse.tracecompass.analysis.lami.core.tests .. SUCCESS [ 16.967 s]
10:59:35 [INFO] org.eclipse.tracecompass.tmf.chart.ui .............. SUCCESS [  2.468 s]
10:59:35 [INFO] org.eclipse.tracecompass.analysis.lami.ui .......... SUCCESS [  2.783 s]
10:59:35 [INFO] org.eclipse.tracecompass.analysis.graph.ui ......... SUCCESS [  3.439 s]
10:59:35 [INFO] org.eclipse.tracecompass.analysis.timing.core ...... SUCCESS [  3.783 s]
10:59:35 [INFO] org.eclipse.tracecompass.analysis.os.linux.core .... SUCCESS [  3.789 s]
10:59:35 [INFO] org.eclipse.tracecompass.statesystem.core.tests .... SUCCESS [ 23.841 s]
10:59:35 [INFO] org.eclipse.tracecompass.analysis.os.linux.core.tests SUCCESS [02:06 min]
10:59:35 [INFO] org.eclipse.tracecompass.analysis.timing.ui ........ SUCCESS [  4.125 s]
10:59:35 [INFO] org.eclipse.tracecompass.analysis.os.linux.ui ...... SUCCESS [  3.670 s]
10:59:35 [INFO] org.eclipse.tracecompass.analysis.os.linux.ui.tests  SUCCESS [ 20.963 s]
10:59:35 [INFO] org.eclipse.tracecompass.analysis.timing.core.tests  SUCCESS [ 19.168 s]
10:59:35 [INFO] org.eclipse.tracecompass.tmf.ui.tests .............. FAILURE [03:20 min]
10:59:35 [INFO] org.eclipse.tracecompass.tmf.ui.swtbot.tests ....... SKIPPED
10:59:35 [INFO] Trace Compass LTTng Support Parent ................. SKIPPED
10:59:35 [INFO] org.eclipse.tracecompass.lttng2.common.core ........ SKIPPED
10:59:35 [INFO] org.eclipse.tracecompass.tmf.analysis.xml.core ..... SKIPPED
10:59:35 [INFO] org.eclipse.tracecompass.lttng2.kernel.core ........ SKIPPED
10:59:35 [INFO] org.eclipse.tracecompass.analysis.counters.ui.swtbot.tests SKIPPED
10:59:35 [INFO] org.eclipse.tracecompass.analysis.timing.ui.swtbot.tests SKIPPED
10:59:35 [INFO] org.eclipse.tracecompass.analysis.os.linux.ui.swtbot.tests SKIPPED
10:59:35 [INFO] org.eclipse.tracecompass.tmf.chart.core.tests ...... SKIPPED
10:59:35 [INFO] org.eclipse.tracecompass.tmf.chart.ui.swtbot.tests . SKIPPED
10:59:35 [INFO] org.eclipse.tracecompass.analysis.lami.ui.swtbot.tests SKIPPED
10:59:35 [INFO] Trace Compass BTF Support Parent ................... SKIPPED
10:59:35 [INFO] org.eclipse.tracecompass.btf.core .................. SKIPPED
10:59:35 [INFO] Trace Compass Documentation ........................ SKIPPED
10:59:35 [INFO] Trace Compass Developer Guide ...................... SKIPPED
10:59:35 [INFO] org.eclipse.tracecompass.tmf.analysis.xml.ui ....... SKIPPED
10:59:35 [INFO] org.eclipse.tracecompass.tmf ....................... SKIPPED
10:59:35 [INFO] org.eclipse.tracecompass.btf.ui .................... SKIPPED
10:59:35 [INFO] org.eclipse.tracecompass.btf ....................... SKIPPED
10:59:35 [INFO] org.eclipse.tracecompass.btf.core.tests ............ SKIPPED
10:59:35 [INFO] org.eclipse.tracecompass.common.core.tests ......... SKIPPED
10:59:35 [INFO] org.eclipse.tracecompass.ctf ....................... SKIPPED
10:59:35 [INFO] org.eclipse.tracecompass.ctf.parser.tests .......... SKIPPED
10:59:35 [INFO] org.eclipse.tracecompass.tmf.ctf ................... SKIPPED
10:59:35 [INFO] org.eclipse.tracecompass.tmf.ctf.ui.swtbot.tests ... SKIPPED
10:59:35 [INFO] Trace Compass User Guide ........................... SKIPPED
10:59:35 [INFO] Trace Compass GDB Tracepoint Analysis User Guide ... SKIPPED
10:59:35 [INFO] Trace Compass RCP User Guide ....................... SKIPPED
10:59:35 [INFO] Trace Compass Pcap User Guide ...................... SKIPPED
10:59:35 [INFO] org.eclipse.tracecompass.examples .................. SKIPPED
10:59:35 [INFO] Trace Compass GDB Tracepoint Analysis Parent ....... SKIPPED
10:59:35 [INFO] org.eclipse.tracecompass.gdbtrace.core ............. SKIPPED
10:59:35 [INFO] org.eclipse.tracecompass.gdbtrace.ui ............... SKIPPED
10:59:35 [INFO] org.eclipse.tracecompass.gdbtrace .................. SKIPPED
10:59:35 [INFO] org.eclipse.tracecompass.gdbtrace.core.tests ....... SKIPPED
10:59:35 [INFO] org.eclipse.tracecompass.gdbtrace.ui.tests ......... SKIPPED
10:59:35 [INFO] org.eclipse.tracecompass.lttng2.common.core.tests .. SKIPPED
10:59:35 [INFO] org.eclipse.tracecompass.lttng2.control.core ....... SKIPPED
10:59:35 [INFO] org.eclipse.tracecompass.tmf.remote.core ........... SKIPPED
10:59:35 [INFO] org.eclipse.tracecompass.tmf.remote.ui ............. SKIPPED
10:59:35 [INFO] org.eclipse.tracecompass.lttng2.control.ui ......... SKIPPED
10:59:35 [INFO] org.eclipse.tracecompass.lttng2.control ............ SKIPPED
10:59:35 [INFO] org.eclipse.tracecompass.lttng2.control.core.tests . SKIPPED
10:59:35 [INFO] org.eclipse.tracecompass.tmf.remote.core.tests ..... SKIPPED
10:59:35 [INFO] org.eclipse.tracecompass.lttng2.control.ui.tests ... SKIPPED
10:59:35 [INFO] org.eclipse.tracecompass.lttng2.kernel.ui .......... SKIPPED
10:59:35 [INFO] org.eclipse.tracecompass.lttng2.kernel ............. SKIPPED
10:59:35 [INFO] org.eclipse.tracecompass.lttng2.kernel.core.tests .. SKIPPED
10:59:35 [INFO] org.eclipse.tracecompass.lttng2.ust.core ........... SKIPPED
10:59:35 [INFO] org.eclipse.tracecompass.lttng2.ust.ui ............. SKIPPED
10:59:35 [INFO] org.eclipse.tracecompass.lttng2.ust ................ SKIPPED
10:59:35 [INFO] org.eclipse.tracecompass.lttng2.ust.core.tests ..... SKIPPED
10:59:35 [INFO] org.eclipse.tracecompass.lttng2.ust.ui.tests ....... SKIPPED
10:59:35 [INFO] org.eclipse.tracecompass.lttng2.control.ui.swtbot.tests SKIPPED
10:59:35 [INFO] org.eclipse.tracecompass.lttng2.kernel.ui.swtbot.tests SKIPPED
10:59:35 [INFO] org.eclipse.tracecompass.lttng2.ust.ui.swtbot.tests  SKIPPED
10:59:35 [INFO] Trace Compass Pcap Format Support Parent ........... SKIPPED
10:59:35 [INFO] org.eclipse.tracecompass.pcap.core ................. SKIPPED
10:59:35 [INFO] Trace Compass Pcap Parser Core Tests Plug-in ....... SKIPPED
10:59:35 [INFO] org.eclipse.tracecompass.tmf.pcap.core ............. SKIPPED
10:59:35 [INFO] org.eclipse.tracecompass.tmf.pcap.ui ............... SKIPPED
10:59:35 [INFO] org.eclipse.tracecompass.tmf.pcap .................. SKIPPED
10:59:35 [INFO] org.eclipse.tracecompass.tmf.pcap.core.tests ....... SKIPPED
10:59:35 [INFO] org.eclipse.tracecompass.tmf.pcap.ui.swtbot.tests .. SKIPPED
10:59:35 [INFO] Trace Compass RCP Parent ........................... SKIPPED
10:59:35 [INFO] Trace Compass RCP Branding plug-in ................. SKIPPED
10:59:35 [INFO] Trace Compass RCP Branding Feature ................. SKIPPED
10:59:35 [INFO] org.eclipse.tracecompass.rcp.ui .................... SKIPPED
10:59:35 [INFO] Trace Compass RCP Feature .......................... SKIPPED
10:59:35 [INFO] org.eclipse.tracecompass.rcp.incubator.ui .......... SKIPPED
10:59:35 [INFO] org.eclipse.tracecompass.rcp.incubator ............. SKIPPED
10:59:35 [INFO] Trace Compass RCP Product .......................... SKIPPED
10:59:35 [INFO] Trace Compass RCP Product Tests .................... SKIPPED
10:59:35 [INFO] Trace Compass Release Engineering Parent ........... SKIPPED
10:59:35 [INFO] Trace Compass Target Platform ...................... SKIPPED
10:59:35 [INFO] org.eclipse.tracecompass.tmf.analysis.xml.core.tests SKIPPED
10:59:35 [INFO] org.eclipse.tracecompass.tmf.analysis.xml.ui.swtbot.tests SKIPPED
10:59:35 [INFO] org.eclipse.tracecompass.tmf.remote.ui.swtbot.tests  SKIPPED
10:59:35 [INFO] org.eclipse.tracecompass.tmf.analysis.xml.ui.tests . SKIPPED
10:59:35 [INFO] org.eclipse.tracecompass.tmf.remote.ui.tests ....... SKIPPED
10:59:35 [INFO] org.eclipse.tracecompass.integration.swtbot.tests .. SKIPPED
10:59:35 [INFO] org.eclipse.tracecompass.tmf.chart.ui.tests ........ SKIPPED
10:59:35 [INFO] org.eclipse.tracecompass.datastore.core.tests ...... SKIPPED
10:59:35 [INFO] org.eclipse.tracecompass.segmentstore.core.tests ... SKIPPED
10:59:35 [INFO] Trace Compass All Tests ............................ SKIPPED
10:59:35 [INFO] org.eclipse.tracecompass.testing ................... SKIPPED
10:59:35 [INFO] org.eclipse.tracecompass.tmf.remote ................ SKIPPED
10:59:35 [INFO] Trace Compass Repository ........................... SKIPPED
10:59:35 [INFO] ------------------------------------------------------------------------
10:59:35 [INFO] BUILD FAILURE
10:59:35 [INFO] ------------------------------------------------------------------------
10:59:35 [INFO] Total time: 40:02 min
10:59:35 [INFO] Finished at: 2018-01-31T10:59:35-05:00
10:59:36 [INFO] Final Memory: 217M/2306M
10:59:36 [INFO] ------------------------------------------------------------------------
10:59:36 [ERROR] Failed to execute goal org.eclipse.tycho:tycho-surefire-plugin:1.0.0:test (default-test) on project org.eclipse.tracecompass.tmf.ui.tests: There are test failures.
10:59:36 [ERROR] 
10:59:36 [ERROR] Please refer to /jobs/genie.tracecompass/tracecompass-stable-nightly/workspace/tmf/org.eclipse.tracecompass.tmf.ui.tests/target/surefire-reports for the individual test results.
10:59:36 [ERROR] -> [Help 1]
10:59:36 [ERROR] 
10:59:36 [ERROR] To see the full stack trace of the errors, re-run Maven with the -e switch.
10:59:36 [ERROR] Re-run Maven using the -X switch to enable full debug logging.
10:59:36 [ERROR] 
10:59:36 [ERROR] For more information about the errors and possible solutions, please read the following articles:
10:59:36 [ERROR] [Help 1] http://cwiki.apache.org/confluence/display/MAVEN/MojoFailureException
10:59:36 [ERROR] 
10:59:36 [ERROR] After correcting the problems, you can resume the build with the command
10:59:36 [ERROR]   mvn <goals> -rf :org.eclipse.tracecompass.tmf.ui.tests
10:59:38 Build step 'Invoke top-level Maven targets' marked build as failure
10:59:38 Terminating xvnc.
10:59:39 Sending e-mails to: bernd.hufmann@ericsson.com jean-christian.kouame@ericsson.com
10:59:39 Recording test results
10:59:55 Archiving artifacts
11:00:42 Started calculate disk usage of build
11:00:42 Finished Calculation of disk usage of build in 0 seconds
11:00:42 Started calculate disk usage of workspace
11:00:45 Finished Calculation of disk usage of workspace in  2 second
11:00:45 Finished: FAILURE