UnstableConsole Output

Skipping 6,351 KB.. Full Log
of type 'Button' and with mnemonic 'OK' and with style 'SWT.PUSH')
05:36:59 WARN - Widget is not enabled: (of type 'Button' and with mnemonic 'OK' and with style 'SWT.PUSH')
05:36:59 WARN - Widget is not enabled: (of type 'Button' and with mnemonic 'OK' and with style 'SWT.PUSH')
05:36:59 WARN - Widget is not enabled: (of type 'Button' and with mnemonic 'OK' and with style 'SWT.PUSH')
05:36:59 WARN - Widget is not enabled: (of type 'Button' and with mnemonic 'OK' and with style 'SWT.PUSH')
05:36:59 WARN - Widget is not enabled: (of type 'Button' and with mnemonic 'OK' and with style 'SWT.PUSH')
05:36:59 DEBUG - Clicked on OK
05:36:59 DEBUG - Sent event Selection [13]: SelectionEvent{Button {OK} time=133462080 data=null item=null detail=0 x=0 y=0 width=0 height=0 stateMask=0x0 text=null doit=true} to (of type 'Button' and with mnemonic 'OK' and with style 'SWT.PUSH')
05:36:59 DEBUG - Sent event Selection [13]: SelectionEvent{MenuItem {&Delete	Delete} time=133461737 data=null item=null detail=0 x=0 y=0 width=0 height=0 stateMask=0x0 text=null doit=true} to with mnemonic 'Delete'
05:36:59 Tests run: 4, Failures: 0, Errors: 0, Skipped: 0, Time elapsed: 26.319 sec - in org.eclipse.tracecompass.integration.swtbot.tests.projectexplorer.ProjectExplorerRefreshTest
05:36:59 test16_01RefreshTraceAdded(org.eclipse.tracecompass.integration.swtbot.tests.projectexplorer.ProjectExplorerRefreshTest)  Time elapsed: 0.384 sec
05:36:59 test16_02RefreshOpenedTraceContentModified(org.eclipse.tracecompass.integration.swtbot.tests.projectexplorer.ProjectExplorerRefreshTest)  Time elapsed: 16.888 sec
05:36:59 test16_03RefreshClosedTraceContentModified(org.eclipse.tracecompass.integration.swtbot.tests.projectexplorer.ProjectExplorerRefreshTest)  Time elapsed: 7.316 sec
05:36:59 test16_04RefreshTraceDeleted(org.eclipse.tracecompass.integration.swtbot.tests.projectexplorer.ProjectExplorerRefreshTest)  Time elapsed: 0.412 sec
05:36:59 
05:36:59 Results :
05:36:59 
05:36:59 Tests in error: 
05:36:59   MarkerSetSwtBotTest.testNavigateBetweenMarkers:158 » Timeout Timeout after: 10...
05:36:59 
05:36:59 Tests run: 65, Failures: 0, Errors: 1, Skipped: 0
05:36:59 
05:37:00 
05:37:00 !ENTRY org.eclipse.core.resources 2 10035 2018-06-16 09:37:00.282
05:37:00 !MESSAGE The workspace will exit with unsaved changes in this session.
05:37:00 [ERROR] There are test failures.
05:37:00 
05:37:00 Please refer to /home/hudson/jenkins-slave-tracecompass/workspace/tracecompass-master-nightly-gtk3/releng/org.eclipse.tracecompass.integration.swtbot.tests/target/surefire-reports for the individual test results.
05:37:00 [INFO] 
05:37:00 [INFO] --- jacoco-maven-plugin:0.7.9:report (post-test) @ org.eclipse.tracecompass.integration.swtbot.tests ---
05:37:00 [INFO] Loading execution data file /home/hudson/jenkins-slave-tracecompass/workspace/tracecompass-master-nightly-gtk3/releng/org.eclipse.tracecompass.integration.swtbot.tests/../../target/jacoco.exec
05:37:00 [INFO] Analyzed bundle 'org.eclipse.tracecompass.integration.swtbot.tests' with 10 classes
05:37:00 [INFO] 
05:37:00 [INFO] --- maven-install-plugin:2.5.2:install (default-install) @ org.eclipse.tracecompass.integration.swtbot.tests ---
05:37:00 [INFO] Installing /home/hudson/jenkins-slave-tracecompass/workspace/tracecompass-master-nightly-gtk3/releng/org.eclipse.tracecompass.integration.swtbot.tests/target/org.eclipse.tracecompass.integration.swtbot.tests-1.0.5-SNAPSHOT.jar to /home/hudson/jenkins-slave-tracecompass/workspace/tracecompass-master-nightly-gtk3/.repository/org/eclipse/tracecompass/org.eclipse.tracecompass.integration.swtbot.tests/1.0.5-SNAPSHOT/org.eclipse.tracecompass.integration.swtbot.tests-1.0.5-SNAPSHOT.jar
05:37:00 [INFO] Installing /home/hudson/jenkins-slave-tracecompass/workspace/tracecompass-master-nightly-gtk3/releng/org.eclipse.tracecompass.integration.swtbot.tests/.polyglot.build.properties to /home/hudson/jenkins-slave-tracecompass/workspace/tracecompass-master-nightly-gtk3/.repository/org/eclipse/tracecompass/org.eclipse.tracecompass.integration.swtbot.tests/1.0.5-SNAPSHOT/org.eclipse.tracecompass.integration.swtbot.tests-1.0.5-SNAPSHOT.pom
05:37:00 [INFO] Installing /home/hudson/jenkins-slave-tracecompass/workspace/tracecompass-master-nightly-gtk3/releng/org.eclipse.tracecompass.integration.swtbot.tests/target/org.eclipse.tracecompass.integration.swtbot.tests-1.0.5-SNAPSHOT-sources.jar to /home/hudson/jenkins-slave-tracecompass/workspace/tracecompass-master-nightly-gtk3/.repository/org/eclipse/tracecompass/org.eclipse.tracecompass.integration.swtbot.tests/1.0.5-SNAPSHOT/org.eclipse.tracecompass.integration.swtbot.tests-1.0.5-SNAPSHOT-sources.jar
05:37:00 [INFO] Installing /home/hudson/jenkins-slave-tracecompass/workspace/tracecompass-master-nightly-gtk3/releng/org.eclipse.tracecompass.integration.swtbot.tests/target/org.eclipse.tracecompass.integration.swtbot.tests-1.0.5-SNAPSHOT.jar.pack.gz to /home/hudson/jenkins-slave-tracecompass/workspace/tracecompass-master-nightly-gtk3/.repository/org/eclipse/tracecompass/org.eclipse.tracecompass.integration.swtbot.tests/1.0.5-SNAPSHOT/org.eclipse.tracecompass.integration.swtbot.tests-1.0.5-SNAPSHOT-pack200.jar.pack.gz
05:37:00 [INFO] Installing /home/hudson/jenkins-slave-tracecompass/workspace/tracecompass-master-nightly-gtk3/releng/org.eclipse.tracecompass.integration.swtbot.tests/target/p2content.xml to /home/hudson/jenkins-slave-tracecompass/workspace/tracecompass-master-nightly-gtk3/.repository/org/eclipse/tracecompass/org.eclipse.tracecompass.integration.swtbot.tests/1.0.5-SNAPSHOT/org.eclipse.tracecompass.integration.swtbot.tests-1.0.5-SNAPSHOT-p2metadata.xml
05:37:00 [INFO] Installing /home/hudson/jenkins-slave-tracecompass/workspace/tracecompass-master-nightly-gtk3/releng/org.eclipse.tracecompass.integration.swtbot.tests/target/p2artifacts.xml to /home/hudson/jenkins-slave-tracecompass/workspace/tracecompass-master-nightly-gtk3/.repository/org/eclipse/tracecompass/org.eclipse.tracecompass.integration.swtbot.tests/1.0.5-SNAPSHOT/org.eclipse.tracecompass.integration.swtbot.tests-1.0.5-SNAPSHOT-p2artifacts.xml
05:37:00 [INFO] 
05:37:00 [INFO] --- tycho-p2-plugin:1.1.0:update-local-index (default-update-local-index) @ org.eclipse.tracecompass.integration.swtbot.tests ---
05:37:00 [INFO]                                                                         
05:37:00 [INFO] ------------------------------------------------------------------------
05:37:00 [INFO] Building org.eclipse.tracecompass.tmf.chart.ui.tests 1.0.0-SNAPSHOT
05:37:00 [INFO] ------------------------------------------------------------------------
05:37:01 [INFO] 
05:37:01 [INFO] --- maven-clean-plugin:3.0.0:clean (default-clean) @ org.eclipse.tracecompass.tmf.chart.ui.tests ---
05:37:01 [INFO] Deleting /home/hudson/jenkins-slave-tracecompass/workspace/tracecompass-master-nightly-gtk3/tmf/org.eclipse.tracecompass.tmf.chart.ui.tests/target
05:37:01 [INFO] 
05:37:01 [INFO] --- tycho-packaging-plugin:1.1.0:build-qualifier (default-build-qualifier) @ org.eclipse.tracecompass.tmf.chart.ui.tests ---
05:37:01 [INFO] The project's OSGi version is 1.0.0.201806160800
05:37:01 [INFO] 
05:37:01 [INFO] --- tycho-packaging-plugin:1.1.0:validate-id (default-validate-id) @ org.eclipse.tracecompass.tmf.chart.ui.tests ---
05:37:01 [INFO] 
05:37:01 [INFO] --- tycho-packaging-plugin:1.1.0:validate-version (default-validate-version) @ org.eclipse.tracecompass.tmf.chart.ui.tests ---
05:37:01 [INFO] 
05:37:01 [INFO] --- maven-enforcer-plugin:1.4.1:enforce (enforce-maven-version) @ org.eclipse.tracecompass.tmf.chart.ui.tests ---
05:37:01 [INFO] 
05:37:01 [INFO] --- jacoco-maven-plugin:0.7.9:prepare-agent (pre-test) @ org.eclipse.tracecompass.tmf.chart.ui.tests ---
05:37:01 [INFO] tycho.testArgLine set to -javaagent:/home/hudson/jenkins-slave-tracecompass/workspace/tracecompass-master-nightly-gtk3/.repository/org/jacoco/org.jacoco.agent/0.7.9/org.jacoco.agent-0.7.9-runtime.jar=destfile=/home/hudson/jenkins-slave-tracecompass/workspace/tracecompass-master-nightly-gtk3/tmf/org.eclipse.tracecompass.tmf.chart.ui.tests/../../target/jacoco.exec,append=true,includes=org.eclipse.tracecompass.*
05:37:01 [INFO] 
05:37:01 [INFO] --- maven-resources-plugin:3.0.2:resources (default-resources) @ org.eclipse.tracecompass.tmf.chart.ui.tests ---
05:37:01 [INFO] Using 'UTF-8' encoding to copy filtered resources.
05:37:01 [INFO] skip non existing resourceDirectory /home/hudson/jenkins-slave-tracecompass/workspace/tracecompass-master-nightly-gtk3/tmf/org.eclipse.tracecompass.tmf.chart.ui.tests/src/main/resources
05:37:01 [INFO] 
05:37:01 [INFO] --- tycho-compiler-plugin:1.1.0:compile (default-compile) @ org.eclipse.tracecompass.tmf.chart.ui.tests ---
05:37:01 [INFO] Compiling 2 source files to /home/hudson/jenkins-slave-tracecompass/workspace/tracecompass-master-nightly-gtk3/tmf/org.eclipse.tracecompass.tmf.chart.ui.tests/target/classes
05:37:02 [INFO] 
05:37:02 [INFO] --- maven-resources-plugin:3.0.2:testResources (default-testResources) @ org.eclipse.tracecompass.tmf.chart.ui.tests ---
05:37:02 [INFO] Using 'UTF-8' encoding to copy filtered resources.
05:37:02 [INFO] skip non existing resourceDirectory /home/hudson/jenkins-slave-tracecompass/workspace/tracecompass-master-nightly-gtk3/tmf/org.eclipse.tracecompass.tmf.chart.ui.tests/src/test/resources
05:37:02 [INFO] 
05:37:02 [INFO] --- tycho-source-plugin:1.1.0:plugin-source (plugin-source) @ org.eclipse.tracecompass.tmf.chart.ui.tests ---
05:37:02 [INFO] Building jar: /home/hudson/jenkins-slave-tracecompass/workspace/tracecompass-master-nightly-gtk3/tmf/org.eclipse.tracecompass.tmf.chart.ui.tests/target/org.eclipse.tracecompass.tmf.chart.ui.tests-1.0.0-SNAPSHOT-sources.jar
05:37:02 [INFO] 
05:37:02 [INFO] --- target-platform-configuration:1.1.0:target-platform (default-target-platform) @ org.eclipse.tracecompass.tmf.chart.ui.tests ---
05:37:02 [INFO] 
05:37:02 [INFO] --- tycho-packaging-plugin:1.1.0:package-plugin (default-package-plugin) @ org.eclipse.tracecompass.tmf.chart.ui.tests ---
05:37:02 [INFO] Building jar: /home/hudson/jenkins-slave-tracecompass/workspace/tracecompass-master-nightly-gtk3/tmf/org.eclipse.tracecompass.tmf.chart.ui.tests/target/org.eclipse.tracecompass.tmf.chart.ui.tests-1.0.0-SNAPSHOT.jar
05:37:02 [INFO] 
05:37:02 [INFO] --- tycho-p2-plugin:1.1.0:p2-metadata-default (default-p2-metadata-default) @ org.eclipse.tracecompass.tmf.chart.ui.tests ---
05:37:02 [INFO] 
05:37:02 [INFO] --- tycho-source-feature-plugin:1.1.0:source-feature (source-feature) @ org.eclipse.tracecompass.tmf.chart.ui.tests ---
05:37:02 [INFO] 
05:37:02 [INFO] --- tycho-pack200b-plugin:1.1.0:pack (pack200-pack) @ org.eclipse.tracecompass.tmf.chart.ui.tests ---
05:37:02 [INFO] Pack200 packing jar /home/hudson/jenkins-slave-tracecompass/workspace/tracecompass-master-nightly-gtk3/tmf/org.eclipse.tracecompass.tmf.chart.ui.tests/target/org.eclipse.tracecompass.tmf.chart.ui.tests-1.0.0-SNAPSHOT.jar
05:37:02 [INFO] 
05:37:02 [INFO] --- tycho-p2-plugin:1.1.0:p2-metadata (p2-metadata) @ org.eclipse.tracecompass.tmf.chart.ui.tests ---
05:37:02 [INFO] 
05:37:02 [INFO] --- tycho-surefire-plugin:1.1.0:test (default-test) @ org.eclipse.tracecompass.tmf.chart.ui.tests ---
05:37:02 [INFO] Expected eclipse log file: /home/hudson/jenkins-slave-tracecompass/workspace/tracecompass-master-nightly-gtk3/tmf/org.eclipse.tracecompass.tmf.chart.ui.tests/target/work/data/.metadata/.log
05:37:02 [INFO] Command line:
05:37:02 	[/shared/common/jdk1.8.0_102/jre/bin/java, -Dosgi.noShutdown=false, -Dosgi.os=linux, -Dosgi.ws=gtk, -Dosgi.arch=x86_64, -javaagent:/home/hudson/jenkins-slave-tracecompass/workspace/tracecompass-master-nightly-gtk3/.repository/org/jacoco/org.jacoco.agent/0.7.9/org.jacoco.agent-0.7.9-runtime.jar=destfile=/home/hudson/jenkins-slave-tracecompass/workspace/tracecompass-master-nightly-gtk3/tmf/org.eclipse.tracecompass.tmf.chart.ui.tests/../../target/jacoco.exec,append=true,includes=org.eclipse.tracecompass.*, -Dorg.eclipse.swt.browser.DefaultType=mozilla, -Xms512m, -Xmx1024m, -Dosgi.clean=true, -jar, /home/hudson/jenkins-slave-tracecompass/workspace/tracecompass-master-nightly-gtk3/.repository/p2/osgi/bundle/org.eclipse.equinox.launcher/1.5.0.v20180512-1130/org.eclipse.equinox.launcher-1.5.0.v20180512-1130.jar, -data, /home/hudson/jenkins-slave-tracecompass/workspace/tracecompass-master-nightly-gtk3/tmf/org.eclipse.tracecompass.tmf.chart.ui.tests/target/work/data, -install, /home/hudson/jenkins-slave-tracecompass/workspace/tracecompass-master-nightly-gtk3/tmf/org.eclipse.tracecompass.tmf.chart.ui.tests/target/work, -configuration, /home/hudson/jenkins-slave-tracecompass/workspace/tracecompass-master-nightly-gtk3/tmf/org.eclipse.tracecompass.tmf.chart.ui.tests/target/work/configuration, -application, org.eclipse.tycho.surefire.osgibooter.uitest, -testproperties, /home/hudson/jenkins-slave-tracecompass/workspace/tracecompass-master-nightly-gtk3/tmf/org.eclipse.tracecompass.tmf.chart.ui.tests/target/surefire.properties, -product, org.eclipse.platform.ide, -consoleLog]
05:37:06 !SESSION 2018-06-16 09:37:03.151 -----------------------------------------------
05:37:06 eclipse.buildId=unknown
05:37:06 java.version=1.8.0_102
05:37:06 java.vendor=Oracle Corporation
05:37:06 BootLoader constants: OS=linux, ARCH=x86_64, WS=gtk, NL=en_US
05:37:06 Framework arguments:  -application org.eclipse.tycho.surefire.osgibooter.uitest -testproperties /home/hudson/jenkins-slave-tracecompass/workspace/tracecompass-master-nightly-gtk3/tmf/org.eclipse.tracecompass.tmf.chart.ui.tests/target/surefire.properties -product org.eclipse.platform.ide
05:37:06 Command-line arguments:  -data /home/hudson/jenkins-slave-tracecompass/workspace/tracecompass-master-nightly-gtk3/tmf/org.eclipse.tracecompass.tmf.chart.ui.tests/target/work/data -application org.eclipse.tycho.surefire.osgibooter.uitest -testproperties /home/hudson/jenkins-slave-tracecompass/workspace/tracecompass-master-nightly-gtk3/tmf/org.eclipse.tracecompass.tmf.chart.ui.tests/target/surefire.properties -product org.eclipse.platform.ide -consoleLog
05:37:06 
05:37:06 !ENTRY org.eclipse.compare.win32 4 0 2018-06-16 09:37:06.431
05:37:06 !MESSAGE FrameworkEvent ERROR
05:37:06 !STACK 0
05:37:06 org.osgi.framework.BundleException: Could not resolve module: org.eclipse.compare.win32 [60]
05:37:06   Unresolved requirement: Require-Capability: eclipse.platform; filter:="(osgi.os=win32)"
05:37:06 
05:37:06 	at org.eclipse.osgi.container.Module.start(Module.java:444)
05:37:06 	at org.eclipse.osgi.container.ModuleContainer$ContainerStartLevel.incStartLevel(ModuleContainer.java:1682)
05:37:06 	at org.eclipse.osgi.container.ModuleContainer$ContainerStartLevel.incStartLevel(ModuleContainer.java:1661)
05:37:06 	at org.eclipse.osgi.container.ModuleContainer$ContainerStartLevel.doContainerStartLevel(ModuleContainer.java:1624)
05:37:06 	at org.eclipse.osgi.container.ModuleContainer$ContainerStartLevel.dispatchEvent(ModuleContainer.java:1555)
05:37:06 	at org.eclipse.osgi.container.ModuleContainer$ContainerStartLevel.dispatchEvent(ModuleContainer.java:1)
05:37:06 	at org.eclipse.osgi.framework.eventmgr.EventManager.dispatchEvent(EventManager.java:230)
05:37:06 	at org.eclipse.osgi.framework.eventmgr.EventManager$EventThread.run(EventManager.java:340)
05:37:16 
05:37:16 -------------------------------------------------------
05:37:16  T E S T S
05:37:17 -------------------------------------------------------
05:37:17 Running org.eclipse.tracecompass.tmf.chart.ui.tests.data.ChartRangeTest
05:37:17 Tests run: 4, Failures: 0, Errors: 0, Skipped: 0, Time elapsed: 0.068 sec - in org.eclipse.tracecompass.tmf.chart.ui.tests.data.ChartRangeTest
05:37:17 testClamp(org.eclipse.tracecompass.tmf.chart.ui.tests.data.ChartRangeTest)  Time elapsed: 0.017 sec
05:37:17 testInvalidConstructor(org.eclipse.tracecompass.tmf.chart.ui.tests.data.ChartRangeTest)  Time elapsed: 0.001 sec
05:37:17 testConstructor(org.eclipse.tracecompass.tmf.chart.ui.tests.data.ChartRangeTest)  Time elapsed: 0 sec
05:37:17 testDefaultConstructor(org.eclipse.tracecompass.tmf.chart.ui.tests.data.ChartRangeTest)  Time elapsed: 0 sec
05:37:17 
05:37:17 Results :
05:37:17 
05:37:17 Tests run: 4, Failures: 0, Errors: 0, Skipped: 0
05:37:17 
05:37:18 [INFO] All tests passed!
05:37:18 [INFO] 
05:37:18 [INFO] --- jacoco-maven-plugin:0.7.9:report (post-test) @ org.eclipse.tracecompass.tmf.chart.ui.tests ---
05:37:18 [INFO] Loading execution data file /home/hudson/jenkins-slave-tracecompass/workspace/tracecompass-master-nightly-gtk3/tmf/org.eclipse.tracecompass.tmf.chart.ui.tests/../../target/jacoco.exec
05:37:18 [INFO] Analyzed bundle 'org.eclipse.tracecompass.tmf.chart.ui.tests' with 2 classes
05:37:18 [INFO] 
05:37:18 [INFO] --- maven-install-plugin:2.5.2:install (default-install) @ org.eclipse.tracecompass.tmf.chart.ui.tests ---
05:37:18 [INFO] Installing /home/hudson/jenkins-slave-tracecompass/workspace/tracecompass-master-nightly-gtk3/tmf/org.eclipse.tracecompass.tmf.chart.ui.tests/target/org.eclipse.tracecompass.tmf.chart.ui.tests-1.0.0-SNAPSHOT.jar to /home/hudson/jenkins-slave-tracecompass/workspace/tracecompass-master-nightly-gtk3/.repository/org/eclipse/tracecompass/org.eclipse.tracecompass.tmf.chart.ui.tests/1.0.0-SNAPSHOT/org.eclipse.tracecompass.tmf.chart.ui.tests-1.0.0-SNAPSHOT.jar
05:37:18 [INFO] Installing /home/hudson/jenkins-slave-tracecompass/workspace/tracecompass-master-nightly-gtk3/tmf/org.eclipse.tracecompass.tmf.chart.ui.tests/.polyglot.build.properties to /home/hudson/jenkins-slave-tracecompass/workspace/tracecompass-master-nightly-gtk3/.repository/org/eclipse/tracecompass/org.eclipse.tracecompass.tmf.chart.ui.tests/1.0.0-SNAPSHOT/org.eclipse.tracecompass.tmf.chart.ui.tests-1.0.0-SNAPSHOT.pom
05:37:18 [INFO] Installing /home/hudson/jenkins-slave-tracecompass/workspace/tracecompass-master-nightly-gtk3/tmf/org.eclipse.tracecompass.tmf.chart.ui.tests/target/org.eclipse.tracecompass.tmf.chart.ui.tests-1.0.0-SNAPSHOT-sources.jar to /home/hudson/jenkins-slave-tracecompass/workspace/tracecompass-master-nightly-gtk3/.repository/org/eclipse/tracecompass/org.eclipse.tracecompass.tmf.chart.ui.tests/1.0.0-SNAPSHOT/org.eclipse.tracecompass.tmf.chart.ui.tests-1.0.0-SNAPSHOT-sources.jar
05:37:18 [INFO] Installing /home/hudson/jenkins-slave-tracecompass/workspace/tracecompass-master-nightly-gtk3/tmf/org.eclipse.tracecompass.tmf.chart.ui.tests/target/org.eclipse.tracecompass.tmf.chart.ui.tests-1.0.0-SNAPSHOT.jar.pack.gz to /home/hudson/jenkins-slave-tracecompass/workspace/tracecompass-master-nightly-gtk3/.repository/org/eclipse/tracecompass/org.eclipse.tracecompass.tmf.chart.ui.tests/1.0.0-SNAPSHOT/org.eclipse.tracecompass.tmf.chart.ui.tests-1.0.0-SNAPSHOT-pack200.jar.pack.gz
05:37:18 [INFO] Installing /home/hudson/jenkins-slave-tracecompass/workspace/tracecompass-master-nightly-gtk3/tmf/org.eclipse.tracecompass.tmf.chart.ui.tests/target/p2content.xml to /home/hudson/jenkins-slave-tracecompass/workspace/tracecompass-master-nightly-gtk3/.repository/org/eclipse/tracecompass/org.eclipse.tracecompass.tmf.chart.ui.tests/1.0.0-SNAPSHOT/org.eclipse.tracecompass.tmf.chart.ui.tests-1.0.0-SNAPSHOT-p2metadata.xml
05:37:18 [INFO] Installing /home/hudson/jenkins-slave-tracecompass/workspace/tracecompass-master-nightly-gtk3/tmf/org.eclipse.tracecompass.tmf.chart.ui.tests/target/p2artifacts.xml to /home/hudson/jenkins-slave-tracecompass/workspace/tracecompass-master-nightly-gtk3/.repository/org/eclipse/tracecompass/org.eclipse.tracecompass.tmf.chart.ui.tests/1.0.0-SNAPSHOT/org.eclipse.tracecompass.tmf.chart.ui.tests-1.0.0-SNAPSHOT-p2artifacts.xml
05:37:18 [INFO] 
05:37:18 [INFO] --- tycho-p2-plugin:1.1.0:update-local-index (default-update-local-index) @ org.eclipse.tracecompass.tmf.chart.ui.tests ---
05:37:19 [INFO]                                                                         
05:37:19 [INFO] ------------------------------------------------------------------------
05:37:19 [INFO] Building org.eclipse.tracecompass.datastore.core.tests 1.0.1-SNAPSHOT
05:37:19 [INFO] ------------------------------------------------------------------------
05:37:19 [INFO] 
05:37:19 [INFO] --- maven-clean-plugin:3.0.0:clean (default-clean) @ org.eclipse.tracecompass.datastore.core.tests ---
05:37:19 [INFO] Deleting /home/hudson/jenkins-slave-tracecompass/workspace/tracecompass-master-nightly-gtk3/statesystem/org.eclipse.tracecompass.datastore.core.tests/target
05:37:19 [INFO] 
05:37:19 [INFO] --- tycho-packaging-plugin:1.1.0:build-qualifier (default-build-qualifier) @ org.eclipse.tracecompass.datastore.core.tests ---
05:37:19 [INFO] The project's OSGi version is 1.0.1.201806160800
05:37:19 [INFO] 
05:37:19 [INFO] --- tycho-packaging-plugin:1.1.0:validate-id (default-validate-id) @ org.eclipse.tracecompass.datastore.core.tests ---
05:37:19 [INFO] 
05:37:19 [INFO] --- tycho-packaging-plugin:1.1.0:validate-version (default-validate-version) @ org.eclipse.tracecompass.datastore.core.tests ---
05:37:19 [INFO] 
05:37:19 [INFO] --- maven-enforcer-plugin:1.4.1:enforce (enforce-maven-version) @ org.eclipse.tracecompass.datastore.core.tests ---
05:37:19 [INFO] 
05:37:19 [INFO] --- jacoco-maven-plugin:0.7.9:prepare-agent (pre-test) @ org.eclipse.tracecompass.datastore.core.tests ---
05:37:19 [INFO] tycho.testArgLine set to -javaagent:/home/hudson/jenkins-slave-tracecompass/workspace/tracecompass-master-nightly-gtk3/.repository/org/jacoco/org.jacoco.agent/0.7.9/org.jacoco.agent-0.7.9-runtime.jar=destfile=/home/hudson/jenkins-slave-tracecompass/workspace/tracecompass-master-nightly-gtk3/statesystem/org.eclipse.tracecompass.datastore.core.tests/../../target/jacoco.exec,append=true,includes=org.eclipse.tracecompass.*
05:37:19 [INFO] 
05:37:19 [INFO] --- maven-resources-plugin:3.0.2:resources (default-resources) @ org.eclipse.tracecompass.datastore.core.tests ---
05:37:19 [INFO] Using 'UTF-8' encoding to copy filtered resources.
05:37:19 [INFO] skip non existing resourceDirectory /home/hudson/jenkins-slave-tracecompass/workspace/tracecompass-master-nightly-gtk3/statesystem/org.eclipse.tracecompass.datastore.core.tests/src/main/resources
05:37:19 [INFO] 
05:37:19 [INFO] --- tycho-compiler-plugin:1.1.0:compile (default-compile) @ org.eclipse.tracecompass.datastore.core.tests ---
05:37:19 [INFO] Compiling 20 source files to /home/hudson/jenkins-slave-tracecompass/workspace/tracecompass-master-nightly-gtk3/statesystem/org.eclipse.tracecompass.datastore.core.tests/target/classes
05:37:20 [WARNING] /home/hudson/jenkins-slave-tracecompass/workspace/tracecompass-master-nightly-gtk3/statesystem/org.eclipse.tracecompass.datastore.core.tests/src/org/eclipse/tracecompass/internal/provisional/datastore/core/historytree/HTNodeTest.java:[253] 
05:37:20 	node.writeSelf(htIo.getFileWriter(node.getSequenceNumber()).getChannel());
05:37:20 	               ^^^^^^^^^^^^^^^^^^^^^^^^^^^^^^^^^^^^^^^^^^^^^^^^^^^^^^^^^
05:37:20 Null type safety (type annotations): The expression of type 'FileChannel' needs unchecked conversion to conform to '@NonNull FileChannel'
05:37:20 [WARNING] /home/hudson/jenkins-slave-tracecompass/workspace/tracecompass-master-nightly-gtk3/statesystem/org.eclipse.tracecompass.datastore.core.tests/src/org/eclipse/tracecompass/internal/provisional/datastore/core/historytree/HTNodeTest.java:[270] 
05:37:20 	htIo.supplyATReader(seqNb).getChannel(),
05:37:20 	^^^^^^^^^^^^^^^^^^^^^^^^^^^^^^^^^^^^^^^
05:37:20 Null type safety (type annotations): The expression of type 'FileChannel' needs unchecked conversion to conform to '@NonNull FileChannel'
05:37:20 2 problems (2 warnings)
05:37:20 [INFO] 
05:37:20 [INFO] --- maven-resources-plugin:3.0.2:testResources (default-testResources) @ org.eclipse.tracecompass.datastore.core.tests ---
05:37:20 [INFO] Using 'UTF-8' encoding to copy filtered resources.
05:37:20 [INFO] skip non existing resourceDirectory /home/hudson/jenkins-slave-tracecompass/workspace/tracecompass-master-nightly-gtk3/statesystem/org.eclipse.tracecompass.datastore.core.tests/src/test/resources
05:37:20 [INFO] 
05:37:20 [INFO] --- tycho-source-plugin:1.1.0:plugin-source (plugin-source) @ org.eclipse.tracecompass.datastore.core.tests ---
05:37:20 [INFO] Building jar: /home/hudson/jenkins-slave-tracecompass/workspace/tracecompass-master-nightly-gtk3/statesystem/org.eclipse.tracecompass.datastore.core.tests/target/org.eclipse.tracecompass.datastore.core.tests-1.0.1-SNAPSHOT-sources.jar
05:37:20 [INFO] 
05:37:20 [INFO] --- target-platform-configuration:1.1.0:target-platform (default-target-platform) @ org.eclipse.tracecompass.datastore.core.tests ---
05:37:20 [INFO] 
05:37:20 [INFO] --- tycho-packaging-plugin:1.1.0:package-plugin (default-package-plugin) @ org.eclipse.tracecompass.datastore.core.tests ---
05:37:20 [INFO] Building jar: /home/hudson/jenkins-slave-tracecompass/workspace/tracecompass-master-nightly-gtk3/statesystem/org.eclipse.tracecompass.datastore.core.tests/target/org.eclipse.tracecompass.datastore.core.tests-1.0.1-SNAPSHOT.jar
05:37:20 [INFO] 
05:37:20 [INFO] --- tycho-p2-plugin:1.1.0:p2-metadata-default (default-p2-metadata-default) @ org.eclipse.tracecompass.datastore.core.tests ---
05:37:20 [INFO] 
05:37:20 [INFO] --- tycho-source-feature-plugin:1.1.0:source-feature (source-feature) @ org.eclipse.tracecompass.datastore.core.tests ---
05:37:20 [INFO] 
05:37:20 [INFO] --- tycho-pack200b-plugin:1.1.0:pack (pack200-pack) @ org.eclipse.tracecompass.datastore.core.tests ---
05:37:20 [INFO] Pack200 packing jar /home/hudson/jenkins-slave-tracecompass/workspace/tracecompass-master-nightly-gtk3/statesystem/org.eclipse.tracecompass.datastore.core.tests/target/org.eclipse.tracecompass.datastore.core.tests-1.0.1-SNAPSHOT.jar
05:37:20 [INFO] 
05:37:20 [INFO] --- tycho-p2-plugin:1.1.0:p2-metadata (p2-metadata) @ org.eclipse.tracecompass.datastore.core.tests ---
05:37:20 [INFO] 
05:37:20 [INFO] --- tycho-surefire-plugin:1.1.0:test (default-test) @ org.eclipse.tracecompass.datastore.core.tests ---
05:37:20 [INFO] Expected eclipse log file: /home/hudson/jenkins-slave-tracecompass/workspace/tracecompass-master-nightly-gtk3/statesystem/org.eclipse.tracecompass.datastore.core.tests/target/work/data/.metadata/.log
05:37:20 [INFO] Command line:
05:37:20 	[/shared/common/jdk1.8.0_102/jre/bin/java, -Dosgi.noShutdown=false, -Dosgi.os=linux, -Dosgi.ws=gtk, -Dosgi.arch=x86_64, -javaagent:/home/hudson/jenkins-slave-tracecompass/workspace/tracecompass-master-nightly-gtk3/.repository/org/jacoco/org.jacoco.agent/0.7.9/org.jacoco.agent-0.7.9-runtime.jar=destfile=/home/hudson/jenkins-slave-tracecompass/workspace/tracecompass-master-nightly-gtk3/statesystem/org.eclipse.tracecompass.datastore.core.tests/../../target/jacoco.exec,append=true,includes=org.eclipse.tracecompass.*, -Dorg.eclipse.swt.browser.DefaultType=mozilla, -Xms512m, -Xmx1024m, -Dosgi.clean=true, -jar, /home/hudson/jenkins-slave-tracecompass/workspace/tracecompass-master-nightly-gtk3/.repository/p2/osgi/bundle/org.eclipse.equinox.launcher/1.5.0.v20180512-1130/org.eclipse.equinox.launcher-1.5.0.v20180512-1130.jar, -data, /home/hudson/jenkins-slave-tracecompass/workspace/tracecompass-master-nightly-gtk3/statesystem/org.eclipse.tracecompass.datastore.core.tests/target/work/data, -install, /home/hudson/jenkins-slave-tracecompass/workspace/tracecompass-master-nightly-gtk3/statesystem/org.eclipse.tracecompass.datastore.core.tests/target/work, -configuration, /home/hudson/jenkins-slave-tracecompass/workspace/tracecompass-master-nightly-gtk3/statesystem/org.eclipse.tracecompass.datastore.core.tests/target/work/configuration, -application, org.eclipse.tycho.surefire.osgibooter.headlesstest, -testproperties, /home/hudson/jenkins-slave-tracecompass/workspace/tracecompass-master-nightly-gtk3/statesystem/org.eclipse.tracecompass.datastore.core.tests/target/surefire.properties, -product, org.eclipse.platform.ide, -consoleLog]
05:37:24 !SESSION 2018-06-16 09:37:21.228 -----------------------------------------------
05:37:24 eclipse.buildId=unknown
05:37:24 java.version=1.8.0_102
05:37:24 java.vendor=Oracle Corporation
05:37:24 BootLoader constants: OS=linux, ARCH=x86_64, WS=gtk, NL=en_US
05:37:24 Framework arguments:  -application org.eclipse.tycho.surefire.osgibooter.headlesstest -testproperties /home/hudson/jenkins-slave-tracecompass/workspace/tracecompass-master-nightly-gtk3/statesystem/org.eclipse.tracecompass.datastore.core.tests/target/surefire.properties -product org.eclipse.platform.ide
05:37:24 Command-line arguments:  -data /home/hudson/jenkins-slave-tracecompass/workspace/tracecompass-master-nightly-gtk3/statesystem/org.eclipse.tracecompass.datastore.core.tests/target/work/data -application org.eclipse.tycho.surefire.osgibooter.headlesstest -testproperties /home/hudson/jenkins-slave-tracecompass/workspace/tracecompass-master-nightly-gtk3/statesystem/org.eclipse.tracecompass.datastore.core.tests/target/surefire.properties -product org.eclipse.platform.ide -consoleLog
05:37:24 
05:37:24 !ENTRY org.eclipse.compare.win32 4 0 2018-06-16 09:37:24.545
05:37:24 !MESSAGE FrameworkEvent ERROR
05:37:24 !STACK 0
05:37:24 org.osgi.framework.BundleException: Could not resolve module: org.eclipse.compare.win32 [47]
05:37:24   Unresolved requirement: Require-Capability: eclipse.platform; filter:="(osgi.os=win32)"
05:37:24 
05:37:24 	at org.eclipse.osgi.container.Module.start(Module.java:444)
05:37:24 	at org.eclipse.osgi.container.ModuleContainer$ContainerStartLevel.incStartLevel(ModuleContainer.java:1682)
05:37:24 	at org.eclipse.osgi.container.ModuleContainer$ContainerStartLevel.incStartLevel(ModuleContainer.java:1661)
05:37:24 	at org.eclipse.osgi.container.ModuleContainer$ContainerStartLevel.doContainerStartLevel(ModuleContainer.java:1624)
05:37:24 	at org.eclipse.osgi.container.ModuleContainer$ContainerStartLevel.dispatchEvent(ModuleContainer.java:1555)
05:37:24 	at org.eclipse.osgi.container.ModuleContainer$ContainerStartLevel.dispatchEvent(ModuleContainer.java:1)
05:37:24 	at org.eclipse.osgi.framework.eventmgr.EventManager.dispatchEvent(EventManager.java:230)
05:37:24 	at org.eclipse.osgi.framework.eventmgr.EventManager$EventThread.run(EventManager.java:340)
05:37:26 
05:37:26 -------------------------------------------------------
05:37:26  T E S T S
05:37:26 -------------------------------------------------------
05:37:27 Running org.eclipse.tracecompass.internal.provisional.datastore.core.historytree.classic.ClassicHistoryTreeTest
05:37:27 Tests run: 5, Failures: 0, Errors: 0, Skipped: 0, Time elapsed: 0.658 sec - in org.eclipse.tracecompass.internal.provisional.datastore.core.historytree.classic.ClassicHistoryTreeTest
05:37:27 testTreeEnd(org.eclipse.tracecompass.internal.provisional.datastore.core.historytree.classic.ClassicHistoryTreeTest)  Time elapsed: 0.258 sec
05:37:27 testNodeSequenceNumbers(org.eclipse.tracecompass.internal.provisional.datastore.core.historytree.classic.ClassicHistoryTreeTest)  Time elapsed: 0.093 sec
05:37:27 testDepth(org.eclipse.tracecompass.internal.provisional.datastore.core.historytree.classic.ClassicHistoryTreeTest)  Time elapsed: 0.135 sec
05:37:27 testReadTree(org.eclipse.tracecompass.internal.provisional.datastore.core.historytree.classic.ClassicHistoryTreeTest)  Time elapsed: 0.079 sec
05:37:27 testSequentialFill(org.eclipse.tracecompass.internal.provisional.datastore.core.historytree.classic.ClassicHistoryTreeTest)  Time elapsed: 0.013 sec
05:37:27 Running org.eclipse.tracecompass.internal.provisional.datastore.core.historytree.HTCoreNodeTest
05:37:28 Tests run: 33, Failures: 0, Errors: 0, Skipped: 0, Time elapsed: 0.506 sec - in org.eclipse.tracecompass.internal.provisional.datastore.core.historytree.HTCoreNodeTest
05:37:28 testGetLatestChild[0: Core node](org.eclipse.tracecompass.internal.provisional.datastore.core.historytree.HTCoreNodeTest)  Time elapsed: 0.001 sec
05:37:28 testLinkNewChild[0: Core node](org.eclipse.tracecompass.internal.provisional.datastore.core.historytree.HTCoreNodeTest)  Time elapsed: 0.006 sec
05:37:28 testGetChild2[0: Core node](org.eclipse.tracecompass.internal.provisional.datastore.core.historytree.HTCoreNodeTest)  Time elapsed: 0.001 sec
05:37:28 testGetLatestChild2[0: Core node](org.eclipse.tracecompass.internal.provisional.datastore.core.historytree.HTCoreNodeTest)  Time elapsed: 0 sec
05:37:28 testAddToCloseNode[0: Core node](org.eclipse.tracecompass.internal.provisional.datastore.core.historytree.HTCoreNodeTest)  Time elapsed: 0 sec
05:37:28 testGetChild[0: Core node](org.eclipse.tracecompass.internal.provisional.datastore.core.historytree.HTCoreNodeTest)  Time elapsed: 0 sec
05:37:28 testNbChildren[0: Core node](org.eclipse.tracecompass.internal.provisional.datastore.core.historytree.HTCoreNodeTest)  Time elapsed: 0 sec
05:37:28 testNodeInvalidAdd[0: Core node](org.eclipse.tracecompass.internal.provisional.datastore.core.historytree.HTCoreNodeTest)  Time elapsed: 0.001 sec
05:37:28 testNodeInvalidEnd[0: Core node](org.eclipse.tracecompass.internal.provisional.datastore.core.historytree.HTCoreNodeTest)  Time elapsed: 0 sec
05:37:28 testCloseNode[0: Core node](org.eclipse.tracecompass.internal.provisional.datastore.core.historytree.HTCoreNodeTest)  Time elapsed: 0.001 sec
05:37:28 testNodeData[0: Core node](org.eclipse.tracecompass.internal.provisional.datastore.core.historytree.HTCoreNodeTest)  Time elapsed: 0 sec
05:37:28 testGetLatestChild[1: Classic core node](org.eclipse.tracecompass.internal.provisional.datastore.core.historytree.HTCoreNodeTest)  Time elapsed: 0 sec
05:37:28 testLinkNewChild[1: Classic core node](org.eclipse.tracecompass.internal.provisional.datastore.core.historytree.HTCoreNodeTest)  Time elapsed: 0.004 sec
05:37:28 testGetChild2[1: Classic core node](org.eclipse.tracecompass.internal.provisional.datastore.core.historytree.HTCoreNodeTest)  Time elapsed: 0 sec
05:37:28 testGetLatestChild2[1: Classic core node](org.eclipse.tracecompass.internal.provisional.datastore.core.historytree.HTCoreNodeTest)  Time elapsed: 0 sec
05:37:28 testAddToCloseNode[1: Classic core node](org.eclipse.tracecompass.internal.provisional.datastore.core.historytree.HTCoreNodeTest)  Time elapsed: 0.001 sec
05:37:28 testGetChild[1: Classic core node](org.eclipse.tracecompass.internal.provisional.datastore.core.historytree.HTCoreNodeTest)  Time elapsed: 0 sec
05:37:28 testNbChildren[1: Classic core node](org.eclipse.tracecompass.internal.provisional.datastore.core.historytree.HTCoreNodeTest)  Time elapsed: 0 sec
05:37:28 testNodeInvalidAdd[1: Classic core node](org.eclipse.tracecompass.internal.provisional.datastore.core.historytree.HTCoreNodeTest)  Time elapsed: 0 sec
05:37:28 testNodeInvalidEnd[1: Classic core node](org.eclipse.tracecompass.internal.provisional.datastore.core.historytree.HTCoreNodeTest)  Time elapsed: 0.001 sec
05:37:28 testCloseNode[1: Classic core node](org.eclipse.tracecompass.internal.provisional.datastore.core.historytree.HTCoreNodeTest)  Time elapsed: 0.002 sec
05:37:28 testNodeData[1: Classic core node](org.eclipse.tracecompass.internal.provisional.datastore.core.historytree.HTCoreNodeTest)  Time elapsed: 0 sec
05:37:28 testGetLatestChild[2: Overlapping core node](org.eclipse.tracecompass.internal.provisional.datastore.core.historytree.HTCoreNodeTest)  Time elapsed: 0.01 sec
05:37:28 testLinkNewChild[2: Overlapping core node](org.eclipse.tracecompass.internal.provisional.datastore.core.historytree.HTCoreNodeTest)  Time elapsed: 0.019 sec
05:37:28 testGetChild2[2: Overlapping core node](org.eclipse.tracecompass.internal.provisional.datastore.core.historytree.HTCoreNodeTest)  Time elapsed: 0 sec
05:37:28 testGetLatestChild2[2: Overlapping core node](org.eclipse.tracecompass.internal.provisional.datastore.core.historytree.HTCoreNodeTest)  Time elapsed: 0.001 sec
05:37:28 testAddToCloseNode[2: Overlapping core node](org.eclipse.tracecompass.internal.provisional.datastore.core.historytree.HTCoreNodeTest)  Time elapsed: 0 sec
05:37:28 testGetChild[2: Overlapping core node](org.eclipse.tracecompass.internal.provisional.datastore.core.historytree.HTCoreNodeTest)  Time elapsed: 0.001 sec
05:37:28 testNbChildren[2: Overlapping core node](org.eclipse.tracecompass.internal.provisional.datastore.core.historytree.HTCoreNodeTest)  Time elapsed: 0 sec
05:37:28 testNodeInvalidAdd[2: Overlapping core node](org.eclipse.tracecompass.internal.provisional.datastore.core.historytree.HTCoreNodeTest)  Time elapsed: 0.001 sec
05:37:28 testNodeInvalidEnd[2: Overlapping core node](org.eclipse.tracecompass.internal.provisional.datastore.core.historytree.HTCoreNodeTest)  Time elapsed: 0 sec
05:37:28 testCloseNode[2: Overlapping core node](org.eclipse.tracecompass.internal.provisional.datastore.core.historytree.HTCoreNodeTest)  Time elapsed: 0.004 sec
05:37:28 testNodeData[2: Overlapping core node](org.eclipse.tracecompass.internal.provisional.datastore.core.historytree.HTCoreNodeTest)  Time elapsed: 0 sec
05:37:28 Running org.eclipse.tracecompass.internal.provisional.datastore.core.historytree.HTNodeTest
05:37:28 Tests run: 27, Failures: 0, Errors: 0, Skipped: 0, Time elapsed: 0.287 sec - in org.eclipse.tracecompass.internal.provisional.datastore.core.historytree.HTNodeTest
05:37:28 testAddToCloseNode[0: Leaf node](org.eclipse.tracecompass.internal.provisional.datastore.core.historytree.HTNodeTest)  Time elapsed: 0 sec
05:37:28 testGetChild[0: Leaf node](org.eclipse.tracecompass.internal.provisional.datastore.core.historytree.HTNodeTest)  Time elapsed: 0 sec
05:37:28 testGetLatestChild[0: Leaf node](org.eclipse.tracecompass.internal.provisional.datastore.core.historytree.HTNodeTest)  Time elapsed: 0 sec
05:37:28 testLinkNewChild[0: Leaf node](org.eclipse.tracecompass.internal.provisional.datastore.core.historytree.HTNodeTest)  Time elapsed: 0.001 sec
05:37:28 testNbChildren[0: Leaf node](org.eclipse.tracecompass.internal.provisional.datastore.core.historytree.HTNodeTest)  Time elapsed: 0 sec
05:37:28 testNodeInvalidAdd[0: Leaf node](org.eclipse.tracecompass.internal.provisional.datastore.core.historytree.HTNodeTest)  Time elapsed: 0 sec
05:37:28 testNodeInvalidEnd[0: Leaf node](org.eclipse.tracecompass.internal.provisional.datastore.core.historytree.HTNodeTest)  Time elapsed: 0 sec
05:37:28 testCloseNode[0: Leaf node](org.eclipse.tracecompass.internal.provisional.datastore.core.historytree.HTNodeTest)  Time elapsed: 0.002 sec
05:37:28 testNodeData[0: Leaf node](org.eclipse.tracecompass.internal.provisional.datastore.core.historytree.HTNodeTest)  Time elapsed: 0 sec
05:37:28 testAddToCloseNode[1: Classic leaf node](org.eclipse.tracecompass.internal.provisional.datastore.core.historytree.HTNodeTest)  Time elapsed: 0 sec
05:37:28 testGetChild[1: Classic leaf node](org.eclipse.tracecompass.internal.provisional.datastore.core.historytree.HTNodeTest)  Time elapsed: 0 sec
05:37:28 testGetLatestChild[1: Classic leaf node](org.eclipse.tracecompass.internal.provisional.datastore.core.historytree.HTNodeTest)  Time elapsed: 0 sec
05:37:28 testLinkNewChild[1: Classic leaf node](org.eclipse.tracecompass.internal.provisional.datastore.core.historytree.HTNodeTest)  Time elapsed: 0.001 sec
05:37:28 testNbChildren[1: Classic leaf node](org.eclipse.tracecompass.internal.provisional.datastore.core.historytree.HTNodeTest)  Time elapsed: 0.001 sec
05:37:28 testNodeInvalidAdd[1: Classic leaf node](org.eclipse.tracecompass.internal.provisional.datastore.core.historytree.HTNodeTest)  Time elapsed: 0 sec
05:37:28 testNodeInvalidEnd[1: Classic leaf node](org.eclipse.tracecompass.internal.provisional.datastore.core.historytree.HTNodeTest)  Time elapsed: 0.001 sec
05:37:28 testCloseNode[1: Classic leaf node](org.eclipse.tracecompass.internal.provisional.datastore.core.historytree.HTNodeTest)  Time elapsed: 0.007 sec
05:37:28 testNodeData[1: Classic leaf node](org.eclipse.tracecompass.internal.provisional.datastore.core.historytree.HTNodeTest)  Time elapsed: 0.001 sec
05:37:28 testAddToCloseNode[2: Overlapping leaf node](org.eclipse.tracecompass.internal.provisional.datastore.core.historytree.HTNodeTest)  Time elapsed: 0 sec
05:37:28 testGetChild[2: Overlapping leaf node](org.eclipse.tracecompass.internal.provisional.datastore.core.historytree.HTNodeTest)  Time elapsed: 0.001 sec
05:37:28 testGetLatestChild[2: Overlapping leaf node](org.eclipse.tracecompass.internal.provisional.datastore.core.historytree.HTNodeTest)  Time elapsed: 0 sec
05:37:28 testLinkNewChild[2: Overlapping leaf node](org.eclipse.tracecompass.internal.provisional.datastore.core.historytree.HTNodeTest)  Time elapsed: 0 sec
05:37:28 testNbChildren[2: Overlapping leaf node](org.eclipse.tracecompass.internal.provisional.datastore.core.historytree.HTNodeTest)  Time elapsed: 0 sec
05:37:28 testNodeInvalidAdd[2: Overlapping leaf node](org.eclipse.tracecompass.internal.provisional.datastore.core.historytree.HTNodeTest)  Time elapsed: 0.001 sec
05:37:28 testNodeInvalidEnd[2: Overlapping leaf node](org.eclipse.tracecompass.internal.provisional.datastore.core.historytree.HTNodeTest)  Time elapsed: 0 sec
05:37:28 testCloseNode[2: Overlapping leaf node](org.eclipse.tracecompass.internal.provisional.datastore.core.historytree.HTNodeTest)  Time elapsed: 0.001 sec
05:37:28 testNodeData[2: Overlapping leaf node](org.eclipse.tracecompass.internal.provisional.datastore.core.historytree.HTNodeTest)  Time elapsed: 0.001 sec
05:37:28 Running org.eclipse.tracecompass.internal.provisional.datastore.core.historytree.overlapping.OverlappingHistoryTreeTest
05:37:28 Tests run: 6, Failures: 0, Errors: 0, Skipped: 0, Time elapsed: 0.277 sec - in org.eclipse.tracecompass.internal.provisional.datastore.core.historytree.overlapping.OverlappingHistoryTreeTest
05:37:28 testInsertions(org.eclipse.tracecompass.internal.provisional.datastore.core.historytree.overlapping.OverlappingHistoryTreeTest)  Time elapsed: 0.062 sec
05:37:28 testTreeEnd(org.eclipse.tracecompass.internal.provisional.datastore.core.historytree.overlapping.OverlappingHistoryTreeTest)  Time elapsed: 0.021 sec
05:37:28 testNodeSequenceNumbers(org.eclipse.tracecompass.internal.provisional.datastore.core.historytree.overlapping.OverlappingHistoryTreeTest)  Time elapsed: 0.031 sec
05:37:28 testDepth(org.eclipse.tracecompass.internal.provisional.datastore.core.historytree.overlapping.OverlappingHistoryTreeTest)  Time elapsed: 0.101 sec
05:37:28 testReadTree(org.eclipse.tracecompass.internal.provisional.datastore.core.historytree.overlapping.OverlappingHistoryTreeTest)  Time elapsed: 0.046 sec
05:37:28 testSequentialFill(org.eclipse.tracecompass.internal.provisional.datastore.core.historytree.overlapping.OverlappingHistoryTreeTest)  Time elapsed: 0.01 sec
05:37:28 Running org.eclipse.tracecompass.internal.provisional.datastore.core.historytree.HistoryTreeStubTest
05:37:29 Tests run: 5, Failures: 0, Errors: 0, Skipped: 0, Time elapsed: 0.399 sec - in org.eclipse.tracecompass.internal.provisional.datastore.core.historytree.HistoryTreeStubTest
05:37:29 testTreeEnd(org.eclipse.tracecompass.internal.provisional.datastore.core.historytree.HistoryTreeStubTest)  Time elapsed: 0.13 sec
05:37:29 testNodeSequenceNumbers(org.eclipse.tracecompass.internal.provisional.datastore.core.historytree.HistoryTreeStubTest)  Time elapsed: 0.027 sec
05:37:29 testDepth(org.eclipse.tracecompass.internal.provisional.datastore.core.historytree.HistoryTreeStubTest)  Time elapsed: 0.131 sec
05:37:29 testReadTree(org.eclipse.tracecompass.internal.provisional.datastore.core.historytree.HistoryTreeStubTest)  Time elapsed: 0.089 sec
05:37:29 testSequentialFill(org.eclipse.tracecompass.internal.provisional.datastore.core.historytree.HistoryTreeStubTest)  Time elapsed: 0.015 sec
05:37:29 Running org.eclipse.tracecompass.internal.datastore.core.serialization.SafeByteBufferWrapperTest
05:37:29 Tests run: 15, Failures: 0, Errors: 0, Skipped: 0, Time elapsed: 0.011 sec - in org.eclipse.tracecompass.internal.datastore.core.serialization.SafeByteBufferWrapperTest
05:37:29 testReadWriteByte(org.eclipse.tracecompass.internal.datastore.core.serialization.SafeByteBufferWrapperTest)  Time elapsed: 0 sec
05:37:29 testReadWriteChar(org.eclipse.tracecompass.internal.datastore.core.serialization.SafeByteBufferWrapperTest)  Time elapsed: 0 sec
05:37:29 testReadWriteLong(org.eclipse.tracecompass.internal.datastore.core.serialization.SafeByteBufferWrapperTest)  Time elapsed: 0 sec
05:37:29 testMainBuffer2(org.eclipse.tracecompass.internal.datastore.core.serialization.SafeByteBufferWrapperTest)  Time elapsed: 0 sec
05:37:29 testMainBuffer3(org.eclipse.tracecompass.internal.datastore.core.serialization.SafeByteBufferWrapperTest)  Time elapsed: 0 sec
05:37:29 testLimit(org.eclipse.tracecompass.internal.datastore.core.serialization.SafeByteBufferWrapperTest)  Time elapsed: 0 sec
05:37:29 testReadWriteFloat(org.eclipse.tracecompass.internal.datastore.core.serialization.SafeByteBufferWrapperTest)  Time elapsed: 0 sec
05:37:29 testReadWriteShort(org.eclipse.tracecompass.internal.datastore.core.serialization.SafeByteBufferWrapperTest)  Time elapsed: 0 sec
05:37:29 testMainBuffer(org.eclipse.tracecompass.internal.datastore.core.serialization.SafeByteBufferWrapperTest)  Time elapsed: 0 sec
05:37:29 testEndianness(org.eclipse.tracecompass.internal.datastore.core.serialization.SafeByteBufferWrapperTest)  Time elapsed: 0.001 sec
05:37:29 testMultipleValues(org.eclipse.tracecompass.internal.datastore.core.serialization.SafeByteBufferWrapperTest)  Time elapsed: 0 sec
05:37:29 testReadWriteDouble(org.eclipse.tracecompass.internal.datastore.core.serialization.SafeByteBufferWrapperTest)  Time elapsed: 0.001 sec
05:37:29 testReadWriteString(org.eclipse.tracecompass.internal.datastore.core.serialization.SafeByteBufferWrapperTest)  Time elapsed: 0 sec
05:37:29 testReadWriteInt(org.eclipse.tracecompass.internal.datastore.core.serialization.SafeByteBufferWrapperTest)  Time elapsed: 0 sec
05:37:29 testReadWriteByteArray(org.eclipse.tracecompass.internal.datastore.core.serialization.SafeByteBufferWrapperTest)  Time elapsed: 0.001 sec
05:37:29 Running org.eclipse.tracecompass.internal.datastore.core.condition.DiscreteTimeRangeConditionTest
05:37:29 Tests run: 6, Failures: 0, Errors: 0, Skipped: 0, Time elapsed: 0.013 sec - in org.eclipse.tracecompass.internal.datastore.core.condition.DiscreteTimeRangeConditionTest
05:37:29 testSubCondition(org.eclipse.tracecompass.internal.datastore.core.condition.DiscreteTimeRangeConditionTest)  Time elapsed: 0 sec
05:37:29 testPredicate(org.eclipse.tracecompass.internal.datastore.core.condition.DiscreteTimeRangeConditionTest)  Time elapsed: 0.001 sec
05:37:29 testPredicateAndAdd(org.eclipse.tracecompass.internal.datastore.core.condition.DiscreteTimeRangeConditionTest)  Time elapsed: 0 sec
05:37:29 testBounds(org.eclipse.tracecompass.internal.datastore.core.condition.DiscreteTimeRangeConditionTest)  Time elapsed: 0 sec
05:37:29 testIntersects(org.eclipse.tracecompass.internal.datastore.core.condition.DiscreteTimeRangeConditionTest)  Time elapsed: 0 sec
05:37:29 testConstructor(org.eclipse.tracecompass.internal.datastore.core.condition.DiscreteTimeRangeConditionTest)  Time elapsed: 0 sec
05:37:29 Running org.eclipse.tracecompass.internal.datastore.core.condition.DiscreteIntegerRangeConditionTest
05:37:29 Tests run: 6, Failures: 0, Errors: 0, Skipped: 0, Time elapsed: 0.003 sec - in org.eclipse.tracecompass.internal.datastore.core.condition.DiscreteIntegerRangeConditionTest
05:37:29 testSubCondition(org.eclipse.tracecompass.internal.datastore.core.condition.DiscreteIntegerRangeConditionTest)  Time elapsed: 0 sec
05:37:29 testPredicate(org.eclipse.tracecompass.internal.datastore.core.condition.DiscreteIntegerRangeConditionTest)  Time elapsed: 0 sec
05:37:29 testPredicateAndAdd(org.eclipse.tracecompass.internal.datastore.core.condition.DiscreteIntegerRangeConditionTest)  Time elapsed: 0 sec
05:37:29 testBounds(org.eclipse.tracecompass.internal.datastore.core.condition.DiscreteIntegerRangeConditionTest)  Time elapsed: 0 sec
05:37:29 testIntersects(org.eclipse.tracecompass.internal.datastore.core.condition.DiscreteIntegerRangeConditionTest)  Time elapsed: 0 sec
05:37:29 testConstructor(org.eclipse.tracecompass.internal.datastore.core.condition.DiscreteIntegerRangeConditionTest)  Time elapsed: 0 sec
05:37:29 Running org.eclipse.tracecompass.internal.datastore.core.condition.ContinuousTimeRangeConditionTest
05:37:29 Tests run: 5, Failures: 0, Errors: 0, Skipped: 0, Time elapsed: 0.007 sec - in org.eclipse.tracecompass.internal.datastore.core.condition.ContinuousTimeRangeConditionTest
05:37:29 testSubCondition(org.eclipse.tracecompass.internal.datastore.core.condition.ContinuousTimeRangeConditionTest)  Time elapsed: 0 sec
05:37:29 testPredicate(org.eclipse.tracecompass.internal.datastore.core.condition.ContinuousTimeRangeConditionTest)  Time elapsed: 0 sec
05:37:29 testBounds(org.eclipse.tracecompass.internal.datastore.core.condition.ContinuousTimeRangeConditionTest)  Time elapsed: 0 sec
05:37:29 testIntersects(org.eclipse.tracecompass.internal.datastore.core.condition.ContinuousTimeRangeConditionTest)  Time elapsed: 0 sec
05:37:29 testConstructor(org.eclipse.tracecompass.internal.datastore.core.condition.ContinuousTimeRangeConditionTest)  Time elapsed: 0 sec
05:37:29 Running org.eclipse.tracecompass.internal.datastore.core.condition.SingletonTimeRangeConditionTest
05:37:29 Tests run: 4, Failures: 0, Errors: 0, Skipped: 0, Time elapsed: 0.001 sec - in org.eclipse.tracecompass.internal.datastore.core.condition.SingletonTimeRangeConditionTest
05:37:29 testSubCondition(org.eclipse.tracecompass.internal.datastore.core.condition.SingletonTimeRangeConditionTest)  Time elapsed: 0 sec
05:37:29 testPredicate(org.eclipse.tracecompass.internal.datastore.core.condition.SingletonTimeRangeConditionTest)  Time elapsed: 0 sec
05:37:29 testBounds(org.eclipse.tracecompass.internal.datastore.core.condition.SingletonTimeRangeConditionTest)  Time elapsed: 0 sec
05:37:29 testIntersects(org.eclipse.tracecompass.internal.datastore.core.condition.SingletonTimeRangeConditionTest)  Time elapsed: 0 sec
05:37:29 Running org.eclipse.tracecompass.internal.datastore.core.historytree.HtIoTest
05:37:29 Tests run: 4, Failures: 0, Errors: 0, Skipped: 0, Time elapsed: 0.047 sec - in org.eclipse.tracecompass.internal.datastore.core.historytree.HtIoTest
05:37:29 testReadWriteNode(org.eclipse.tracecompass.internal.datastore.core.historytree.HtIoTest)  Time elapsed: 0.011 sec
05:37:29 testTooFarData(org.eclipse.tracecompass.internal.datastore.core.historytree.HtIoTest)  Time elapsed: 0.015 sec
05:37:29 testExtraDataSave(org.eclipse.tracecompass.internal.datastore.core.historytree.HtIoTest)  Time elapsed: 0.014 sec
05:37:29 testHeaderDataSave(org.eclipse.tracecompass.internal.datastore.core.historytree.HtIoTest)  Time elapsed: 0.003 sec
05:37:29 
05:37:29 Results :
05:37:29 
05:37:29 Tests run: 116, Failures: 0, Errors: 0, Skipped: 0
05:37:29 
05:37:30 [INFO] All tests passed!
05:37:30 [INFO] 
05:37:30 [INFO] --- jacoco-maven-plugin:0.7.9:report (post-test) @ org.eclipse.tracecompass.datastore.core.tests ---
05:37:30 [INFO] Loading execution data file /home/hudson/jenkins-slave-tracecompass/workspace/tracecompass-master-nightly-gtk3/statesystem/org.eclipse.tracecompass.datastore.core.tests/../../target/jacoco.exec
05:37:30 [INFO] Analyzed bundle 'org.eclipse.tracecompass.datastore.core.tests' with 17 classes
05:37:30 [INFO] 
05:37:30 [INFO] --- maven-install-plugin:2.5.2:install (default-install) @ org.eclipse.tracecompass.datastore.core.tests ---
05:37:30 [INFO] Installing /home/hudson/jenkins-slave-tracecompass/workspace/tracecompass-master-nightly-gtk3/statesystem/org.eclipse.tracecompass.datastore.core.tests/target/org.eclipse.tracecompass.datastore.core.tests-1.0.1-SNAPSHOT.jar to /home/hudson/jenkins-slave-tracecompass/workspace/tracecompass-master-nightly-gtk3/.repository/org/eclipse/tracecompass/org.eclipse.tracecompass.datastore.core.tests/1.0.1-SNAPSHOT/org.eclipse.tracecompass.datastore.core.tests-1.0.1-SNAPSHOT.jar
05:37:30 [INFO] Installing /home/hudson/jenkins-slave-tracecompass/workspace/tracecompass-master-nightly-gtk3/statesystem/org.eclipse.tracecompass.datastore.core.tests/.polyglot.build.properties to /home/hudson/jenkins-slave-tracecompass/workspace/tracecompass-master-nightly-gtk3/.repository/org/eclipse/tracecompass/org.eclipse.tracecompass.datastore.core.tests/1.0.1-SNAPSHOT/org.eclipse.tracecompass.datastore.core.tests-1.0.1-SNAPSHOT.pom
05:37:30 [INFO] Installing /home/hudson/jenkins-slave-tracecompass/workspace/tracecompass-master-nightly-gtk3/statesystem/org.eclipse.tracecompass.datastore.core.tests/target/org.eclipse.tracecompass.datastore.core.tests-1.0.1-SNAPSHOT-sources.jar to /home/hudson/jenkins-slave-tracecompass/workspace/tracecompass-master-nightly-gtk3/.repository/org/eclipse/tracecompass/org.eclipse.tracecompass.datastore.core.tests/1.0.1-SNAPSHOT/org.eclipse.tracecompass.datastore.core.tests-1.0.1-SNAPSHOT-sources.jar
05:37:30 [INFO] Installing /home/hudson/jenkins-slave-tracecompass/workspace/tracecompass-master-nightly-gtk3/statesystem/org.eclipse.tracecompass.datastore.core.tests/target/org.eclipse.tracecompass.datastore.core.tests-1.0.1-SNAPSHOT.jar.pack.gz to /home/hudson/jenkins-slave-tracecompass/workspace/tracecompass-master-nightly-gtk3/.repository/org/eclipse/tracecompass/org.eclipse.tracecompass.datastore.core.tests/1.0.1-SNAPSHOT/org.eclipse.tracecompass.datastore.core.tests-1.0.1-SNAPSHOT-pack200.jar.pack.gz
05:37:30 [INFO] Installing /home/hudson/jenkins-slave-tracecompass/workspace/tracecompass-master-nightly-gtk3/statesystem/org.eclipse.tracecompass.datastore.core.tests/target/p2content.xml to /home/hudson/jenkins-slave-tracecompass/workspace/tracecompass-master-nightly-gtk3/.repository/org/eclipse/tracecompass/org.eclipse.tracecompass.datastore.core.tests/1.0.1-SNAPSHOT/org.eclipse.tracecompass.datastore.core.tests-1.0.1-SNAPSHOT-p2metadata.xml
05:37:30 [INFO] Installing /home/hudson/jenkins-slave-tracecompass/workspace/tracecompass-master-nightly-gtk3/statesystem/org.eclipse.tracecompass.datastore.core.tests/target/p2artifacts.xml to /home/hudson/jenkins-slave-tracecompass/workspace/tracecompass-master-nightly-gtk3/.repository/org/eclipse/tracecompass/org.eclipse.tracecompass.datastore.core.tests/1.0.1-SNAPSHOT/org.eclipse.tracecompass.datastore.core.tests-1.0.1-SNAPSHOT-p2artifacts.xml
05:37:30 [INFO] 
05:37:30 [INFO] --- tycho-p2-plugin:1.1.0:update-local-index (default-update-local-index) @ org.eclipse.tracecompass.datastore.core.tests ---
05:37:30 [INFO]                                                                         
05:37:30 [INFO] ------------------------------------------------------------------------
05:37:30 [INFO] Building org.eclipse.tracecompass.segmentstore.core.tests 1.0.2-SNAPSHOT
05:37:30 [INFO] ------------------------------------------------------------------------
05:37:30 [INFO] 
05:37:30 [INFO] --- maven-clean-plugin:3.0.0:clean (default-clean) @ org.eclipse.tracecompass.segmentstore.core.tests ---
05:37:30 [INFO] Deleting /home/hudson/jenkins-slave-tracecompass/workspace/tracecompass-master-nightly-gtk3/statesystem/org.eclipse.tracecompass.segmentstore.core.tests/target
05:37:30 [INFO] 
05:37:30 [INFO] --- tycho-packaging-plugin:1.1.0:build-qualifier (default-build-qualifier) @ org.eclipse.tracecompass.segmentstore.core.tests ---
05:37:30 [INFO] The project's OSGi version is 1.0.2.201806160800
05:37:30 [INFO] 
05:37:30 [INFO] --- tycho-packaging-plugin:1.1.0:validate-id (default-validate-id) @ org.eclipse.tracecompass.segmentstore.core.tests ---
05:37:30 [INFO] 
05:37:30 [INFO] --- tycho-packaging-plugin:1.1.0:validate-version (default-validate-version) @ org.eclipse.tracecompass.segmentstore.core.tests ---
05:37:30 [INFO] 
05:37:30 [INFO] --- maven-enforcer-plugin:1.4.1:enforce (enforce-maven-version) @ org.eclipse.tracecompass.segmentstore.core.tests ---
05:37:30 [INFO] 
05:37:30 [INFO] --- jacoco-maven-plugin:0.7.9:prepare-agent (pre-test) @ org.eclipse.tracecompass.segmentstore.core.tests ---
05:37:30 [INFO] tycho.testArgLine set to -javaagent:/home/hudson/jenkins-slave-tracecompass/workspace/tracecompass-master-nightly-gtk3/.repository/org/jacoco/org.jacoco.agent/0.7.9/org.jacoco.agent-0.7.9-runtime.jar=destfile=/home/hudson/jenkins-slave-tracecompass/workspace/tracecompass-master-nightly-gtk3/statesystem/org.eclipse.tracecompass.segmentstore.core.tests/../../target/jacoco.exec,append=true,includes=org.eclipse.tracecompass.*
05:37:30 [INFO] 
05:37:30 [INFO] --- maven-resources-plugin:3.0.2:resources (default-resources) @ org.eclipse.tracecompass.segmentstore.core.tests ---
05:37:30 [INFO] Using 'UTF-8' encoding to copy filtered resources.
05:37:30 [INFO] skip non existing resourceDirectory /home/hudson/jenkins-slave-tracecompass/workspace/tracecompass-master-nightly-gtk3/statesystem/org.eclipse.tracecompass.segmentstore.core.tests/src/main/resources
05:37:30 [INFO] 
05:37:30 [INFO] --- tycho-compiler-plugin:1.1.0:compile (default-compile) @ org.eclipse.tracecompass.segmentstore.core.tests ---
05:37:30 [INFO] Compiling 16 source files to /home/hudson/jenkins-slave-tracecompass/workspace/tracecompass-master-nightly-gtk3/statesystem/org.eclipse.tracecompass.segmentstore.core.tests/target/classes
05:37:31 [WARNING] /home/hudson/jenkins-slave-tracecompass/workspace/tracecompass-master-nightly-gtk3/statesystem/org.eclipse.tracecompass.segmentstore.core.tests/src/org/eclipse/tracecompass/segmentstore/core/tests/AbstractTestSegmentStore.java:[232] 
05:37:31 	ISegmentStore<@NonNull TestSegment> other = getSegmentStore(fSegmentStore.toArray(new TestSegment[fSegmentStore.size()]));
05:37:31 	                                                                                  ^^^^^^^^^^^^^^^^^^^^^^^^^^^^^^^^^^^^^
05:37:31 Null type safety (type annotations): The expression of type 'AbstractTestSegmentStore.TestSegment[]' needs unchecked conversion to conform to 'AbstractTestSegmentStore.@NonNull TestSegment @NonNull[]'
05:37:31 [WARNING] /home/hudson/jenkins-slave-tracecompass/workspace/tracecompass-master-nightly-gtk3/statesystem/org.eclipse.tracecompass.segmentstore.core.tests/src/org/eclipse/tracecompass/segmentstore/core/tests/AbstractTestSegmentStore.java:[242] 
05:37:31 	ISegmentStore<@NonNull TestSegment> other = getSegmentStore(REVERSE_SEGMENTS.toArray(new TestSegment[fSegmentStore.size()]));
05:37:31 	                                                                                     ^^^^^^^^^^^^^^^^^^^^^^^^^^^^^^^^^^^^^
05:37:31 Null type safety (type annotations): The expression of type 'AbstractTestSegmentStore.TestSegment[]' needs unchecked conversion to conform to 'AbstractTestSegmentStore.@NonNull TestSegment @NonNull[]'
05:37:31 [WARNING] /home/hudson/jenkins-slave-tracecompass/workspace/tracecompass-master-nightly-gtk3/statesystem/org.eclipse.tracecompass.segmentstore.core.tests/perf/org/eclipse/tracecompass/segmentstore/core/tests/perf/SegmentStoreBigBenchmark.java:[51] 
05:37:31 	{ "HT store", new HistoryTreeSegmentStoreStub<>(Files.createTempFile("tmpSegStore", null), 1, BasicSegment.BASIC_SEGMENT_READ_FACTORY) },
05:37:31 	                                                ^^^^^^^^^^^^^^^^^^^^^^^^^^^^^^^^^^^^^^^^^
05:37:31 Null type safety (type annotations): The expression of type 'Path' needs unchecked conversion to conform to '@NonNull Path'
05:37:31 [WARNING] /home/hudson/jenkins-slave-tracecompass/workspace/tracecompass-master-nightly-gtk3/statesystem/org.eclipse.tracecompass.segmentstore.core.tests/src/org/eclipse/tracecompass/segmentstore/core/tests/TreeMapStoreTest.java:[47] 
05:37:31 	boolean ret = fSegmentStore.add(new TestSegment(segment.getStart(), segment.getEnd(), segment.getPayload()));
05:37:31 	                                                                                      ^^^^^^^^^^^^^^^^^^^^
05:37:31 Null type safety (type annotations): The expression of type 'String' needs unchecked conversion to conform to '@NonNull String'
05:37:31 4 problems (4 warnings)
05:37:31 [INFO] 
05:37:31 [INFO] --- maven-resources-plugin:3.0.2:testResources (default-testResources) @ org.eclipse.tracecompass.segmentstore.core.tests ---
05:37:31 [INFO] Using 'UTF-8' encoding to copy filtered resources.
05:37:31 [INFO] skip non existing resourceDirectory /home/hudson/jenkins-slave-tracecompass/workspace/tracecompass-master-nightly-gtk3/statesystem/org.eclipse.tracecompass.segmentstore.core.tests/src/test/resources
05:37:31 [INFO] 
05:37:31 [INFO] --- tycho-source-plugin:1.1.0:plugin-source (plugin-source) @ org.eclipse.tracecompass.segmentstore.core.tests ---
05:37:31 [INFO] Building jar: /home/hudson/jenkins-slave-tracecompass/workspace/tracecompass-master-nightly-gtk3/statesystem/org.eclipse.tracecompass.segmentstore.core.tests/target/org.eclipse.tracecompass.segmentstore.core.tests-1.0.2-SNAPSHOT-sources.jar
05:37:31 [INFO] 
05:37:31 [INFO] --- target-platform-configuration:1.1.0:target-platform (default-target-platform) @ org.eclipse.tracecompass.segmentstore.core.tests ---
05:37:31 [INFO] 
05:37:31 [INFO] --- tycho-packaging-plugin:1.1.0:package-plugin (default-package-plugin) @ org.eclipse.tracecompass.segmentstore.core.tests ---
05:37:31 [INFO] Building jar: /home/hudson/jenkins-slave-tracecompass/workspace/tracecompass-master-nightly-gtk3/statesystem/org.eclipse.tracecompass.segmentstore.core.tests/target/org.eclipse.tracecompass.segmentstore.core.tests-1.0.2-SNAPSHOT.jar
05:37:31 [INFO] 
05:37:31 [INFO] --- tycho-p2-plugin:1.1.0:p2-metadata-default (default-p2-metadata-default) @ org.eclipse.tracecompass.segmentstore.core.tests ---
05:37:31 [INFO] 
05:37:31 [INFO] --- tycho-source-feature-plugin:1.1.0:source-feature (source-feature) @ org.eclipse.tracecompass.segmentstore.core.tests ---
05:37:31 [INFO] 
05:37:31 [INFO] --- tycho-pack200b-plugin:1.1.0:pack (pack200-pack) @ org.eclipse.tracecompass.segmentstore.core.tests ---
05:37:31 [INFO] Pack200 packing jar /home/hudson/jenkins-slave-tracecompass/workspace/tracecompass-master-nightly-gtk3/statesystem/org.eclipse.tracecompass.segmentstore.core.tests/target/org.eclipse.tracecompass.segmentstore.core.tests-1.0.2-SNAPSHOT.jar
05:37:31 [INFO] 
05:37:31 [INFO] --- tycho-p2-plugin:1.1.0:p2-metadata (p2-metadata) @ org.eclipse.tracecompass.segmentstore.core.tests ---
05:37:31 [INFO] 
05:37:31 [INFO] --- tycho-surefire-plugin:1.1.0:test (default-test) @ org.eclipse.tracecompass.segmentstore.core.tests ---
05:37:31 [INFO] Expected eclipse log file: /home/hudson/jenkins-slave-tracecompass/workspace/tracecompass-master-nightly-gtk3/statesystem/org.eclipse.tracecompass.segmentstore.core.tests/target/work/data/.metadata/.log
05:37:31 [INFO] Command line:
05:37:31 	[/shared/common/jdk1.8.0_102/jre/bin/java, -Dosgi.noShutdown=false, -Dosgi.os=linux, -Dosgi.ws=gtk, -Dosgi.arch=x86_64, -javaagent:/home/hudson/jenkins-slave-tracecompass/workspace/tracecompass-master-nightly-gtk3/.repository/org/jacoco/org.jacoco.agent/0.7.9/org.jacoco.agent-0.7.9-runtime.jar=destfile=/home/hudson/jenkins-slave-tracecompass/workspace/tracecompass-master-nightly-gtk3/statesystem/org.eclipse.tracecompass.segmentstore.core.tests/../../target/jacoco.exec,append=true,includes=org.eclipse.tracecompass.*, -Dorg.eclipse.swt.browser.DefaultType=mozilla, -Xms512m, -Xmx1024m, -Dosgi.clean=true, -jar, /home/hudson/jenkins-slave-tracecompass/workspace/tracecompass-master-nightly-gtk3/.repository/p2/osgi/bundle/org.eclipse.equinox.launcher/1.5.0.v20180512-1130/org.eclipse.equinox.launcher-1.5.0.v20180512-1130.jar, -data, /home/hudson/jenkins-slave-tracecompass/workspace/tracecompass-master-nightly-gtk3/statesystem/org.eclipse.tracecompass.segmentstore.core.tests/target/work/data, -install, /home/hudson/jenkins-slave-tracecompass/workspace/tracecompass-master-nightly-gtk3/statesystem/org.eclipse.tracecompass.segmentstore.core.tests/target/work, -configuration, /home/hudson/jenkins-slave-tracecompass/workspace/tracecompass-master-nightly-gtk3/statesystem/org.eclipse.tracecompass.segmentstore.core.tests/target/work/configuration, -application, org.eclipse.tycho.surefire.osgibooter.headlesstest, -testproperties, /home/hudson/jenkins-slave-tracecompass/workspace/tracecompass-master-nightly-gtk3/statesystem/org.eclipse.tracecompass.segmentstore.core.tests/target/surefire.properties, -product, org.eclipse.platform.ide, -consoleLog]
05:37:35 !SESSION 2018-06-16 09:37:32.002 -----------------------------------------------
05:37:35 eclipse.buildId=unknown
05:37:35 java.version=1.8.0_102
05:37:35 java.vendor=Oracle Corporation
05:37:35 BootLoader constants: OS=linux, ARCH=x86_64, WS=gtk, NL=en_US
05:37:35 Framework arguments:  -application org.eclipse.tycho.surefire.osgibooter.headlesstest -testproperties /home/hudson/jenkins-slave-tracecompass/workspace/tracecompass-master-nightly-gtk3/statesystem/org.eclipse.tracecompass.segmentstore.core.tests/target/surefire.properties -product org.eclipse.platform.ide
05:37:35 Command-line arguments:  -data /home/hudson/jenkins-slave-tracecompass/workspace/tracecompass-master-nightly-gtk3/statesystem/org.eclipse.tracecompass.segmentstore.core.tests/target/work/data -application org.eclipse.tycho.surefire.osgibooter.headlesstest -testproperties /home/hudson/jenkins-slave-tracecompass/workspace/tracecompass-master-nightly-gtk3/statesystem/org.eclipse.tracecompass.segmentstore.core.tests/target/surefire.properties -product org.eclipse.platform.ide -consoleLog
05:37:35 
05:37:35 !ENTRY org.eclipse.compare.win32 4 0 2018-06-16 09:37:35.055
05:37:35 !MESSAGE FrameworkEvent ERROR
05:37:35 !STACK 0
05:37:35 org.osgi.framework.BundleException: Could not resolve module: org.eclipse.compare.win32 [47]
05:37:35   Unresolved requirement: Require-Capability: eclipse.platform; filter:="(osgi.os=win32)"
05:37:35 
05:37:35 	at org.eclipse.osgi.container.Module.start(Module.java:444)
05:37:35 	at org.eclipse.osgi.container.ModuleContainer$ContainerStartLevel.incStartLevel(ModuleContainer.java:1682)
05:37:35 	at org.eclipse.osgi.container.ModuleContainer$ContainerStartLevel.incStartLevel(ModuleContainer.java:1661)
05:37:35 	at org.eclipse.osgi.container.ModuleContainer$ContainerStartLevel.doContainerStartLevel(ModuleContainer.java:1624)
05:37:35 	at org.eclipse.osgi.container.ModuleContainer$ContainerStartLevel.dispatchEvent(ModuleContainer.java:1555)
05:37:35 	at org.eclipse.osgi.container.ModuleContainer$ContainerStartLevel.dispatchEvent(ModuleContainer.java:1)
05:37:35 	at org.eclipse.osgi.framework.eventmgr.EventManager.dispatchEvent(EventManager.java:230)
05:37:35 	at org.eclipse.osgi.framework.eventmgr.EventManager$EventThread.run(EventManager.java:340)
05:37:36 
05:37:36 -------------------------------------------------------
05:37:36  T E S T S
05:37:36 -------------------------------------------------------
05:37:37 Running org.eclipse.tracecompass.segmentstore.core.tests.htStore.HTStoreTest
05:37:38 Tests run: 21, Failures: 0, Errors: 0, Skipped: 0, Time elapsed: 0.876 sec - in org.eclipse.tracecompass.segmentstore.core.tests.htStore.HTStoreTest
05:37:38 testToSpecifyArraySubtype(org.eclipse.tracecompass.segmentstore.core.tests.htStore.HTStoreTest)  Time elapsed: 0.022 sec
05:37:38 testToObjectArray(org.eclipse.tracecompass.segmentstore.core.tests.htStore.HTStoreTest)  Time elapsed: 0.001 sec
05:37:38 testIterationOrderNonSortedInsertion(org.eclipse.tracecompass.segmentstore.core.tests.htStore.HTStoreTest)  Time elapsed: 0.001 sec
05:37:38 testToSpecificArray(org.eclipse.tracecompass.segmentstore.core.tests.htStore.HTStoreTest)  Time elapsed: 0.001 sec
05:37:38 testReadingSegmentStore(org.eclipse.tracecompass.segmentstore.core.tests.htStore.HTStoreTest)  Time elapsed: 0.117 sec
05:37:38 testAddAllConstructor(org.eclipse.tracecompass.segmentstore.core.tests.htStore.HTStoreTest)  Time elapsed: 0.001 sec
05:37:38 testSize(org.eclipse.tracecompass.segmentstore.core.tests.htStore.HTStoreTest)  Time elapsed: 0.003 sec
05:37:38 testIterationOrder(org.eclipse.tracecompass.segmentstore.core.tests.htStore.HTStoreTest)  Time elapsed: 0.019 sec
05:37:38 testRetainAll(org.eclipse.tracecompass.segmentstore.core.tests.htStore.HTStoreTest)  Time elapsed: 0.015 sec
05:37:38 testGetIntersectingElementsTime(org.eclipse.tracecompass.segmentstore.core.tests.htStore.HTStoreTest)  Time elapsed: 0.004 sec
05:37:38 testContains(org.eclipse.tracecompass.segmentstore.core.tests.htStore.HTStoreTest)  Time elapsed: 0.004 sec
05:37:38 testSortedIterator(org.eclipse.tracecompass.segmentstore.core.tests.htStore.HTStoreTest)  Time elapsed: 0.024 sec
05:37:38 testAddAllConstructorOutOfOrder(org.eclipse.tracecompass.segmentstore.core.tests.htStore.HTStoreTest)  Time elapsed: 0.006 sec
05:37:38 testAddAll(org.eclipse.tracecompass.segmentstore.core.tests.htStore.HTStoreTest)  Time elapsed: 0.022 sec
05:37:38 testDispose(org.eclipse.tracecompass.segmentstore.core.tests.htStore.HTStoreTest)  Time elapsed: 0.012 sec
05:37:38 testIsEmpty(org.eclipse.tracecompass.segmentstore.core.tests.htStore.HTStoreTest)  Time elapsed: 0.006 sec
05:37:38 testRemove(org.eclipse.tracecompass.segmentstore.core.tests.htStore.HTStoreTest)  Time elapsed: 0.01 sec
05:37:38 testAddAllOutOfOrder(org.eclipse.tracecompass.segmentstore.core.tests.htStore.HTStoreTest)  Time elapsed: 0.003 sec
05:37:38 testIterator(org.eclipse.tracecompass.segmentstore.core.tests.htStore.HTStoreTest)  Time elapsed: 0.017 sec
05:37:38 testGetIntersectingElementsRange(org.eclipse.tracecompass.segmentstore.core.tests.htStore.HTStoreTest)  Time elapsed: 0 sec
05:37:38 testRemoveAll(org.eclipse.tracecompass.segmentstore.core.tests.htStore.HTStoreTest)  Time elapsed: 0.01 sec
05:37:38 Running org.eclipse.tracecompass.segmentstore.core.tests.htStore.SegmentTreeCoreNodeTest
05:37:38 Tests run: 14, Failures: 0, Errors: 0, Skipped: 0, Time elapsed: 0.265 sec - in org.eclipse.tracecompass.segmentstore.core.tests.htStore.SegmentTreeCoreNodeTest
05:37:38 testChildren[0: Segment tree core node](org.eclipse.tracecompass.segmentstore.core.tests.htStore.SegmentTreeCoreNodeTest)  Time elapsed: 0.006 sec
05:37:38 testIntersectingChildren[0: Segment tree core node](org.eclipse.tracecompass.segmentstore.core.tests.htStore.SegmentTreeCoreNodeTest)  Time elapsed: 0.005 sec
05:37:38 testSpecifics[0: Segment tree core node](org.eclipse.tracecompass.segmentstore.core.tests.htStore.SegmentTreeCoreNodeTest)  Time elapsed: 0.004 sec
05:37:38 testGetLatestChild[0: Segment tree core node](org.eclipse.tracecompass.segmentstore.core.tests.htStore.SegmentTreeCoreNodeTest)  Time elapsed: 0.001 sec
05:37:38 testLinkNewChild[0: Segment tree core node](org.eclipse.tracecompass.segmentstore.core.tests.htStore.SegmentTreeCoreNodeTest)  Time elapsed: 0.032 sec
05:37:38 testGetChild2[0: Segment tree core node](org.eclipse.tracecompass.segmentstore.core.tests.htStore.SegmentTreeCoreNodeTest)  Time elapsed: 0.001 sec
05:37:38 testGetLatestChild2[0: Segment tree core node](org.eclipse.tracecompass.segmentstore.core.tests.htStore.SegmentTreeCoreNodeTest)  Time elapsed: 0 sec
05:37:38 testAddToCloseNode[0: Segment tree core node](org.eclipse.tracecompass.segmentstore.core.tests.htStore.SegmentTreeCoreNodeTest)  Time elapsed: 0.004 sec
05:37:38 testGetChild[0: Segment tree core node](org.eclipse.tracecompass.segmentstore.core.tests.htStore.SegmentTreeCoreNodeTest)  Time elapsed: 0 sec
05:37:38 testNbChildren[0: Segment tree core node](org.eclipse.tracecompass.segmentstore.core.tests.htStore.SegmentTreeCoreNodeTest)  Time elapsed: 0 sec
05:37:38 testNodeInvalidAdd[0: Segment tree core node](org.eclipse.tracecompass.segmentstore.core.tests.htStore.SegmentTreeCoreNodeTest)  Time elapsed: 0.001 sec
05:37:38 testNodeInvalidEnd[0: Segment tree core node](org.eclipse.tracecompass.segmentstore.core.tests.htStore.SegmentTreeCoreNodeTest)  Time elapsed: 0 sec
05:37:38 testCloseNode[0: Segment tree core node](org.eclipse.tracecompass.segmentstore.core.tests.htStore.SegmentTreeCoreNodeTest)  Time elapsed: 0.004 sec
05:37:38 testNodeData[0: Segment tree core node](org.eclipse.tracecompass.segmentstore.core.tests.htStore.SegmentTreeCoreNodeTest)  Time elapsed: 0.001 sec
05:37:38 Running org.eclipse.tracecompass.segmentstore.core.tests.htStore.SegmentTreeNodeTest
05:37:38 Tests run: 9, Failures: 0, Errors: 0, Skipped: 0, Time elapsed: 0.052 sec - in org.eclipse.tracecompass.segmentstore.core.tests.htStore.SegmentTreeNodeTest
05:37:38 testAddToCloseNode[0: Segment tree node](org.eclipse.tracecompass.segmentstore.core.tests.htStore.SegmentTreeNodeTest)  Time elapsed: 0.001 sec
05:37:38 testGetChild[0: Segment tree node](org.eclipse.tracecompass.segmentstore.core.tests.htStore.SegmentTreeNodeTest)  Time elapsed: 0.001 sec
05:37:38 testGetLatestChild[0: Segment tree node](org.eclipse.tracecompass.segmentstore.core.tests.htStore.SegmentTreeNodeTest)  Time elapsed: 0 sec
05:37:38 testLinkNewChild[0: Segment tree node](org.eclipse.tracecompass.segmentstore.core.tests.htStore.SegmentTreeNodeTest)  Time elapsed: 0 sec
05:37:38 testNbChildren[0: Segment tree node](org.eclipse.tracecompass.segmentstore.core.tests.htStore.SegmentTreeNodeTest)  Time elapsed: 0 sec
05:37:38 testNodeInvalidAdd[0: Segment tree node](org.eclipse.tracecompass.segmentstore.core.tests.htStore.SegmentTreeNodeTest)  Time elapsed: 0 sec
05:37:38 testNodeInvalidEnd[0: Segment tree node](org.eclipse.tracecompass.segmentstore.core.tests.htStore.SegmentTreeNodeTest)  Time elapsed: 0 sec
05:37:38 testCloseNode[0: Segment tree node](org.eclipse.tracecompass.segmentstore.core.tests.htStore.SegmentTreeNodeTest)  Time elapsed: 0.002 sec
05:37:38 testNodeData[0: Segment tree node](org.eclipse.tracecompass.segmentstore.core.tests.htStore.SegmentTreeNodeTest)  Time elapsed: 0 sec
05:37:38 Running org.eclipse.tracecompass.segmentstore.core.tests.htStore.SegmentHistoryTreeTest
05:37:39 Tests run: 8, Failures: 0, Errors: 0, Skipped: 0, Time elapsed: 0.632 sec - in org.eclipse.tracecompass.segmentstore.core.tests.htStore.SegmentHistoryTreeTest
05:37:39 testSizeAndIterator(org.eclipse.tracecompass.segmentstore.core.tests.htStore.SegmentHistoryTreeTest)  Time elapsed: 0.051 sec
05:37:39 testIsEmpty(org.eclipse.tracecompass.segmentstore.core.tests.htStore.SegmentHistoryTreeTest)  Time elapsed: 0.007 sec
05:37:39 testChildrenTimes(org.eclipse.tracecompass.segmentstore.core.tests.htStore.SegmentHistoryTreeTest)  Time elapsed: 0.315 sec
05:37:39 testTreeEnd(org.eclipse.tracecompass.segmentstore.core.tests.htStore.SegmentHistoryTreeTest)  Time elapsed: 0.025 sec
05:37:39 testNodeSequenceNumbers(org.eclipse.tracecompass.segmentstore.core.tests.htStore.SegmentHistoryTreeTest)  Time elapsed: 0.052 sec
05:37:39 testDepth(org.eclipse.tracecompass.segmentstore.core.tests.htStore.SegmentHistoryTreeTest)  Time elapsed: 0.115 sec
05:37:39 testReadTree(org.eclipse.tracecompass.segmentstore.core.tests.htStore.SegmentHistoryTreeTest)  Time elapsed: 0.045 sec
05:37:39 testSequentialFill(org.eclipse.tracecompass.segmentstore.core.tests.htStore.SegmentHistoryTreeTest)  Time elapsed: 0.017 sec
05:37:39 Running org.eclipse.tracecompass.segmentstore.core.tests.ArrayListStoreTest
05:37:39 Tests run: 20, Failures: 0, Errors: 0, Skipped: 0, Time elapsed: 0.04 sec - in org.eclipse.tracecompass.segmentstore.core.tests.ArrayListStoreTest
05:37:39 testSize(org.eclipse.tracecompass.segmentstore.core.tests.ArrayListStoreTest)  Time elapsed: 0 sec
05:37:39 testToSpecifyArraySubtype(org.eclipse.tracecompass.segmentstore.core.tests.ArrayListStoreTest)  Time elapsed: 0.001 sec
05:37:39 testIterationOrder(org.eclipse.tracecompass.segmentstore.core.tests.ArrayListStoreTest)  Time elapsed: 0 sec
05:37:39 testRetainAll(org.eclipse.tracecompass.segmentstore.core.tests.ArrayListStoreTest)  Time elapsed: 0 sec
05:37:39 testGetIntersectingElementsTime(org.eclipse.tracecompass.segmentstore.core.tests.ArrayListStoreTest)  Time elapsed: 0 sec
05:37:39 testToObjectArray(org.eclipse.tracecompass.segmentstore.core.tests.ArrayListStoreTest)  Time elapsed: 0 sec
05:37:39 testContains(org.eclipse.tracecompass.segmentstore.core.tests.ArrayListStoreTest)  Time elapsed: 0 sec
05:37:39 testSortedIterator(org.eclipse.tracecompass.segmentstore.core.tests.ArrayListStoreTest)  Time elapsed: 0.006 sec
05:37:39 testIterationOrderNonSortedInsertion(org.eclipse.tracecompass.segmentstore.core.tests.ArrayListStoreTest)  Time elapsed: 0 sec
05:37:39 testToSpecificArray(org.eclipse.tracecompass.segmentstore.core.tests.ArrayListStoreTest)  Time elapsed: 0 sec
05:37:39 testAddAllConstructorOutOfOrder(org.eclipse.tracecompass.segmentstore.core.tests.ArrayListStoreTest)  Time elapsed: 0.002 sec
05:37:39 testAddAll(org.eclipse.tracecompass.segmentstore.core.tests.ArrayListStoreTest)  Time elapsed: 0.001 sec
05:37:39 testDispose(org.eclipse.tracecompass.segmentstore.core.tests.ArrayListStoreTest)  Time elapsed: 0.001 sec
05:37:39 testIsEmpty(org.eclipse.tracecompass.segmentstore.core.tests.ArrayListStoreTest)  Time elapsed: 0.001 sec
05:37:39 testRemove(org.eclipse.tracecompass.segmentstore.core.tests.ArrayListStoreTest)  Time elapsed: 0 sec
05:37:39 testAddAllOutOfOrder(org.eclipse.tracecompass.segmentstore.core.tests.ArrayListStoreTest)  Time elapsed: 0.001 sec
05:37:39 testIterator(org.eclipse.tracecompass.segmentstore.core.tests.ArrayListStoreTest)  Time elapsed: 0 sec
05:37:39 testGetIntersectingElementsRange(org.eclipse.tracecompass.segmentstore.core.tests.ArrayListStoreTest)  Time elapsed: 0.001 sec
05:37:39 testRemoveAll(org.eclipse.tracecompass.segmentstore.core.tests.ArrayListStoreTest)  Time elapsed: 0 sec
05:37:39 testAddAllConstructor(org.eclipse.tracecompass.segmentstore.core.tests.ArrayListStoreTest)  Time elapsed: 0 sec
05:37:39 Running org.eclipse.tracecompass.segmentstore.core.tests.interfaces.INamedSegmentTest
05:37:39 Tests run: 2, Failures: 0, Errors: 0, Skipped: 0, Time elapsed: 0.014 sec - in org.eclipse.tracecompass.segmentstore.core.tests.interfaces.INamedSegmentTest
05:37:39 testNamedAspect(org.eclipse.tracecompass.segmentstore.core.tests.interfaces.INamedSegmentTest)  Time elapsed: 0.001 sec
05:37:39 testComparator(org.eclipse.tracecompass.segmentstore.core.tests.interfaces.INamedSegmentTest)  Time elapsed: 0.01 sec
05:37:39 Running org.eclipse.tracecompass.segmentstore.core.tests.TreeMapStoreTest
05:37:39 Tests run: 21, Failures: 0, Errors: 0, Skipped: 0, Time elapsed: 0.061 sec - in org.eclipse.tracecompass.segmentstore.core.tests.TreeMapStoreTest
05:37:39 testNoDuplicateElements(org.eclipse.tracecompass.segmentstore.core.tests.TreeMapStoreTest)  Time elapsed: 0.001 sec
05:37:39 testSize(org.eclipse.tracecompass.segmentstore.core.tests.TreeMapStoreTest)  Time elapsed: 0 sec
05:37:39 testToSpecifyArraySubtype(org.eclipse.tracecompass.segmentstore.core.tests.TreeMapStoreTest)  Time elapsed: 0.002 sec
05:37:39 testIterationOrder(org.eclipse.tracecompass.segmentstore.core.tests.TreeMapStoreTest)  Time elapsed: 0.006 sec
05:37:39 testRetainAll(org.eclipse.tracecompass.segmentstore.core.tests.TreeMapStoreTest)  Time elapsed: 0.001 sec
05:37:39 testGetIntersectingElementsTime(org.eclipse.tracecompass.segmentstore.core.tests.TreeMapStoreTest)  Time elapsed: 0.019 sec
05:37:39 testToObjectArray(org.eclipse.tracecompass.segmentstore.core.tests.TreeMapStoreTest)  Time elapsed: 0.001 sec
05:37:39 testContains(org.eclipse.tracecompass.segmentstore.core.tests.TreeMapStoreTest)  Time elapsed: 0 sec
05:37:39 testSortedIterator(org.eclipse.tracecompass.segmentstore.core.tests.TreeMapStoreTest)  Time elapsed: 0.005 sec
05:37:39 testIterationOrderNonSortedInsertion(org.eclipse.tracecompass.segmentstore.core.tests.TreeMapStoreTest)  Time elapsed: 0 sec
05:37:39 testToSpecificArray(org.eclipse.tracecompass.segmentstore.core.tests.TreeMapStoreTest)  Time elapsed: 0 sec
05:37:39 testAddAllConstructorOutOfOrder(org.eclipse.tracecompass.segmentstore.core.tests.TreeMapStoreTest)  Time elapsed: 0.001 sec
05:37:39 testAddAll(org.eclipse.tracecompass.segmentstore.core.tests.TreeMapStoreTest)  Time elapsed: 0 sec
05:37:39 testDispose(org.eclipse.tracecompass.segmentstore.core.tests.TreeMapStoreTest)  Time elapsed: 0 sec
05:37:39 testIsEmpty(org.eclipse.tracecompass.segmentstore.core.tests.TreeMapStoreTest)  Time elapsed: 0 sec
05:37:39 testRemove(org.eclipse.tracecompass.segmentstore.core.tests.TreeMapStoreTest)  Time elapsed: 0 sec
05:37:39 testAddAllOutOfOrder(org.eclipse.tracecompass.segmentstore.core.tests.TreeMapStoreTest)  Time elapsed: 0.004 sec
05:37:39 testIterator(org.eclipse.tracecompass.segmentstore.core.tests.TreeMapStoreTest)  Time elapsed: 0.001 sec
05:37:39 testGetIntersectingElementsRange(org.eclipse.tracecompass.segmentstore.core.tests.TreeMapStoreTest)  Time elapsed: 0.002 sec
05:37:39 testRemoveAll(org.eclipse.tracecompass.segmentstore.core.tests.TreeMapStoreTest)  Time elapsed: 0.001 sec
05:37:39 testAddAllConstructor(org.eclipse.tracecompass.segmentstore.core.tests.TreeMapStoreTest)  Time elapsed: 0.001 sec
05:37:39 Running org.eclipse.tracecompass.segmentstore.core.tests.SegmentStoreFactoryTest
05:37:39 Tests run: 10, Failures: 0, Errors: 0, Skipped: 0, Time elapsed: 0.01 sec - in org.eclipse.tracecompass.segmentstore.core.tests.SegmentStoreFactoryTest
05:37:39 createDoubleDistinct(org.eclipse.tracecompass.segmentstore.core.tests.SegmentStoreFactoryTest)  Time elapsed: 0 sec
05:37:39 simpleCreate(org.eclipse.tracecompass.segmentstore.core.tests.SegmentStoreFactoryTest)  Time elapsed: 0 sec
05:37:39 createTortureTest(org.eclipse.tracecompass.segmentstore.core.tests.SegmentStoreFactoryTest)  Time elapsed: 0.005 sec
05:37:39 createAllDressed(org.eclipse.tracecompass.segmentstore.core.tests.SegmentStoreFactoryTest)  Time elapsed: 0.001 sec
05:37:39 createDistinct(org.eclipse.tracecompass.segmentstore.core.tests.SegmentStoreFactoryTest)  Time elapsed: 0 sec
05:37:39 createDistinctStable(org.eclipse.tracecompass.segmentstore.core.tests.SegmentStoreFactoryTest)  Time elapsed: 0 sec
05:37:39 createFast(org.eclipse.tracecompass.segmentstore.core.tests.SegmentStoreFactoryTest)  Time elapsed: 0 sec
05:37:39 createStable(org.eclipse.tracecompass.segmentstore.core.tests.SegmentStoreFactoryTest)  Time elapsed: 0 sec
05:37:39 createPreloaded(org.eclipse.tracecompass.segmentstore.core.tests.SegmentStoreFactoryTest)  Time elapsed: 0.001 sec
05:37:39 createDistinctFast(org.eclipse.tracecompass.segmentstore.core.tests.SegmentStoreFactoryTest)  Time elapsed: 0 sec
05:37:39 Running org.eclipse.tracecompass.segmentstore.core.tests.LazyArrayListStoreTest
05:37:39 Tests run: 20, Failures: 0, Errors: 0, Skipped: 0, Time elapsed: 0.018 sec - in org.eclipse.tracecompass.segmentstore.core.tests.LazyArrayListStoreTest
05:37:39 testSize(org.eclipse.tracecompass.segmentstore.core.tests.LazyArrayListStoreTest)  Time elapsed: 0 sec
05:37:39 testToSpecifyArraySubtype(org.eclipse.tracecompass.segmentstore.core.tests.LazyArrayListStoreTest)  Time elapsed: 0 sec
05:37:39 testIterationOrder(org.eclipse.tracecompass.segmentstore.core.tests.LazyArrayListStoreTest)  Time elapsed: 0 sec
05:37:39 testRetainAll(org.eclipse.tracecompass.segmentstore.core.tests.LazyArrayListStoreTest)  Time elapsed: 0 sec
05:37:39 testGetIntersectingElementsTime(org.eclipse.tracecompass.segmentstore.core.tests.LazyArrayListStoreTest)  Time elapsed: 0 sec
05:37:39 testToObjectArray(org.eclipse.tracecompass.segmentstore.core.tests.LazyArrayListStoreTest)  Time elapsed: 0 sec
05:37:39 testContains(org.eclipse.tracecompass.segmentstore.core.tests.LazyArrayListStoreTest)  Time elapsed: 0 sec
05:37:39 testSortedIterator(org.eclipse.tracecompass.segmentstore.core.tests.LazyArrayListStoreTest)  Time elapsed: 0.003 sec
05:37:39 testIterationOrderNonSortedInsertion(org.eclipse.tracecompass.segmentstore.core.tests.LazyArrayListStoreTest)  Time elapsed: 0 sec
05:37:39 testToSpecificArray(org.eclipse.tracecompass.segmentstore.core.tests.LazyArrayListStoreTest)  Time elapsed: 0.001 sec
05:37:39 testAddAllConstructorOutOfOrder(org.eclipse.tracecompass.segmentstore.core.tests.LazyArrayListStoreTest)  Time elapsed: 0 sec
05:37:39 testAddAll(org.eclipse.tracecompass.segmentstore.core.tests.LazyArrayListStoreTest)  Time elapsed: 0 sec
05:37:39 testDispose(org.eclipse.tracecompass.segmentstore.core.tests.LazyArrayListStoreTest)  Time elapsed: 0 sec
05:37:39 testIsEmpty(org.eclipse.tracecompass.segmentstore.core.tests.LazyArrayListStoreTest)  Time elapsed: 0 sec
05:37:39 testRemove(org.eclipse.tracecompass.segmentstore.core.tests.LazyArrayListStoreTest)  Time elapsed: 0 sec
05:37:39 testAddAllOutOfOrder(org.eclipse.tracecompass.segmentstore.core.tests.LazyArrayListStoreTest)  Time elapsed: 0 sec
05:37:39 testIterator(org.eclipse.tracecompass.segmentstore.core.tests.LazyArrayListStoreTest)  Time elapsed: 0 sec
05:37:39 testGetIntersectingElementsRange(org.eclipse.tracecompass.segmentstore.core.tests.LazyArrayListStoreTest)  Time elapsed: 0.001 sec
05:37:39 testRemoveAll(org.eclipse.tracecompass.segmentstore.core.tests.LazyArrayListStoreTest)  Time elapsed: 0 sec
05:37:39 testAddAllConstructor(org.eclipse.tracecompass.segmentstore.core.tests.LazyArrayListStoreTest)  Time elapsed: 0.004 sec
05:37:39 
05:37:39 Results :
05:37:39 
05:37:39 Tests run: 125, Failures: 0, Errors: 0, Skipped: 0
05:37:39 
05:37:40 [INFO] All tests passed!
05:37:40 [INFO] 
05:37:40 [INFO] --- jacoco-maven-plugin:0.7.9:report (post-test) @ org.eclipse.tracecompass.segmentstore.core.tests ---
05:37:40 [INFO] Loading execution data file /home/hudson/jenkins-slave-tracecompass/workspace/tracecompass-master-nightly-gtk3/statesystem/org.eclipse.tracecompass.segmentstore.core.tests/../../target/jacoco.exec
05:37:40 [INFO] Analyzed bundle 'org.eclipse.tracecompass.segmentstore.core.tests' with 17 classes
05:37:40 [INFO] 
05:37:40 [INFO] --- maven-install-plugin:2.5.2:install (default-install) @ org.eclipse.tracecompass.segmentstore.core.tests ---
05:37:40 [INFO] Installing /home/hudson/jenkins-slave-tracecompass/workspace/tracecompass-master-nightly-gtk3/statesystem/org.eclipse.tracecompass.segmentstore.core.tests/target/org.eclipse.tracecompass.segmentstore.core.tests-1.0.2-SNAPSHOT.jar to /home/hudson/jenkins-slave-tracecompass/workspace/tracecompass-master-nightly-gtk3/.repository/org/eclipse/tracecompass/org.eclipse.tracecompass.segmentstore.core.tests/1.0.2-SNAPSHOT/org.eclipse.tracecompass.segmentstore.core.tests-1.0.2-SNAPSHOT.jar
05:37:40 [INFO] Installing /home/hudson/jenkins-slave-tracecompass/workspace/tracecompass-master-nightly-gtk3/statesystem/org.eclipse.tracecompass.segmentstore.core.tests/.polyglot.build.properties to /home/hudson/jenkins-slave-tracecompass/workspace/tracecompass-master-nightly-gtk3/.repository/org/eclipse/tracecompass/org.eclipse.tracecompass.segmentstore.core.tests/1.0.2-SNAPSHOT/org.eclipse.tracecompass.segmentstore.core.tests-1.0.2-SNAPSHOT.pom
05:37:40 [INFO] Installing /home/hudson/jenkins-slave-tracecompass/workspace/tracecompass-master-nightly-gtk3/statesystem/org.eclipse.tracecompass.segmentstore.core.tests/target/org.eclipse.tracecompass.segmentstore.core.tests-1.0.2-SNAPSHOT-sources.jar to /home/hudson/jenkins-slave-tracecompass/workspace/tracecompass-master-nightly-gtk3/.repository/org/eclipse/tracecompass/org.eclipse.tracecompass.segmentstore.core.tests/1.0.2-SNAPSHOT/org.eclipse.tracecompass.segmentstore.core.tests-1.0.2-SNAPSHOT-sources.jar
05:37:40 [INFO] Installing /home/hudson/jenkins-slave-tracecompass/workspace/tracecompass-master-nightly-gtk3/statesystem/org.eclipse.tracecompass.segmentstore.core.tests/target/org.eclipse.tracecompass.segmentstore.core.tests-1.0.2-SNAPSHOT.jar.pack.gz to /home/hudson/jenkins-slave-tracecompass/workspace/tracecompass-master-nightly-gtk3/.repository/org/eclipse/tracecompass/org.eclipse.tracecompass.segmentstore.core.tests/1.0.2-SNAPSHOT/org.eclipse.tracecompass.segmentstore.core.tests-1.0.2-SNAPSHOT-pack200.jar.pack.gz
05:37:40 [INFO] Installing /home/hudson/jenkins-slave-tracecompass/workspace/tracecompass-master-nightly-gtk3/statesystem/org.eclipse.tracecompass.segmentstore.core.tests/target/p2content.xml to /home/hudson/jenkins-slave-tracecompass/workspace/tracecompass-master-nightly-gtk3/.repository/org/eclipse/tracecompass/org.eclipse.tracecompass.segmentstore.core.tests/1.0.2-SNAPSHOT/org.eclipse.tracecompass.segmentstore.core.tests-1.0.2-SNAPSHOT-p2metadata.xml
05:37:40 [INFO] Installing /home/hudson/jenkins-slave-tracecompass/workspace/tracecompass-master-nightly-gtk3/statesystem/org.eclipse.tracecompass.segmentstore.core.tests/target/p2artifacts.xml to /home/hudson/jenkins-slave-tracecompass/workspace/tracecompass-master-nightly-gtk3/.repository/org/eclipse/tracecompass/org.eclipse.tracecompass.segmentstore.core.tests/1.0.2-SNAPSHOT/org.eclipse.tracecompass.segmentstore.core.tests-1.0.2-SNAPSHOT-p2artifacts.xml
05:37:40 [INFO] 
05:37:40 [INFO] --- tycho-p2-plugin:1.1.0:update-local-index (default-update-local-index) @ org.eclipse.tracecompass.segmentstore.core.tests ---
05:37:40 [INFO]                                                                         
05:37:40 [INFO] ------------------------------------------------------------------------
05:37:40 [INFO] Building Trace Compass All Tests 1.0.4-SNAPSHOT
05:37:40 [INFO] ------------------------------------------------------------------------
05:37:41 [INFO] 
05:37:41 [INFO] --- maven-clean-plugin:3.0.0:clean (default-clean) @ org.eclipse.tracecompass.alltests ---
05:37:41 [INFO] Deleting /home/hudson/jenkins-slave-tracecompass/workspace/tracecompass-master-nightly-gtk3/releng/org.eclipse.tracecompass.alltests/target
05:37:42 [INFO] 
05:37:42 [INFO] --- tycho-packaging-plugin:1.1.0:build-qualifier (default-build-qualifier) @ org.eclipse.tracecompass.alltests ---
05:37:42 [INFO] The project's OSGi version is 1.0.4.201806160800
05:37:42 [INFO] 
05:37:42 [INFO] --- tycho-packaging-plugin:1.1.0:validate-id (default-validate-id) @ org.eclipse.tracecompass.alltests ---
05:37:42 [INFO] 
05:37:42 [INFO] --- tycho-packaging-plugin:1.1.0:validate-version (default-validate-version) @ org.eclipse.tracecompass.alltests ---
05:37:42 [INFO] 
05:37:42 [INFO] --- maven-enforcer-plugin:1.4.1:enforce (enforce-maven-version) @ org.eclipse.tracecompass.alltests ---
05:37:42 [INFO] 
05:37:42 [INFO] --- jacoco-maven-plugin:0.7.9:prepare-agent (pre-test) @ org.eclipse.tracecompass.alltests ---
05:37:42 [INFO] tycho.testArgLine set to -javaagent:/home/hudson/jenkins-slave-tracecompass/workspace/tracecompass-master-nightly-gtk3/.repository/org/jacoco/org.jacoco.agent/0.7.9/org.jacoco.agent-0.7.9-runtime.jar=destfile=/home/hudson/jenkins-slave-tracecompass/workspace/tracecompass-master-nightly-gtk3/releng/org.eclipse.tracecompass.alltests/../../target/jacoco.exec,append=true,includes=org.eclipse.tracecompass.*
05:37:42 [INFO] 
05:37:42 [INFO] --- maven-resources-plugin:3.0.2:resources (default-resources) @ org.eclipse.tracecompass.alltests ---
05:37:42 [INFO] Using 'UTF-8' encoding to copy filtered resources.
05:37:42 [INFO] skip non existing resourceDirectory /home/hudson/jenkins-slave-tracecompass/workspace/tracecompass-master-nightly-gtk3/releng/org.eclipse.tracecompass.alltests/src/main/resources
05:37:42 [INFO] 
05:37:42 [INFO] --- tycho-compiler-plugin:1.1.0:compile (default-compile) @ org.eclipse.tracecompass.alltests ---
05:37:42 [INFO] Compiling 8 source files to /home/hudson/jenkins-slave-tracecompass/workspace/tracecompass-master-nightly-gtk3/releng/org.eclipse.tracecompass.alltests/target/classes
05:37:44 [INFO] 
05:37:44 [INFO] --- maven-resources-plugin:3.0.2:testResources (default-testResources) @ org.eclipse.tracecompass.alltests ---
05:37:44 [INFO] Using 'UTF-8' encoding to copy filtered resources.
05:37:44 [INFO] skip non existing resourceDirectory /home/hudson/jenkins-slave-tracecompass/workspace/tracecompass-master-nightly-gtk3/releng/org.eclipse.tracecompass.alltests/src/test/resources
05:37:44 [INFO] 
05:37:44 [INFO] --- tycho-source-plugin:1.1.0:plugin-source (plugin-source) @ org.eclipse.tracecompass.alltests ---
05:37:44 [INFO] Building jar: /home/hudson/jenkins-slave-tracecompass/workspace/tracecompass-master-nightly-gtk3/releng/org.eclipse.tracecompass.alltests/target/org.eclipse.tracecompass.alltests-1.0.4-SNAPSHOT-sources.jar
05:37:44 [INFO] 
05:37:44 [INFO] --- target-platform-configuration:1.1.0:target-platform (default-target-platform) @ org.eclipse.tracecompass.alltests ---
05:37:44 [INFO] 
05:37:44 [INFO] --- tycho-packaging-plugin:1.1.0:package-plugin (default-package-plugin) @ org.eclipse.tracecompass.alltests ---
05:37:44 [INFO] Building jar: /home/hudson/jenkins-slave-tracecompass/workspace/tracecompass-master-nightly-gtk3/releng/org.eclipse.tracecompass.alltests/target/org.eclipse.tracecompass.alltests-1.0.4-SNAPSHOT.jar
05:37:44 [INFO] 
05:37:44 [INFO] --- tycho-p2-plugin:1.1.0:p2-metadata-default (default-p2-metadata-default) @ org.eclipse.tracecompass.alltests ---
05:37:44 [INFO] 
05:37:44 [INFO] --- tycho-source-feature-plugin:1.1.0:source-feature (source-feature) @ org.eclipse.tracecompass.alltests ---
05:37:44 [INFO] 
05:37:44 [INFO] --- tycho-pack200b-plugin:1.1.0:pack (pack200-pack) @ org.eclipse.tracecompass.alltests ---
05:37:44 [INFO] Pack200 packing jar /home/hudson/jenkins-slave-tracecompass/workspace/tracecompass-master-nightly-gtk3/releng/org.eclipse.tracecompass.alltests/target/org.eclipse.tracecompass.alltests-1.0.4-SNAPSHOT.jar
05:37:44 [INFO] 
05:37:44 [INFO] --- tycho-p2-plugin:1.1.0:p2-metadata (p2-metadata) @ org.eclipse.tracecompass.alltests ---
05:37:44 [INFO] 
05:37:44 [INFO] --- tycho-surefire-plugin:1.1.0:test (default-test) @ org.eclipse.tracecompass.alltests ---
05:37:45 [INFO] Expected eclipse log file: /home/hudson/jenkins-slave-tracecompass/workspace/tracecompass-master-nightly-gtk3/releng/org.eclipse.tracecompass.alltests/target/work/data/.metadata/.log
05:37:45 [INFO] Command line:
05:37:45 	[/shared/common/jdk1.8.0_102/jre/bin/java, -Dosgi.noShutdown=false, -Dosgi.os=linux, -Dosgi.ws=gtk, -Dosgi.arch=x86_64, -javaagent:/home/hudson/jenkins-slave-tracecompass/workspace/tracecompass-master-nightly-gtk3/.repository/org/jacoco/org.jacoco.agent/0.7.9/org.jacoco.agent-0.7.9-runtime.jar=destfile=/home/hudson/jenkins-slave-tracecompass/workspace/tracecompass-master-nightly-gtk3/releng/org.eclipse.tracecompass.alltests/../../target/jacoco.exec,append=true,includes=org.eclipse.tracecompass.*, -Dorg.eclipse.swt.browser.DefaultType=mozilla, -Xms512m, -Xmx1024m, -Dosgi.clean=true, -jar, /home/hudson/jenkins-slave-tracecompass/workspace/tracecompass-master-nightly-gtk3/.repository/p2/osgi/bundle/org.eclipse.equinox.launcher/1.5.0.v20180512-1130/org.eclipse.equinox.launcher-1.5.0.v20180512-1130.jar, -data, /home/hudson/jenkins-slave-tracecompass/workspace/tracecompass-master-nightly-gtk3/releng/org.eclipse.tracecompass.alltests/target/work/data, -install, /home/hudson/jenkins-slave-tracecompass/workspace/tracecompass-master-nightly-gtk3/releng/org.eclipse.tracecompass.alltests/target/work, -configuration, /home/hudson/jenkins-slave-tracecompass/workspace/tracecompass-master-nightly-gtk3/releng/org.eclipse.tracecompass.alltests/target/work/configuration, -application, org.eclipse.tycho.surefire.osgibooter.headlesstest, -testproperties, /home/hudson/jenkins-slave-tracecompass/workspace/tracecompass-master-nightly-gtk3/releng/org.eclipse.tracecompass.alltests/target/surefire.properties, -product, org.eclipse.platform.ide, -consoleLog]
05:37:49 !SESSION 2018-06-16 09:37:45.814 -----------------------------------------------
05:37:49 eclipse.buildId=unknown
05:37:49 java.version=1.8.0_102
05:37:49 java.vendor=Oracle Corporation
05:37:49 BootLoader constants: OS=linux, ARCH=x86_64, WS=gtk, NL=en_US
05:37:49 Framework arguments:  -application org.eclipse.tycho.surefire.osgibooter.headlesstest -testproperties /home/hudson/jenkins-slave-tracecompass/workspace/tracecompass-master-nightly-gtk3/releng/org.eclipse.tracecompass.alltests/target/surefire.properties -product org.eclipse.platform.ide
05:37:49 Command-line arguments:  -data /home/hudson/jenkins-slave-tracecompass/workspace/tracecompass-master-nightly-gtk3/releng/org.eclipse.tracecompass.alltests/target/work/data -application org.eclipse.tycho.surefire.osgibooter.headlesstest -testproperties /home/hudson/jenkins-slave-tracecompass/workspace/tracecompass-master-nightly-gtk3/releng/org.eclipse.tracecompass.alltests/target/surefire.properties -product org.eclipse.platform.ide -consoleLog
05:37:49 
05:37:49 !ENTRY org.eclipse.compare.win32 4 0 2018-06-16 09:37:49.547
05:37:49 !MESSAGE FrameworkEvent ERROR
05:37:49 !STACK 0
05:37:49 org.osgi.framework.BundleException: Could not resolve module: org.eclipse.compare.win32 [79]
05:37:49   Unresolved requirement: Require-Capability: eclipse.platform; filter:="(osgi.os=win32)"
05:37:49 
05:37:49 	at org.eclipse.osgi.container.Module.start(Module.java:444)
05:37:49 	at org.eclipse.osgi.container.ModuleContainer$ContainerStartLevel.incStartLevel(ModuleContainer.java:1682)
05:37:49 	at org.eclipse.osgi.container.ModuleContainer$ContainerStartLevel.incStartLevel(ModuleContainer.java:1661)
05:37:49 	at org.eclipse.osgi.container.ModuleContainer$ContainerStartLevel.doContainerStartLevel(ModuleContainer.java:1624)
05:37:49 	at org.eclipse.osgi.container.ModuleContainer$ContainerStartLevel.dispatchEvent(ModuleContainer.java:1555)
05:37:49 	at org.eclipse.osgi.container.ModuleContainer$ContainerStartLevel.dispatchEvent(ModuleContainer.java:1)
05:37:49 	at org.eclipse.osgi.framework.eventmgr.EventManager.dispatchEvent(EventManager.java:230)
05:37:49 	at org.eclipse.osgi.framework.eventmgr.EventManager$EventThread.run(EventManager.java:340)
05:37:51 
05:37:51 -------------------------------------------------------
05:37:51  T E S T S
05:37:51 -------------------------------------------------------
05:37:51 
05:37:51 Results :
05:37:51 
05:37:51 Tests run: 0, Failures: 0, Errors: 0, Skipped: 0
05:37:51 
05:37:52 [WARNING] No tests found.
05:37:52 [INFO] 
05:37:52 [INFO] --- jacoco-maven-plugin:0.7.9:report (post-test) @ org.eclipse.tracecompass.alltests ---
05:37:52 [INFO] Loading execution data file /home/hudson/jenkins-slave-tracecompass/workspace/tracecompass-master-nightly-gtk3/releng/org.eclipse.tracecompass.alltests/../../target/jacoco.exec
05:37:52 [INFO] Analyzed bundle 'Trace Compass All Tests' with 8 classes
05:37:52 [INFO] 
05:37:52 [INFO] --- maven-install-plugin:2.5.2:install (default-install) @ org.eclipse.tracecompass.alltests ---
05:37:52 [INFO] Installing /home/hudson/jenkins-slave-tracecompass/workspace/tracecompass-master-nightly-gtk3/releng/org.eclipse.tracecompass.alltests/target/org.eclipse.tracecompass.alltests-1.0.4-SNAPSHOT.jar to /home/hudson/jenkins-slave-tracecompass/workspace/tracecompass-master-nightly-gtk3/.repository/org/eclipse/tracecompass/org.eclipse.tracecompass.alltests/1.0.4-SNAPSHOT/org.eclipse.tracecompass.alltests-1.0.4-SNAPSHOT.jar
05:37:52 [INFO] Installing /home/hudson/jenkins-slave-tracecompass/workspace/tracecompass-master-nightly-gtk3/releng/org.eclipse.tracecompass.alltests/pom.xml to /home/hudson/jenkins-slave-tracecompass/workspace/tracecompass-master-nightly-gtk3/.repository/org/eclipse/tracecompass/org.eclipse.tracecompass.alltests/1.0.4-SNAPSHOT/org.eclipse.tracecompass.alltests-1.0.4-SNAPSHOT.pom
05:37:52 [INFO] Installing /home/hudson/jenkins-slave-tracecompass/workspace/tracecompass-master-nightly-gtk3/releng/org.eclipse.tracecompass.alltests/target/org.eclipse.tracecompass.alltests-1.0.4-SNAPSHOT-sources.jar to /home/hudson/jenkins-slave-tracecompass/workspace/tracecompass-master-nightly-gtk3/.repository/org/eclipse/tracecompass/org.eclipse.tracecompass.alltests/1.0.4-SNAPSHOT/org.eclipse.tracecompass.alltests-1.0.4-SNAPSHOT-sources.jar
05:37:52 [INFO] Installing /home/hudson/jenkins-slave-tracecompass/workspace/tracecompass-master-nightly-gtk3/releng/org.eclipse.tracecompass.alltests/target/org.eclipse.tracecompass.alltests-1.0.4-SNAPSHOT.jar.pack.gz to /home/hudson/jenkins-slave-tracecompass/workspace/tracecompass-master-nightly-gtk3/.repository/org/eclipse/tracecompass/org.eclipse.tracecompass.alltests/1.0.4-SNAPSHOT/org.eclipse.tracecompass.alltests-1.0.4-SNAPSHOT-pack200.jar.pack.gz
05:37:52 [INFO] Installing /home/hudson/jenkins-slave-tracecompass/workspace/tracecompass-master-nightly-gtk3/releng/org.eclipse.tracecompass.alltests/target/p2content.xml to /home/hudson/jenkins-slave-tracecompass/workspace/tracecompass-master-nightly-gtk3/.repository/org/eclipse/tracecompass/org.eclipse.tracecompass.alltests/1.0.4-SNAPSHOT/org.eclipse.tracecompass.alltests-1.0.4-SNAPSHOT-p2metadata.xml
05:37:52 [INFO] Installing /home/hudson/jenkins-slave-tracecompass/workspace/tracecompass-master-nightly-gtk3/releng/org.eclipse.tracecompass.alltests/target/p2artifacts.xml to /home/hudson/jenkins-slave-tracecompass/workspace/tracecompass-master-nightly-gtk3/.repository/org/eclipse/tracecompass/org.eclipse.tracecompass.alltests/1.0.4-SNAPSHOT/org.eclipse.tracecompass.alltests-1.0.4-SNAPSHOT-p2artifacts.xml
05:37:52 [INFO] 
05:37:52 [INFO] --- tycho-p2-plugin:1.1.0:update-local-index (default-update-local-index) @ org.eclipse.tracecompass.alltests ---
05:37:52 [INFO]                                                                         
05:37:52 [INFO] ------------------------------------------------------------------------
05:37:52 [INFO] Building org.eclipse.tracecompass.testing 4.0.0-SNAPSHOT
05:37:52 [INFO] ------------------------------------------------------------------------
05:37:52 [INFO] 
05:37:52 [INFO] --- maven-clean-plugin:3.0.0:clean (default-clean) @ org.eclipse.tracecompass.testing ---
05:37:52 [INFO] Deleting /home/hudson/jenkins-slave-tracecompass/workspace/tracecompass-master-nightly-gtk3/releng/org.eclipse.tracecompass.testing/target
05:37:52 [INFO] 
05:37:52 [INFO] --- tycho-packaging-plugin:1.1.0:build-qualifier-aggregator (default-build-qualifier-aggregator) @ org.eclipse.tracecompass.testing ---
05:37:53 [INFO] The project's OSGi version is 4.0.0.201806160800
05:37:53 [INFO] 
05:37:53 [INFO] --- tycho-packaging-plugin:1.1.0:validate-id (default-validate-id) @ org.eclipse.tracecompass.testing ---
05:37:53 [INFO] 
05:37:53 [INFO] --- tycho-packaging-plugin:1.1.0:validate-version (default-validate-version) @ org.eclipse.tracecompass.testing ---
05:37:53 [INFO] 
05:37:53 [INFO] --- maven-enforcer-plugin:1.4.1:enforce (enforce-maven-version) @ org.eclipse.tracecompass.testing ---
05:37:53 [INFO] 
05:37:53 [INFO] --- jacoco-maven-plugin:0.7.9:prepare-agent (pre-test) @ org.eclipse.tracecompass.testing ---
05:37:53 [INFO] argLine set to -javaagent:/home/hudson/jenkins-slave-tracecompass/workspace/tracecompass-master-nightly-gtk3/.repository/org/jacoco/org.jacoco.agent/0.7.9/org.jacoco.agent-0.7.9-runtime.jar=destfile=/home/hudson/jenkins-slave-tracecompass/workspace/tracecompass-master-nightly-gtk3/releng/org.eclipse.tracecompass.testing/../../target/jacoco.exec,append=true,includes=org.eclipse.tracecompass.*
05:37:53 [INFO] 
05:37:53 [INFO] --- tycho-source-plugin:1.1.0:plugin-source (plugin-source) @ org.eclipse.tracecompass.testing ---
05:37:53 [INFO] 
05:37:53 [INFO] --- target-platform-configuration:1.1.0:target-platform (default-target-platform) @ org.eclipse.tracecompass.testing ---
05:37:53 [INFO] 
05:37:53 [INFO] --- tycho-packaging-plugin:1.1.0:package-feature (default-package-feature) @ org.eclipse.tracecompass.testing ---
05:37:53 [INFO] Building jar: /home/hudson/jenkins-slave-tracecompass/workspace/tracecompass-master-nightly-gtk3/releng/org.eclipse.tracecompass.testing/target/org.eclipse.tracecompass.testing-4.0.0-SNAPSHOT.jar
05:37:53 [INFO] 
05:37:53 [INFO] --- tycho-p2-plugin:1.1.0:p2-metadata-default (default-p2-metadata-default) @ org.eclipse.tracecompass.testing ---
05:37:53 [INFO] 
05:37:53 [INFO] --- tycho-p2-plugin:1.1.0:feature-p2-metadata (default-feature-p2-metadata) @ org.eclipse.tracecompass.testing ---
05:37:53 [INFO] 
05:37:53 [INFO] --- tycho-source-feature-plugin:1.1.0:source-feature (source-feature) @ org.eclipse.tracecompass.testing ---
05:37:53 [INFO] Building jar: /home/hudson/jenkins-slave-tracecompass/workspace/tracecompass-master-nightly-gtk3/releng/org.eclipse.tracecompass.testing/target/org.eclipse.tracecompass.testing-4.0.0-SNAPSHOT-sources-feature.jar
05:37:53 [INFO] 
05:37:53 [INFO] --- tycho-pack200b-plugin:1.1.0:pack (pack200-pack) @ org.eclipse.tracecompass.testing ---
05:37:53 [INFO] 
05:37:53 [INFO] --- tycho-p2-plugin:1.1.0:p2-metadata (p2-metadata) @ org.eclipse.tracecompass.testing ---
05:37:53 [INFO] 
05:37:53 [INFO] --- jacoco-maven-plugin:0.7.9:report (post-test) @ org.eclipse.tracecompass.testing ---
05:37:53 [INFO] Skipping JaCoCo execution due to missing classes directory.
05:37:53 [INFO] 
05:37:53 [INFO] --- maven-install-plugin:2.5.2:install (default-install) @ org.eclipse.tracecompass.testing ---
05:37:53 [INFO] Installing /home/hudson/jenkins-slave-tracecompass/workspace/tracecompass-master-nightly-gtk3/releng/org.eclipse.tracecompass.testing/target/org.eclipse.tracecompass.testing-4.0.0-SNAPSHOT.jar to /home/hudson/jenkins-slave-tracecompass/workspace/tracecompass-master-nightly-gtk3/.repository/org/eclipse/tracecompass/org.eclipse.tracecompass.testing/4.0.0-SNAPSHOT/org.eclipse.tracecompass.testing-4.0.0-SNAPSHOT.jar
05:37:53 [INFO] Installing /home/hudson/jenkins-slave-tracecompass/workspace/tracecompass-master-nightly-gtk3/releng/org.eclipse.tracecompass.testing/.polyglot.build.properties to /home/hudson/jenkins-slave-tracecompass/workspace/tracecompass-master-nightly-gtk3/.repository/org/eclipse/tracecompass/org.eclipse.tracecompass.testing/4.0.0-SNAPSHOT/org.eclipse.tracecompass.testing-4.0.0-SNAPSHOT.pom
05:37:53 [INFO] Installing /home/hudson/jenkins-slave-tracecompass/workspace/tracecompass-master-nightly-gtk3/releng/org.eclipse.tracecompass.testing/target/org.eclipse.tracecompass.testing-4.0.0-SNAPSHOT-sources-feature.jar to /home/hudson/jenkins-slave-tracecompass/workspace/tracecompass-master-nightly-gtk3/.repository/org/eclipse/tracecompass/org.eclipse.tracecompass.testing/4.0.0-SNAPSHOT/org.eclipse.tracecompass.testing-4.0.0-SNAPSHOT-sources-feature.jar
05:37:53 [INFO] Installing /home/hudson/jenkins-slave-tracecompass/workspace/tracecompass-master-nightly-gtk3/releng/org.eclipse.tracecompass.testing/target/p2content.xml to /home/hudson/jenkins-slave-tracecompass/workspace/tracecompass-master-nightly-gtk3/.repository/org/eclipse/tracecompass/org.eclipse.tracecompass.testing/4.0.0-SNAPSHOT/org.eclipse.tracecompass.testing-4.0.0-SNAPSHOT-p2metadata.xml
05:37:53 [INFO] Installing /home/hudson/jenkins-slave-tracecompass/workspace/tracecompass-master-nightly-gtk3/releng/org.eclipse.tracecompass.testing/target/p2artifacts.xml to /home/hudson/jenkins-slave-tracecompass/workspace/tracecompass-master-nightly-gtk3/.repository/org/eclipse/tracecompass/org.eclipse.tracecompass.testing/4.0.0-SNAPSHOT/org.eclipse.tracecompass.testing-4.0.0-SNAPSHOT-p2artifacts.xml
05:37:53 [INFO] 
05:37:53 [INFO] --- tycho-p2-plugin:1.1.0:update-local-index (default-update-local-index) @ org.eclipse.tracecompass.testing ---
05:37:53 [INFO]                                                                         
05:37:53 [INFO] ------------------------------------------------------------------------
05:37:53 [INFO] Building org.eclipse.tracecompass.tmf.remote 4.0.0-SNAPSHOT
05:37:53 [INFO] ------------------------------------------------------------------------
05:37:53 [INFO] 
05:37:53 [INFO] --- maven-clean-plugin:3.0.0:clean (default-clean) @ org.eclipse.tracecompass.tmf.remote ---
05:37:53 [INFO] Deleting /home/hudson/jenkins-slave-tracecompass/workspace/tracecompass-master-nightly-gtk3/tmf/org.eclipse.tracecompass.tmf.remote/target
05:37:53 [INFO] 
05:37:53 [INFO] --- tycho-packaging-plugin:1.1.0:build-qualifier-aggregator (default-build-qualifier-aggregator) @ org.eclipse.tracecompass.tmf.remote ---
05:37:53 [INFO] The project's OSGi version is 4.0.0.201806160800
05:37:53 [INFO] 
05:37:53 [INFO] --- tycho-packaging-plugin:1.1.0:validate-id (default-validate-id) @ org.eclipse.tracecompass.tmf.remote ---
05:37:53 [INFO] 
05:37:53 [INFO] --- tycho-packaging-plugin:1.1.0:validate-version (default-validate-version) @ org.eclipse.tracecompass.tmf.remote ---
05:37:53 [INFO] 
05:37:53 [INFO] --- maven-enforcer-plugin:1.4.1:enforce (enforce-maven-version) @ org.eclipse.tracecompass.tmf.remote ---
05:37:53 [INFO] 
05:37:53 [INFO] --- jacoco-maven-plugin:0.7.9:prepare-agent (pre-test) @ org.eclipse.tracecompass.tmf.remote ---
05:37:53 [INFO] argLine set to -javaagent:/home/hudson/jenkins-slave-tracecompass/workspace/tracecompass-master-nightly-gtk3/.repository/org/jacoco/org.jacoco.agent/0.7.9/org.jacoco.agent-0.7.9-runtime.jar=destfile=/home/hudson/jenkins-slave-tracecompass/workspace/tracecompass-master-nightly-gtk3/tmf/org.eclipse.tracecompass.tmf.remote/../../target/jacoco.exec,append=true,includes=org.eclipse.tracecompass.*
05:37:53 [INFO] 
05:37:53 [INFO] --- tycho-source-plugin:1.1.0:plugin-source (plugin-source) @ org.eclipse.tracecompass.tmf.remote ---
05:37:53 [INFO] 
05:37:53 [INFO] --- target-platform-configuration:1.1.0:target-platform (default-target-platform) @ org.eclipse.tracecompass.tmf.remote ---
05:37:53 [INFO] 
05:37:53 [INFO] --- tycho-packaging-plugin:1.1.0:package-feature (default-package-feature) @ org.eclipse.tracecompass.tmf.remote ---
05:37:53 [INFO] Building jar: /home/hudson/jenkins-slave-tracecompass/workspace/tracecompass-master-nightly-gtk3/tmf/org.eclipse.tracecompass.tmf.remote/target/org.eclipse.tracecompass.tmf.remote-4.0.0-SNAPSHOT.jar
05:37:53 [INFO] 
05:37:53 [INFO] --- tycho-p2-plugin:1.1.0:p2-metadata-default (default-p2-metadata-default) @ org.eclipse.tracecompass.tmf.remote ---
05:37:53 [INFO] 
05:37:53 [INFO] --- tycho-p2-plugin:1.1.0:feature-p2-metadata (default-feature-p2-metadata) @ org.eclipse.tracecompass.tmf.remote ---
05:37:53 [INFO] 
05:37:53 [INFO] --- tycho-source-feature-plugin:1.1.0:source-feature (source-feature) @ org.eclipse.tracecompass.tmf.remote ---
05:37:53 [INFO] Building jar: /home/hudson/jenkins-slave-tracecompass/workspace/tracecompass-master-nightly-gtk3/tmf/org.eclipse.tracecompass.tmf.remote/target/org.eclipse.tracecompass.tmf.remote-4.0.0-SNAPSHOT-sources-feature.jar
05:37:53 [INFO] 
05:37:53 [INFO] --- tycho-pack200b-plugin:1.1.0:pack (pack200-pack) @ org.eclipse.tracecompass.tmf.remote ---
05:37:53 [INFO] 
05:37:53 [INFO] --- tycho-p2-plugin:1.1.0:p2-metadata (p2-metadata) @ org.eclipse.tracecompass.tmf.remote ---
05:37:53 [INFO] 
05:37:53 [INFO] --- jacoco-maven-plugin:0.7.9:report (post-test) @ org.eclipse.tracecompass.tmf.remote ---
05:37:53 [INFO] Skipping JaCoCo execution due to missing classes directory.
05:37:53 [INFO] 
05:37:53 [INFO] --- maven-install-plugin:2.5.2:install (default-install) @ org.eclipse.tracecompass.tmf.remote ---
05:37:53 [INFO] Installing /home/hudson/jenkins-slave-tracecompass/workspace/tracecompass-master-nightly-gtk3/tmf/org.eclipse.tracecompass.tmf.remote/target/org.eclipse.tracecompass.tmf.remote-4.0.0-SNAPSHOT.jar to /home/hudson/jenkins-slave-tracecompass/workspace/tracecompass-master-nightly-gtk3/.repository/org/eclipse/tracecompass/org.eclipse.tracecompass.tmf.remote/4.0.0-SNAPSHOT/org.eclipse.tracecompass.tmf.remote-4.0.0-SNAPSHOT.jar
05:37:53 [INFO] Installing /home/hudson/jenkins-slave-tracecompass/workspace/tracecompass-master-nightly-gtk3/tmf/org.eclipse.tracecompass.tmf.remote/.polyglot.build.properties to /home/hudson/jenkins-slave-tracecompass/workspace/tracecompass-master-nightly-gtk3/.repository/org/eclipse/tracecompass/org.eclipse.tracecompass.tmf.remote/4.0.0-SNAPSHOT/org.eclipse.tracecompass.tmf.remote-4.0.0-SNAPSHOT.pom
05:37:53 [INFO] Installing /home/hudson/jenkins-slave-tracecompass/workspace/tracecompass-master-nightly-gtk3/tmf/org.eclipse.tracecompass.tmf.remote/target/org.eclipse.tracecompass.tmf.remote-4.0.0-SNAPSHOT-sources-feature.jar to /home/hudson/jenkins-slave-tracecompass/workspace/tracecompass-master-nightly-gtk3/.repository/org/eclipse/tracecompass/org.eclipse.tracecompass.tmf.remote/4.0.0-SNAPSHOT/org.eclipse.tracecompass.tmf.remote-4.0.0-SNAPSHOT-sources-feature.jar
05:37:53 [INFO] Installing /home/hudson/jenkins-slave-tracecompass/workspace/tracecompass-master-nightly-gtk3/tmf/org.eclipse.tracecompass.tmf.remote/target/p2content.xml to /home/hudson/jenkins-slave-tracecompass/workspace/tracecompass-master-nightly-gtk3/.repository/org/eclipse/tracecompass/org.eclipse.tracecompass.tmf.remote/4.0.0-SNAPSHOT/org.eclipse.tracecompass.tmf.remote-4.0.0-SNAPSHOT-p2metadata.xml
05:37:53 [INFO] Installing /home/hudson/jenkins-slave-tracecompass/workspace/tracecompass-master-nightly-gtk3/tmf/org.eclipse.tracecompass.tmf.remote/target/p2artifacts.xml to /home/hudson/jenkins-slave-tracecompass/workspace/tracecompass-master-nightly-gtk3/.repository/org/eclipse/tracecompass/org.eclipse.tracecompass.tmf.remote/4.0.0-SNAPSHOT/org.eclipse.tracecompass.tmf.remote-4.0.0-SNAPSHOT-p2artifacts.xml
05:37:53 [INFO] 
05:37:53 [INFO] --- tycho-p2-plugin:1.1.0:update-local-index (default-update-local-index) @ org.eclipse.tracecompass.tmf.remote ---
05:37:53 [INFO]                                                                         
05:37:53 [INFO] ------------------------------------------------------------------------
05:37:53 [INFO] Building Trace Compass Repository 4.0.0-SNAPSHOT
05:37:53 [INFO] ------------------------------------------------------------------------
05:37:54 [INFO] 
05:37:54 [INFO] --- maven-clean-plugin:3.0.0:clean (default-clean) @ org.eclipse.tracecompass.releng-site ---
05:37:54 [INFO] Deleting /home/hudson/jenkins-slave-tracecompass/workspace/tracecompass-master-nightly-gtk3/releng/org.eclipse.tracecompass.releng-site/target
05:37:54 [INFO] 
05:37:54 [INFO] --- tycho-packaging-plugin:1.1.0:build-qualifier-aggregator (default-build-qualifier-aggregator) @ org.eclipse.tracecompass.releng-site ---
05:37:54 [INFO] The project's OSGi version is 4.0.0.201806160800
05:37:54 [INFO] 
05:37:54 [INFO] --- maven-enforcer-plugin:1.4.1:enforce (enforce-maven-version) @ org.eclipse.tracecompass.releng-site ---
05:37:54 [INFO] 
05:37:54 [INFO] --- maven-clean-plugin:3.0.0:clean (default-clean-1) @ org.eclipse.tracecompass.releng-site ---
05:37:54 [INFO] 
05:37:54 [INFO] --- jacoco-maven-plugin:0.7.9:prepare-agent (pre-test) @ org.eclipse.tracecompass.releng-site ---
05:37:54 [INFO] argLine set to -javaagent:/home/hudson/jenkins-slave-tracecompass/workspace/tracecompass-master-nightly-gtk3/.repository/org/jacoco/org.jacoco.agent/0.7.9/org.jacoco.agent-0.7.9-runtime.jar=destfile=/home/hudson/jenkins-slave-tracecompass/workspace/tracecompass-master-nightly-gtk3/releng/org.eclipse.tracecompass.releng-site/../../target/jacoco.exec,append=true,includes=org.eclipse.tracecompass.*
05:37:54 [INFO] 
05:37:54 [INFO] --- maven-resources-plugin:3.0.2:resources (default-resources) @ org.eclipse.tracecompass.releng-site ---
05:37:54 [INFO] Using 'UTF-8' encoding to copy filtered resources.
05:37:54 [INFO] skip non existing resourceDirectory /home/hudson/jenkins-slave-tracecompass/workspace/tracecompass-master-nightly-gtk3/releng/org.eclipse.tracecompass.releng-site/src/main/resources
05:37:54 [INFO] 
05:37:54 [INFO] --- tycho-source-plugin:1.1.0:plugin-source (plugin-source) @ org.eclipse.tracecompass.releng-site ---
05:37:54 [INFO] 
05:37:54 [INFO] --- target-platform-configuration:1.1.0:target-platform (default-target-platform) @ org.eclipse.tracecompass.releng-site ---
05:37:54 [INFO] 
05:37:54 [INFO] --- tycho-p2-publisher-plugin:1.1.0:publish-products (default-publish-products) @ org.eclipse.tracecompass.releng-site ---
05:37:54 [INFO] 
05:37:54 [INFO] --- tycho-p2-publisher-plugin:1.1.0:publish-categories (default-publish-categories) @ org.eclipse.tracecompass.releng-site ---
05:37:54 [INFO] 
05:37:54 [INFO] --- tycho-p2-publisher-plugin:1.1.0:attach-artifacts (default-attach-artifacts) @ org.eclipse.tracecompass.releng-site ---
05:37:54 [INFO] 
05:37:54 [INFO] --- tycho-p2-repository-plugin:1.1.0:assemble-repository (default-assemble-repository) @ org.eclipse.tracecompass.releng-site ---
05:38:05 [WARNING] Mirror tool: Problems resolving provisioning plan.: [Unable to satisfy dependency from 201806160800.Default 1.0.0.9r8--cLhfZ5EENgZ9JH8ZJud-yW to com.google.guava [18.0.0.v20161115-1643].]
05:38:10 [WARNING] More information on the preceding warning(s) can be found here:
05:38:10 [WARNING] - http://wiki.eclipse.org/Tycho_Messages_Explained#Mirror_tool
05:38:10 [WARNING] Mirror tool: Problems resolving provisioning plan.: [Unable to satisfy dependency from 201806160800.Default 1.0.0.9r8--cLhfZ5EENgZ9JH8ZJud-yW to com.google.guava [18.0.0.v20161115-1643].]
05:38:10 [WARNING] More information on the preceding warning(s) can be found here:
05:38:10 [WARNING] - http://wiki.eclipse.org/Tycho_Messages_Explained#Mirror_tool
05:38:10 [WARNING] Mirror tool: Problems resolving provisioning plan.: [Unable to satisfy dependency from 201806160800.Default 1.0.0.9r8--cLhfZ5EENgZ9JH8ZJud-yW to com.google.guava [18.0.0.v20161115-1643].]
05:38:10 [WARNING] More information on the preceding warning(s) can be found here:
05:38:10 [WARNING] - http://wiki.eclipse.org/Tycho_Messages_Explained#Mirror_tool
05:38:10 [WARNING] Mirror tool: Problems resolving provisioning plan.: [Unable to satisfy dependency from 201806160800.Default 1.0.0.9r8--cLhfZ5EENgZ9JH8ZJud-yW to com.google.guava [18.0.0.v20161115-1643].]
05:38:10 [WARNING] More information on the preceding warning(s) can be found here:
05:38:10 [WARNING] - http://wiki.eclipse.org/Tycho_Messages_Explained#Mirror_tool
05:38:10 [WARNING] Mirror tool: Problems resolving provisioning plan.: [Unable to satisfy dependency from 201806160800.Default 1.0.0.9r8--cLhfZ5EENgZ9JH8ZJud-yW to com.google.guava [18.0.0.v20161115-1643].]
05:38:10 [WARNING] More information on the preceding warning(s) can be found here:
05:38:10 [WARNING] - http://wiki.eclipse.org/Tycho_Messages_Explained#Mirror_tool
05:38:13 [INFO] 
05:38:14 [INFO] --- tycho-p2-repository-plugin:1.1.0:archive-repository (default-archive-repository) @ org.eclipse.tracecompass.releng-site ---
05:38:14 [INFO] 
05:38:14 [INFO] --- tycho-source-feature-plugin:1.1.0:source-feature (source-feature) @ org.eclipse.tracecompass.releng-site ---
05:38:14 [INFO] 
05:38:14 [INFO] --- tycho-pack200b-plugin:1.1.0:pack (pack200-pack) @ org.eclipse.tracecompass.releng-site ---
05:38:14 [INFO] 
05:38:14 [INFO] --- tycho-p2-plugin:1.1.0:p2-metadata (p2-metadata) @ org.eclipse.tracecompass.releng-site ---
05:38:14 [INFO] 
05:38:14 [INFO] --- repository-utils:1.0.0:generate-repository-facade (generate-facade) @ org.eclipse.tracecompass.releng-site ---
05:38:16 [INFO] Building zip: /home/hudson/jenkins-slave-tracecompass/workspace/tracecompass-master-nightly-gtk3/releng/org.eclipse.tracecompass.releng-site/target/org.eclipse.tracecompass.releng-site-4.0.0-SNAPSHOT.zip
05:38:18 [INFO] 
05:38:18 [INFO] --- jacoco-maven-plugin:0.7.9:report (post-test) @ org.eclipse.tracecompass.releng-site ---
05:38:18 [INFO] Skipping JaCoCo execution due to missing classes directory.
05:38:18 [INFO] 
05:38:18 [INFO] --- maven-install-plugin:2.5.2:install (default-install) @ org.eclipse.tracecompass.releng-site ---
05:38:18 [INFO] No primary artifact to install, installing attached artifacts instead.
05:38:18 [INFO] Installing /home/hudson/jenkins-slave-tracecompass/workspace/tracecompass-master-nightly-gtk3/releng/org.eclipse.tracecompass.releng-site/pom.xml to /home/hudson/jenkins-slave-tracecompass/workspace/tracecompass-master-nightly-gtk3/.repository/org/eclipse/tracecompass/org.eclipse.tracecompass.releng-site/4.0.0-SNAPSHOT/org.eclipse.tracecompass.releng-site-4.0.0-SNAPSHOT.pom
05:38:18 [INFO] Installing /home/hudson/jenkins-slave-tracecompass/workspace/tracecompass-master-nightly-gtk3/releng/org.eclipse.tracecompass.releng-site/target/p2content.xml to /home/hudson/jenkins-slave-tracecompass/workspace/tracecompass-master-nightly-gtk3/.repository/org/eclipse/tracecompass/org.eclipse.tracecompass.releng-site/4.0.0-SNAPSHOT/org.eclipse.tracecompass.releng-site-4.0.0-SNAPSHOT-p2metadata.xml
05:38:18 [INFO] Installing /home/hudson/jenkins-slave-tracecompass/workspace/tracecompass-master-nightly-gtk3/releng/org.eclipse.tracecompass.releng-site/target/p2artifacts.xml to /home/hudson/jenkins-slave-tracecompass/workspace/tracecompass-master-nightly-gtk3/.repository/org/eclipse/tracecompass/org.eclipse.tracecompass.releng-site/4.0.0-SNAPSHOT/org.eclipse.tracecompass.releng-site-4.0.0-SNAPSHOT-p2artifacts.xml
05:38:18 [INFO] 
05:38:18 [INFO] --- tycho-p2-plugin:1.1.0:update-local-index (default-update-local-index) @ org.eclipse.tracecompass.releng-site ---
05:38:18 [INFO] ------------------------------------------------------------------------
05:38:18 [INFO] Reactor Summary:
05:38:18 [INFO] 
05:38:18 [INFO] Trace Compass Parent ............................... SUCCESS [  3.142 s]
05:38:18 [INFO] Trace Compass Tracetype-agnostic Analyses Parent ... SUCCESS [  0.053 s]
05:38:18 [INFO] Trace Compass Common Utilities Parent .............. SUCCESS [  0.049 s]
05:38:18 [INFO] org.eclipse.tracecompass.common.core ............... SUCCESS [  7.512 s]
05:38:18 [INFO] Trace Compass State System Parent .................. SUCCESS [  0.053 s]
05:38:18 [INFO] org.eclipse.tracecompass.datastore.core ............ SUCCESS [  2.320 s]
05:38:18 [INFO] org.eclipse.tracecompass.segmentstore.core ......... SUCCESS [  1.533 s]
05:38:18 [INFO] org.eclipse.tracecompass.statesystem.core .......... SUCCESS [  2.060 s]
05:38:18 [INFO] Trace Compass TMF Parent ........................... SUCCESS [  0.038 s]
05:38:18 [INFO] Trace Compass Filter Parser ........................ SUCCESS [  0.974 s]
05:38:18 [INFO] org.eclipse.tracecompass.tmf.core .................. SUCCESS [  7.033 s]
05:38:18 [INFO] org.eclipse.tracecompass.analysis.counters.core .... SUCCESS [  1.084 s]
05:38:18 [INFO] Trace Compass CTF Support Parent ................... SUCCESS [  0.025 s]
05:38:18 [INFO] Trace Compass CTF Parser Plug-in ................... SUCCESS [  3.513 s]
05:38:18 [INFO] org.eclipse.tracecompass.ctf.core .................. SUCCESS [  2.261 s]
05:38:18 [INFO] Trace Compass CTF Core Tests Plug-in ............... SUCCESS [01:04 min]
05:38:18 [INFO] org.eclipse.tracecompass.tmf.core.tests ............ SUCCESS [04:44 min]
05:38:18 [INFO] org.eclipse.tracecompass.tmf.ctf.core .............. SUCCESS [  1.504 s]
05:38:18 [INFO] org.eclipse.tracecompass.tmf.ctf.core.tests ........ SUCCESS [07:05 min]
05:38:18 [INFO] org.eclipse.tracecompass.analysis.counters.core.tests SUCCESS [ 13.292 s]
05:38:18 [INFO] org.eclipse.tracecompass.tmf.ui .................... SUCCESS [ 18.380 s]
05:38:18 [INFO] org.eclipse.tracecompass.analysis.counters.ui ...... SUCCESS [  1.184 s]
05:38:18 [INFO] org.eclipse.tracecompass.analysis.graph.core ....... SUCCESS [  1.223 s]
05:38:18 [INFO] org.eclipse.tracecompass.analysis.graph.core.tests . SUCCESS [ 12.128 s]
05:38:18 [INFO] org.eclipse.tracecompass.tmf.chart.core ............ SUCCESS [  1.146 s]
05:38:18 [INFO] org.eclipse.tracecompass.analysis.lami.core ........ SUCCESS [  1.362 s]
05:38:18 [INFO] org.eclipse.tracecompass.analysis.lami.core.tests .. SUCCESS [ 10.618 s]
05:38:18 [INFO] org.eclipse.tracecompass.tmf.chart.ui .............. SUCCESS [  1.509 s]
05:38:18 [INFO] org.eclipse.tracecompass.analysis.lami.ui .......... SUCCESS [  1.332 s]
05:38:18 [INFO] org.eclipse.tracecompass.analysis.graph.ui ......... SUCCESS [  1.019 s]
05:38:18 [INFO] org.eclipse.tracecompass.analysis.timing.core ...... SUCCESS [  1.161 s]
05:38:18 [INFO] org.eclipse.tracecompass.analysis.os.linux.core .... SUCCESS [  2.319 s]
05:38:18 [INFO] org.eclipse.tracecompass.statesystem.core.tests .... SUCCESS [ 20.936 s]
05:38:18 [INFO] org.eclipse.tracecompass.analysis.os.linux.core.tests SUCCESS [02:05 min]
05:38:18 [INFO] org.eclipse.tracecompass.analysis.timing.ui ........ SUCCESS [  2.010 s]
05:38:18 [INFO] org.eclipse.tracecompass.analysis.os.linux.ui ...... SUCCESS [  2.646 s]
05:38:18 [INFO] org.eclipse.tracecompass.analysis.os.linux.ui.tests  SUCCESS [ 26.417 s]
05:38:18 [INFO] org.eclipse.tracecompass.analysis.profiling.core ... SUCCESS [  1.242 s]
05:38:18 [INFO] org.eclipse.tracecompass.analysis.profiling.core.tests SUCCESS [  9.066 s]
05:38:18 [INFO] org.eclipse.tracecompass.analysis.profiling.ui ..... SUCCESS [  1.433 s]
05:38:18 [INFO] org.eclipse.tracecompass.tmf.ui.tests .............. SUCCESS [03:03 min]
05:38:18 [INFO] org.eclipse.tracecompass.tmf.ui.swtbot.tests ....... SUCCESS [09:24 min]
05:38:18 [INFO] org.eclipse.tracecompass.analysis.timing.core.tests  SUCCESS [ 15.713 s]
05:38:18 [INFO] org.eclipse.tracecompass.analysis.profiling.ui.swtbot.tests SUCCESS [ 33.051 s]
05:38:18 [INFO] Trace Compass LTTng Support Parent ................. SUCCESS [  0.141 s]
05:38:18 [INFO] org.eclipse.tracecompass.lttng2.common.core ........ SUCCESS [  0.970 s]
05:38:18 [INFO] org.eclipse.tracecompass.tmf.analysis.xml.core ..... SUCCESS [  2.882 s]
05:38:18 [INFO] org.eclipse.tracecompass.lttng2.kernel.core ........ SUCCESS [  1.612 s]
05:38:18 [INFO] org.eclipse.tracecompass.analysis.counters.ui.swtbot.tests SUCCESS [02:30 min]
05:38:18 [INFO] org.eclipse.tracecompass.analysis.timing.ui.swtbot.tests SUCCESS [01:31 min]
05:38:18 [INFO] org.eclipse.tracecompass.analysis.os.linux.ui.swtbot.tests SUCCESS [02:24 min]
05:38:18 [INFO] org.eclipse.tracecompass.tmf.chart.core.tests ...... SUCCESS [  7.785 s]
05:38:18 [INFO] org.eclipse.tracecompass.tmf.chart.ui.swtbot.tests . SUCCESS [ 25.718 s]
05:38:18 [INFO] org.eclipse.tracecompass.analysis.lami.ui.swtbot.tests SUCCESS [ 45.008 s]
05:38:18 [INFO] Trace Compass BTF Support Parent ................... SUCCESS [  0.109 s]
05:38:18 [INFO] org.eclipse.tracecompass.btf.core .................. SUCCESS [  1.236 s]
05:38:18 [INFO] Trace Compass Documentation ........................ SUCCESS [  0.054 s]
05:38:18 [INFO] Trace Compass Developer Guide ...................... SUCCESS [ 12.925 s]
05:38:18 [INFO] org.eclipse.tracecompass.tmf.analysis.xml.ui ....... SUCCESS [  1.950 s]
05:38:18 [INFO] org.eclipse.tracecompass.tmf ....................... SUCCESS [  1.068 s]
05:38:18 [INFO] org.eclipse.tracecompass.btf.ui .................... SUCCESS [  0.997 s]
05:38:18 [INFO] org.eclipse.tracecompass.btf ....................... SUCCESS [  0.324 s]
05:38:18 [INFO] org.eclipse.tracecompass.btf.core.tests ............ SUCCESS [  8.936 s]
05:38:18 [INFO] org.eclipse.tracecompass.common.core.tests ......... SUCCESS [  8.551 s]
05:38:18 [INFO] org.eclipse.tracecompass.ctf ....................... SUCCESS [  0.304 s]
05:38:18 [INFO] org.eclipse.tracecompass.ctf.parser.tests .......... SUCCESS [  7.018 s]
05:38:18 [INFO] org.eclipse.tracecompass.tmf.ctf ................... SUCCESS [  0.357 s]
05:38:18 [INFO] org.eclipse.tracecompass.tmf.ctf.ui.swtbot.tests ... SUCCESS [02:50 min]
05:38:18 [INFO] Trace Compass User Guide ........................... SUCCESS [ 10.719 s]
05:38:18 [INFO] Trace Compass GDB Tracepoint Analysis User Guide ... SUCCESS [  6.307 s]
05:38:18 [INFO] Trace Compass RCP User Guide ....................... SUCCESS [  6.948 s]
05:38:18 [INFO] Trace Compass Pcap User Guide ...................... SUCCESS [  6.342 s]
05:38:18 [INFO] org.eclipse.tracecompass.examples .................. SUCCESS [  0.942 s]
05:38:18 [INFO] Trace Compass GDB Tracepoint Analysis Parent ....... SUCCESS [  0.040 s]
05:38:18 [INFO] org.eclipse.tracecompass.gdbtrace.core ............. SUCCESS [  1.654 s]
05:38:18 [INFO] org.eclipse.tracecompass.gdbtrace.ui ............... SUCCESS [  0.928 s]
05:38:18 [INFO] org.eclipse.tracecompass.gdbtrace .................. SUCCESS [  0.271 s]
05:38:18 [INFO] org.eclipse.tracecompass.gdbtrace.core.tests ....... SUCCESS [ 10.013 s]
05:38:18 [INFO] org.eclipse.tracecompass.gdbtrace.ui.tests ......... SUCCESS [ 19.277 s]
05:38:18 [INFO] org.eclipse.tracecompass.lttng2.common.core.tests .. SUCCESS [  6.924 s]
05:38:18 [INFO] org.eclipse.tracecompass.lttng2.control.core ....... SUCCESS [  1.380 s]
05:38:18 [INFO] org.eclipse.tracecompass.tmf.remote.core ........... SUCCESS [  0.921 s]
05:38:18 [INFO] org.eclipse.tracecompass.tmf.remote.ui ............. SUCCESS [  1.514 s]
05:38:18 [INFO] org.eclipse.tracecompass.lttng2.control.ui ......... SUCCESS [  3.009 s]
05:38:18 [INFO] org.eclipse.tracecompass.lttng2.control ............ SUCCESS [  0.307 s]
05:38:18 [INFO] org.eclipse.tracecompass.lttng2.control.core.tests . SUCCESS [  9.549 s]
05:38:18 [INFO] org.eclipse.tracecompass.tmf.remote.core.tests ..... SUCCESS [  7.940 s]
05:38:18 [INFO] org.eclipse.tracecompass.lttng2.control.ui.tests ... SUCCESS [ 56.312 s]
05:38:18 [INFO] org.eclipse.tracecompass.lttng2.kernel.ui .......... SUCCESS [  1.408 s]
05:38:18 [INFO] org.eclipse.tracecompass.lttng2.kernel ............. SUCCESS [  1.109 s]
05:38:18 [INFO] org.eclipse.tracecompass.lttng2.kernel.core.tests .. SUCCESS [01:25 min]
05:38:18 [INFO] org.eclipse.tracecompass.lttng2.ust.core ........... SUCCESS [  1.614 s]
05:38:18 [INFO] org.eclipse.tracecompass.lttng2.ust.ui ............. SUCCESS [  0.965 s]
05:38:18 [INFO] org.eclipse.tracecompass.lttng2.ust ................ SUCCESS [  0.279 s]
05:38:18 [INFO] org.eclipse.tracecompass.lttng2.ust.core.tests ..... SUCCESS [ 36.968 s]
05:38:18 [INFO] org.eclipse.tracecompass.lttng2.ust.ui.tests ....... SUCCESS [ 17.867 s]
05:38:18 [INFO] org.eclipse.tracecompass.lttng2.control.ui.swtbot.tests SUCCESS [01:35 min]
05:38:18 [INFO] org.eclipse.tracecompass.lttng2.kernel.ui.swtbot.tests SUCCESS [10:44 min]
05:38:18 [INFO] org.eclipse.tracecompass.lttng2.ust.ui.swtbot.tests  SUCCESS [02:20 min]
05:38:18 [INFO] Trace Compass Pcap Format Support Parent ........... SUCCESS [  0.156 s]
05:38:18 [INFO] org.eclipse.tracecompass.pcap.core ................. SUCCESS [  1.284 s]
05:38:18 [INFO] Trace Compass Pcap Parser Core Tests Plug-in ....... SUCCESS [ 15.080 s]
05:38:18 [INFO] org.eclipse.tracecompass.tmf.pcap.core ............. SUCCESS [  1.000 s]
05:38:18 [INFO] org.eclipse.tracecompass.tmf.pcap.ui ............... SUCCESS [  0.756 s]
05:38:18 [INFO] org.eclipse.tracecompass.tmf.pcap .................. SUCCESS [  0.337 s]
05:38:18 [INFO] org.eclipse.tracecompass.tmf.pcap.core.tests ....... SUCCESS [  9.547 s]
05:38:18 [INFO] org.eclipse.tracecompass.tmf.pcap.ui.swtbot.tests .. SUCCESS [ 50.197 s]
05:38:18 [INFO] Trace Compass RCP Parent ........................... SUCCESS [  0.100 s]
05:38:18 [INFO] Trace Compass RCP Branding plug-in ................. SUCCESS [  0.549 s]
05:38:18 [INFO] Trace Compass RCP Branding Feature ................. SUCCESS [  0.843 s]
05:38:18 [INFO] org.eclipse.tracecompass.rcp.ui .................... SUCCESS [  0.896 s]
05:38:18 [INFO] Trace Compass RCP Feature .......................... SUCCESS [  0.377 s]
05:38:18 [INFO] org.eclipse.tracecompass.rcp.incubator.ui .......... SUCCESS [  0.632 s]
05:38:18 [INFO] org.eclipse.tracecompass.rcp.incubator ............. SUCCESS [  0.288 s]
05:38:18 [INFO] Trace Compass RCP Product .......................... SUCCESS [02:53 min]
05:38:18 [INFO] Trace Compass RCP Product Tests .................... SUCCESS [02:11 min]
05:38:18 [INFO] Trace Compass Release Engineering Parent ........... SUCCESS [  0.082 s]
05:38:18 [INFO] Trace Compass Target Platform ...................... SUCCESS [  0.412 s]
05:38:18 [INFO] org.eclipse.tracecompass.tmf.analysis.xml.core.tests SUCCESS [01:07 min]
05:38:18 [INFO] org.eclipse.tracecompass.tmf.analysis.xml.ui.swtbot.tests SUCCESS [03:05 min]
05:38:18 [INFO] org.eclipse.tracecompass.tmf.remote.ui.swtbot.tests  SUCCESS [04:29 min]
05:38:18 [INFO] org.eclipse.tracecompass.tmf.analysis.xml.ui.tests . SUCCESS [ 19.514 s]
05:38:18 [INFO] org.eclipse.tracecompass.tmf.remote.ui.tests ....... SUCCESS [ 18.872 s]
05:38:18 [INFO] org.eclipse.tracecompass.integration.swtbot.tests .. SUCCESS [16:51 min]
05:38:18 [INFO] org.eclipse.tracecompass.tmf.chart.ui.tests ........ SUCCESS [ 18.039 s]
05:38:18 [INFO] org.eclipse.tracecompass.datastore.core.tests ...... SUCCESS [ 11.189 s]
05:38:18 [INFO] org.eclipse.tracecompass.segmentstore.core.tests ... SUCCESS [ 10.015 s]
05:38:18 [INFO] Trace Compass All Tests ............................ SUCCESS [ 12.480 s]
05:38:18 [INFO] org.eclipse.tracecompass.testing ................... SUCCESS [  0.938 s]
05:38:18 [INFO] org.eclipse.tracecompass.tmf.remote ................ SUCCESS [  0.221 s]
05:38:18 [INFO] Trace Compass Repository ........................... SUCCESS [ 24.939 s]
05:38:18 [INFO] ------------------------------------------------------------------------
05:38:18 [INFO] BUILD SUCCESS
05:38:18 [INFO] ------------------------------------------------------------------------
05:38:18 [INFO] Total time: 01:37 h
05:38:18 [INFO] Finished at: 2018-06-16T09:38:18+00:00
05:38:19 [INFO] Final Memory: 241M/815M
05:38:19 [INFO] ------------------------------------------------------------------------
05:38:21 Terminating xvnc.
05:38:24 Sending e-mails to: bernd.hufmann@ericsson.com
05:38:25 Recording test results
05:38:50 Build step 'Publish JUnit test result report' changed build result to UNSTABLE
05:38:50 Archiving artifacts
05:39:31 Started calculate disk usage of build
05:39:31 Finished Calculation of disk usage of build in 0 seconds
05:39:31 Started calculate disk usage of workspace
05:39:34 Finished Calculation of disk usage of workspace in  2 second
05:39:34 Finished: UNSTABLE