FailedConsole Output

Skipping 710 KB.. Full Log
 52 kB | 566/571 kB | 392 kB
Progress (4): 17 kB | 52 kB | 570/571 kB | 392 kB
                                                 
Downloaded from eclipse.maven.central.mirror: https://repo.eclipse.org/content/repositories/maven_central/org/apache/velocity/velocity/1.5/velocity-1.5.jar (392 kB at 3.0 MB/s)
Progress (3): 17 kB | 52 kB | 571 kB
                                    
Downloading from eclipse.maven.central.mirror: https://repo.eclipse.org/content/repositories/maven_central/commons-digester/commons-digester/1.6/commons-digester-1.6.jar
Downloaded from eclipse.maven.central.mirror: https://repo.eclipse.org/content/repositories/maven_central/commons-collections/commons-collections/3.2/commons-collections-3.2.jar (571 kB at 4.3 MB/s)
Downloading from eclipse.maven.central.mirror: https://repo.eclipse.org/content/repositories/maven_central/commons-logging/commons-logging/1.0.4/commons-logging-1.0.4.jar
Progress (3): 17 kB | 52 kB | 4.1/189 kB
Progress (3): 17 kB | 52 kB | 7.7/189 kB
Progress (3): 17 kB | 52 kB | 12/189 kB 
Progress (3): 17 kB | 52 kB | 16/189 kB
Progress (3): 17 kB | 52 kB | 20/189 kB
Progress (3): 17 kB | 52 kB | 24/189 kB
Progress (3): 17 kB | 52 kB | 28/189 kB
Progress (3): 17 kB | 52 kB | 32/189 kB
Progress (3): 17 kB | 52 kB | 36/189 kB
Progress (3): 17 kB | 52 kB | 40/189 kB
Progress (3): 17 kB | 52 kB | 44/189 kB
Progress (3): 17 kB | 52 kB | 48/189 kB
Progress (3): 17 kB | 52 kB | 52/189 kB
Progress (3): 17 kB | 52 kB | 56/189 kB
Progress (3): 17 kB | 52 kB | 60/189 kB
Progress (3): 17 kB | 52 kB | 64/189 kB
Progress (3): 17 kB | 52 kB | 68/189 kB
Progress (3): 17 kB | 52 kB | 72/189 kB
Progress (3): 17 kB | 52 kB | 76/189 kB
Progress (3): 17 kB | 52 kB | 80/189 kB
Progress (3): 17 kB | 52 kB | 84/189 kB
Progress (3): 17 kB | 52 kB | 88/189 kB
Progress (3): 17 kB | 52 kB | 92/189 kB
Progress (3): 17 kB | 52 kB | 96/189 kB
Progress (3): 17 kB | 52 kB | 100/189 kB
Progress (3): 17 kB | 52 kB | 104/189 kB
Progress (3): 17 kB | 52 kB | 108/189 kB
Progress (3): 17 kB | 52 kB | 112/189 kB
Progress (4): 17 kB | 52 kB | 112/189 kB | 4.1/168 kB
Progress (4): 17 kB | 52 kB | 116/189 kB | 4.1/168 kB
Progress (4): 17 kB | 52 kB | 116/189 kB | 7.7/168 kB
Progress (4): 17 kB | 52 kB | 120/189 kB | 7.7/168 kB
Progress (4): 17 kB | 52 kB | 120/189 kB | 12/168 kB 
Progress (4): 17 kB | 52 kB | 124/189 kB | 12/168 kB
Progress (4): 17 kB | 52 kB | 124/189 kB | 16/168 kB
Progress (4): 17 kB | 52 kB | 128/189 kB | 16/168 kB
Progress (4): 17 kB | 52 kB | 128/189 kB | 20/168 kB
Progress (4): 17 kB | 52 kB | 132/189 kB | 20/168 kB
Progress (4): 17 kB | 52 kB | 132/189 kB | 24/168 kB
Progress (4): 17 kB | 52 kB | 136/189 kB | 24/168 kB
Progress (4): 17 kB | 52 kB | 136/189 kB | 28/168 kB
Progress (4): 17 kB | 52 kB | 140/189 kB | 28/168 kB
Progress (4): 17 kB | 52 kB | 140/189 kB | 32/168 kB
Progress (4): 17 kB | 52 kB | 144/189 kB | 32/168 kB
Progress (4): 17 kB | 52 kB | 144/189 kB | 33/168 kB
Progress (4): 17 kB | 52 kB | 148/189 kB | 33/168 kB
Progress (4): 17 kB | 52 kB | 148/189 kB | 37/168 kB
Progress (4): 17 kB | 52 kB | 152/189 kB | 37/168 kB
Progress (4): 17 kB | 52 kB | 152/189 kB | 41/168 kB
Progress (4): 17 kB | 52 kB | 156/189 kB | 41/168 kB
Progress (4): 17 kB | 52 kB | 156/189 kB | 45/168 kB
Progress (4): 17 kB | 52 kB | 160/189 kB | 45/168 kB
Progress (4): 17 kB | 52 kB | 160/189 kB | 49/168 kB
Progress (4): 17 kB | 52 kB | 164/189 kB | 49/168 kB
Progress (4): 17 kB | 52 kB | 164/189 kB | 53/168 kB
Progress (4): 17 kB | 52 kB | 168/189 kB | 53/168 kB
Progress (4): 17 kB | 52 kB | 168/189 kB | 57/168 kB
Progress (5): 17 kB | 52 kB | 168/189 kB | 57/168 kB | 4.1/38 kB
Progress (5): 17 kB | 52 kB | 172/189 kB | 57/168 kB | 4.1/38 kB
Progress (5): 17 kB | 52 kB | 172/189 kB | 61/168 kB | 4.1/38 kB
Progress (5): 17 kB | 52 kB | 176/189 kB | 61/168 kB | 4.1/38 kB
Progress (5): 17 kB | 52 kB | 176/189 kB | 61/168 kB | 7.7/38 kB
Progress (5): 17 kB | 52 kB | 176/189 kB | 65/168 kB | 7.7/38 kB
Progress (5): 17 kB | 52 kB | 176/189 kB | 66/168 kB | 7.7/38 kB
Progress (5): 17 kB | 52 kB | 180/189 kB | 66/168 kB | 7.7/38 kB
Progress (5): 17 kB | 52 kB | 180/189 kB | 66/168 kB | 12/38 kB 
Progress (5): 17 kB | 52 kB | 184/189 kB | 66/168 kB | 12/38 kB
Progress (5): 17 kB | 52 kB | 184/189 kB | 66/168 kB | 16/38 kB
Progress (5): 17 kB | 52 kB | 184/189 kB | 70/168 kB | 16/38 kB
Progress (5): 17 kB | 52 kB | 188/189 kB | 70/168 kB | 16/38 kB
Progress (5): 17 kB | 52 kB | 188/189 kB | 74/168 kB | 16/38 kB
Progress (5): 17 kB | 52 kB | 189 kB | 74/168 kB | 16/38 kB    
Progress (5): 17 kB | 52 kB | 189 kB | 74/168 kB | 20/38 kB
Progress (5): 17 kB | 52 kB | 189 kB | 74/168 kB | 24/38 kB
Progress (5): 17 kB | 52 kB | 189 kB | 78/168 kB | 24/38 kB
Progress (5): 17 kB | 52 kB | 189 kB | 82/168 kB | 24/38 kB
Progress (5): 17 kB | 52 kB | 189 kB | 82/168 kB | 28/38 kB
Progress (5): 17 kB | 52 kB | 189 kB | 82/168 kB | 32/38 kB
Progress (5): 17 kB | 52 kB | 189 kB | 86/168 kB | 32/38 kB
Progress (5): 17 kB | 52 kB | 189 kB | 86/168 kB | 33/38 kB
Progress (5): 17 kB | 52 kB | 189 kB | 90/168 kB | 33/38 kB
Progress (5): 17 kB | 52 kB | 189 kB | 90/168 kB | 37/38 kB
Progress (5): 17 kB | 52 kB | 189 kB | 90/168 kB | 38 kB   
Progress (5): 17 kB | 52 kB | 189 kB | 94/168 kB | 38 kB
Progress (5): 17 kB | 52 kB | 189 kB | 98/168 kB | 38 kB
Progress (5): 17 kB | 52 kB | 189 kB | 98/168 kB | 38 kB
Progress (5): 17 kB | 52 kB | 189 kB | 102/168 kB | 38 kB
Progress (5): 17 kB | 52 kB | 189 kB | 106/168 kB | 38 kB
Progress (5): 17 kB | 52 kB | 189 kB | 110/168 kB | 38 kB
Progress (5): 17 kB | 52 kB | 189 kB | 114/168 kB | 38 kB
Progress (5): 17 kB | 52 kB | 189 kB | 118/168 kB | 38 kB
Progress (5): 17 kB | 52 kB | 189 kB | 122/168 kB | 38 kB
Progress (5): 17 kB | 52 kB | 189 kB | 126/168 kB | 38 kB
Progress (5): 17 kB | 52 kB | 189 kB | 130/168 kB | 38 kB
Progress (5): 17 kB | 52 kB | 189 kB | 131/168 kB | 38 kB
Progress (5): 17 kB | 52 kB | 189 kB | 135/168 kB | 38 kB
Progress (5): 17 kB | 52 kB | 189 kB | 139/168 kB | 38 kB
Progress (5): 17 kB | 52 kB | 189 kB | 143/168 kB | 38 kB
Progress (5): 17 kB | 52 kB | 189 kB | 147/168 kB | 38 kB
Progress (5): 17 kB | 52 kB | 189 kB | 151/168 kB | 38 kB
Progress (5): 17 kB | 52 kB | 189 kB | 155/168 kB | 38 kB
Progress (5): 17 kB | 52 kB | 189 kB | 159/168 kB | 38 kB
Progress (5): 17 kB | 52 kB | 189 kB | 163/168 kB | 38 kB
Progress (5): 17 kB | 52 kB | 189 kB | 164/168 kB | 38 kB
Progress (5): 17 kB | 52 kB | 189 kB | 168/168 kB | 38 kB
Progress (5): 17 kB | 52 kB | 189 kB | 168 kB | 38 kB    
                                                     
Downloaded from eclipse.maven.central.mirror: https://repo.eclipse.org/content/repositories/maven_central/commons-logging/commons-logging/1.0.4/commons-logging-1.0.4.jar (38 kB at 259 kB/s)
Downloaded from eclipse.maven.central.mirror: https://repo.eclipse.org/content/repositories/maven_central/commons-beanutils/commons-beanutils/1.7.0/commons-beanutils-1.7.0.jar (189 kB at 1.3 MB/s)
Downloading from eclipse.maven.central.mirror: https://repo.eclipse.org/content/repositories/maven_central/oro/oro/2.0.8/oro-2.0.8.jar
Downloading from eclipse.maven.central.mirror: https://repo.eclipse.org/content/repositories/maven_central/xml-apis/xml-apis/1.0.b2/xml-apis-1.0.b2.jar
Downloaded from eclipse.maven.central.mirror: https://repo.eclipse.org/content/repositories/maven_central/commons-digester/commons-digester/1.6/commons-digester-1.6.jar (168 kB at 1.1 MB/s)
Downloading from eclipse.maven.central.mirror: https://repo.eclipse.org/content/repositories/maven_central/org/jacoco/org.jacoco.agent/0.7.2.201409121644/org.jacoco.agent-0.7.2.201409121644-runtime.jar
Progress (3): 17 kB | 52 kB | 4.1/65 kB
Progress (3): 17 kB | 52 kB | 7.7/65 kB
Progress (3): 17 kB | 52 kB | 12/65 kB 
Progress (3): 17 kB | 52 kB | 16/65 kB
Progress (3): 17 kB | 52 kB | 20/65 kB
Progress (3): 17 kB | 52 kB | 24/65 kB
Progress (4): 17 kB | 52 kB | 24/65 kB | 4.1/109 kB
Progress (4): 17 kB | 52 kB | 28/65 kB | 4.1/109 kB
Progress (4): 17 kB | 52 kB | 32/65 kB | 4.1/109 kB
Progress (4): 17 kB | 52 kB | 32/65 kB | 7.7/109 kB
Progress (4): 17 kB | 52 kB | 36/65 kB | 7.7/109 kB
Progress (4): 17 kB | 52 kB | 40/65 kB | 7.7/109 kB
Progress (4): 17 kB | 52 kB | 44/65 kB | 7.7/109 kB
Progress (4): 17 kB | 52 kB | 48/65 kB | 7.7/109 kB
Progress (4): 17 kB | 52 kB | 52/65 kB | 7.7/109 kB
Progress (4): 17 kB | 52 kB | 56/65 kB | 7.7/109 kB
Progress (4): 17 kB | 52 kB | 56/65 kB | 12/109 kB 
Progress (4): 17 kB | 52 kB | 56/65 kB | 16/109 kB
Progress (4): 17 kB | 52 kB | 60/65 kB | 16/109 kB
Progress (4): 17 kB | 52 kB | 64/65 kB | 16/109 kB
Progress (4): 17 kB | 52 kB | 65 kB | 16/109 kB   
Progress (4): 17 kB | 52 kB | 65 kB | 20/109 kB
Progress (4): 17 kB | 52 kB | 65 kB | 24/109 kB
Progress (4): 17 kB | 52 kB | 65 kB | 28/109 kB
Progress (4): 17 kB | 52 kB | 65 kB | 32/109 kB
Progress (4): 17 kB | 52 kB | 65 kB | 33/109 kB
Progress (4): 17 kB | 52 kB | 65 kB | 37/109 kB
Progress (4): 17 kB | 52 kB | 65 kB | 41/109 kB
Progress (4): 17 kB | 52 kB | 65 kB | 45/109 kB
Progress (4): 17 kB | 52 kB | 65 kB | 49/109 kB
Progress (4): 17 kB | 52 kB | 65 kB | 53/109 kB
Progress (4): 17 kB | 52 kB | 65 kB | 57/109 kB
Progress (4): 17 kB | 52 kB | 65 kB | 61/109 kB
Progress (4): 17 kB | 52 kB | 65 kB | 65/109 kB
Progress (4): 17 kB | 52 kB | 65 kB | 66/109 kB
Progress (4): 17 kB | 52 kB | 65 kB | 70/109 kB
Progress (4): 17 kB | 52 kB | 65 kB | 74/109 kB
Progress (4): 17 kB | 52 kB | 65 kB | 78/109 kB
Progress (4): 17 kB | 52 kB | 65 kB | 82/109 kB
Progress (4): 17 kB | 52 kB | 65 kB | 86/109 kB
Progress (4): 17 kB | 52 kB | 65 kB | 90/109 kB
Progress (4): 17 kB | 52 kB | 65 kB | 94/109 kB
Progress (4): 17 kB | 52 kB | 65 kB | 98/109 kB
Progress (4): 17 kB | 52 kB | 65 kB | 102/109 kB
Progress (4): 17 kB | 52 kB | 65 kB | 106/109 kB
Progress (4): 17 kB | 52 kB | 65 kB | 109 kB    
                                            
Downloaded from eclipse.maven.central.mirror: https://repo.eclipse.org/content/repositories/maven_central/oro/oro/2.0.8/oro-2.0.8.jar (65 kB at 410 kB/s)
Downloading from eclipse.maven.central.mirror: https://repo.eclipse.org/content/repositories/maven_central/org/jacoco/org.jacoco.core/0.7.2.201409121644/org.jacoco.core-0.7.2.201409121644.jar
Downloaded from eclipse.maven.central.mirror: https://repo.eclipse.org/content/repositories/maven_central/xml-apis/xml-apis/1.0.b2/xml-apis-1.0.b2.jar (109 kB at 671 kB/s)
Downloading from eclipse.maven.central.mirror: https://repo.eclipse.org/content/repositories/maven_central/org/ow2/asm/asm-debug-all/5.0.1/asm-debug-all-5.0.1.jar
Progress (3): 17 kB | 52 kB | 4.1/380 kB
Progress (3): 17 kB | 52 kB | 7.7/380 kB
Progress (3): 17 kB | 52 kB | 12/380 kB 
Progress (3): 17 kB | 52 kB | 16/380 kB
Progress (3): 17 kB | 52 kB | 20/380 kB
Progress (3): 17 kB | 52 kB | 24/380 kB
Progress (3): 17 kB | 52 kB | 28/380 kB
Progress (3): 17 kB | 52 kB | 32/380 kB
Progress (3): 17 kB | 52 kB | 33/380 kB
Progress (3): 17 kB | 52 kB | 37/380 kB
Progress (3): 17 kB | 52 kB | 41/380 kB
Progress (3): 17 kB | 52 kB | 45/380 kB
Progress (3): 17 kB | 52 kB | 49/380 kB
Progress (3): 17 kB | 52 kB | 53/380 kB
Progress (3): 17 kB | 52 kB | 57/380 kB
Progress (3): 17 kB | 52 kB | 61/380 kB
Progress (3): 17 kB | 52 kB | 65/380 kB
Progress (3): 17 kB | 52 kB | 66/380 kB
Progress (3): 17 kB | 52 kB | 70/380 kB
Progress (3): 17 kB | 52 kB | 74/380 kB
Progress (3): 17 kB | 52 kB | 78/380 kB
Progress (3): 17 kB | 52 kB | 82/380 kB
Progress (3): 17 kB | 52 kB | 86/380 kB
Progress (3): 17 kB | 52 kB | 90/380 kB
Progress (3): 17 kB | 52 kB | 94/380 kB
Progress (3): 17 kB | 52 kB | 98/380 kB
Progress (3): 17 kB | 52 kB | 102/380 kB
Progress (3): 17 kB | 52 kB | 106/380 kB
Progress (3): 17 kB | 52 kB | 110/380 kB
Progress (3): 17 kB | 52 kB | 114/380 kB
Progress (3): 17 kB | 52 kB | 118/380 kB
Progress (3): 17 kB | 52 kB | 122/380 kB
Progress (3): 17 kB | 52 kB | 126/380 kB
Progress (3): 17 kB | 52 kB | 130/380 kB
Progress (3): 17 kB | 52 kB | 134/380 kB
Progress (3): 17 kB | 52 kB | 138/380 kB
Progress (3): 17 kB | 52 kB | 142/380 kB
Progress (3): 17 kB | 52 kB | 146/380 kB
Progress (3): 17 kB | 52 kB | 150/380 kB
Progress (3): 17 kB | 52 kB | 154/380 kB
Progress (3): 17 kB | 52 kB | 158/380 kB
Progress (3): 17 kB | 52 kB | 162/380 kB
Progress (3): 17 kB | 52 kB | 166/380 kB
Progress (3): 17 kB | 52 kB | 170/380 kB
Progress (3): 17 kB | 52 kB | 174/380 kB
Progress (3): 17 kB | 52 kB | 178/380 kB
Progress (3): 17 kB | 52 kB | 182/380 kB
Progress (3): 17 kB | 52 kB | 186/380 kB
Progress (3): 17 kB | 52 kB | 190/380 kB
Progress (3): 17 kB | 52 kB | 194/380 kB
Progress (3): 17 kB | 52 kB | 198/380 kB
Progress (3): 17 kB | 52 kB | 202/380 kB
Progress (3): 17 kB | 52 kB | 206/380 kB
Progress (3): 17 kB | 52 kB | 210/380 kB
Progress (3): 17 kB | 52 kB | 214/380 kB
Progress (3): 17 kB | 52 kB | 218/380 kB
Progress (3): 17 kB | 52 kB | 222/380 kB
Progress (3): 17 kB | 52 kB | 226/380 kB
Progress (3): 17 kB | 52 kB | 230/380 kB
Progress (3): 17 kB | 52 kB | 234/380 kB
Progress (3): 17 kB | 52 kB | 238/380 kB
Progress (3): 17 kB | 52 kB | 242/380 kB
Progress (3): 17 kB | 52 kB | 246/380 kB
Progress (3): 17 kB | 52 kB | 250/380 kB
Progress (3): 17 kB | 52 kB | 254/380 kB
Progress (3): 17 kB | 52 kB | 258/380 kB
Progress (3): 17 kB | 52 kB | 262/380 kB
Progress (3): 17 kB | 52 kB | 266/380 kB
Progress (3): 17 kB | 52 kB | 270/380 kB
Progress (3): 17 kB | 52 kB | 274/380 kB
Progress (3): 17 kB | 52 kB | 278/380 kB
Progress (3): 17 kB | 52 kB | 282/380 kB
Progress (3): 17 kB | 52 kB | 286/380 kB
Progress (3): 17 kB | 52 kB | 290/380 kB
Progress (3): 17 kB | 52 kB | 294/380 kB
Progress (3): 17 kB | 52 kB | 298/380 kB
Progress (3): 17 kB | 52 kB | 302/380 kB
Progress (3): 17 kB | 52 kB | 306/380 kB
Progress (3): 17 kB | 52 kB | 310/380 kB
Progress (3): 17 kB | 52 kB | 314/380 kB
Progress (3): 17 kB | 52 kB | 318/380 kB
Progress (3): 17 kB | 52 kB | 322/380 kB
Progress (3): 17 kB | 52 kB | 326/380 kB
Progress (3): 17 kB | 52 kB | 330/380 kB
Progress (3): 17 kB | 52 kB | 334/380 kB
Progress (3): 17 kB | 52 kB | 338/380 kB
Progress (3): 17 kB | 52 kB | 342/380 kB
Progress (3): 17 kB | 52 kB | 346/380 kB
Progress (3): 17 kB | 52 kB | 350/380 kB
Progress (3): 17 kB | 52 kB | 354/380 kB
Progress (3): 17 kB | 52 kB | 358/380 kB
Progress (3): 17 kB | 52 kB | 362/380 kB
Progress (3): 17 kB | 52 kB | 366/380 kB
Progress (3): 17 kB | 52 kB | 370/380 kB
Progress (3): 17 kB | 52 kB | 374/380 kB
Progress (3): 17 kB | 52 kB | 378/380 kB
Progress (3): 17 kB | 52 kB | 380 kB    
                                    
Downloaded from eclipse.maven.central.mirror: https://repo.eclipse.org/content/repositories/maven_central/org/ow2/asm/asm-debug-all/5.0.1/asm-debug-all-5.0.1.jar (380 kB at 2.0 MB/s)
Downloading from eclipse.maven.central.mirror: https://repo.eclipse.org/content/repositories/maven_central/org/jacoco/org.jacoco.report/0.7.2.201409121644/org.jacoco.report-0.7.2.201409121644.jar
Progress (3): 17 kB | 52 kB | 4.1/287 kB
Progress (3): 17 kB | 52 kB | 7.7/287 kB
Progress (3): 17 kB | 52 kB | 12/287 kB 
Progress (3): 17 kB | 52 kB | 16/287 kB
Progress (3): 17 kB | 52 kB | 20/287 kB
Progress (3): 17 kB | 52 kB | 24/287 kB
Progress (3): 17 kB | 52 kB | 28/287 kB
Progress (3): 17 kB | 52 kB | 32/287 kB
Progress (3): 17 kB | 52 kB | 33/287 kB
Progress (3): 17 kB | 52 kB | 37/287 kB
Progress (3): 17 kB | 52 kB | 41/287 kB
Progress (3): 17 kB | 52 kB | 45/287 kB
Progress (3): 17 kB | 52 kB | 49/287 kB
Progress (3): 17 kB | 52 kB | 53/287 kB
Progress (3): 17 kB | 52 kB | 57/287 kB
Progress (3): 17 kB | 52 kB | 61/287 kB
Progress (3): 17 kB | 52 kB | 65/287 kB
Progress (3): 17 kB | 52 kB | 66/287 kB
Progress (3): 17 kB | 52 kB | 70/287 kB
Progress (3): 17 kB | 52 kB | 74/287 kB
Progress (3): 17 kB | 52 kB | 78/287 kB
Progress (3): 17 kB | 52 kB | 82/287 kB
Progress (3): 17 kB | 52 kB | 86/287 kB
Progress (3): 17 kB | 52 kB | 90/287 kB
Progress (3): 17 kB | 52 kB | 94/287 kB
Progress (3): 17 kB | 52 kB | 98/287 kB
Progress (3): 17 kB | 52 kB | 102/287 kB
Progress (3): 17 kB | 52 kB | 106/287 kB
Progress (3): 17 kB | 52 kB | 110/287 kB
Progress (3): 17 kB | 52 kB | 114/287 kB
Progress (3): 17 kB | 52 kB | 118/287 kB
Progress (3): 17 kB | 52 kB | 122/287 kB
Progress (3): 17 kB | 52 kB | 126/287 kB
Progress (3): 17 kB | 52 kB | 130/287 kB
Progress (3): 17 kB | 52 kB | 134/287 kB
Progress (3): 17 kB | 52 kB | 138/287 kB
Progress (3): 17 kB | 52 kB | 142/287 kB
Progress (3): 17 kB | 52 kB | 146/287 kB
Progress (3): 17 kB | 52 kB | 150/287 kB
Progress (3): 17 kB | 52 kB | 154/287 kB
Progress (3): 17 kB | 52 kB | 158/287 kB
Progress (3): 17 kB | 52 kB | 162/287 kB
Progress (3): 17 kB | 52 kB | 166/287 kB
Progress (3): 17 kB | 52 kB | 170/287 kB
Progress (3): 17 kB | 52 kB | 174/287 kB
Progress (3): 17 kB | 52 kB | 178/287 kB
Progress (3): 17 kB | 52 kB | 182/287 kB
Progress (3): 17 kB | 52 kB | 186/287 kB
Progress (3): 17 kB | 52 kB | 190/287 kB
Progress (3): 17 kB | 52 kB | 194/287 kB
Progress (3): 17 kB | 52 kB | 198/287 kB
Progress (3): 17 kB | 52 kB | 202/287 kB
Progress (3): 17 kB | 52 kB | 206/287 kB
Progress (3): 17 kB | 52 kB | 210/287 kB
Progress (3): 17 kB | 52 kB | 214/287 kB
Progress (3): 17 kB | 52 kB | 218/287 kB
Progress (3): 17 kB | 52 kB | 222/287 kB
Progress (3): 17 kB | 52 kB | 226/287 kB
Progress (4): 17 kB | 52 kB | 226/287 kB | 4.1/133 kB
Progress (4): 17 kB | 52 kB | 230/287 kB | 4.1/133 kB
Progress (4): 17 kB | 52 kB | 234/287 kB | 4.1/133 kB
Progress (4): 17 kB | 52 kB | 234/287 kB | 7.7/133 kB
Progress (4): 17 kB | 52 kB | 238/287 kB | 7.7/133 kB
Progress (4): 17 kB | 52 kB | 238/287 kB | 12/133 kB 
Progress (4): 17 kB | 52 kB | 242/287 kB | 12/133 kB
Progress (4): 17 kB | 52 kB | 242/287 kB | 16/133 kB
Progress (4): 17 kB | 52 kB | 246/287 kB | 16/133 kB
Progress (4): 17 kB | 52 kB | 246/287 kB | 20/133 kB
Progress (4): 17 kB | 52 kB | 250/287 kB | 20/133 kB
Progress (4): 17 kB | 52 kB | 250/287 kB | 24/133 kB
Progress (4): 17 kB | 52 kB | 254/287 kB | 24/133 kB
Progress (4): 17 kB | 52 kB | 258/287 kB | 24/133 kB
Progress (4): 17 kB | 52 kB | 258/287 kB | 28/133 kB
Progress (4): 17 kB | 52 kB | 258/287 kB | 32/133 kB
Progress (4): 17 kB | 52 kB | 262/287 kB | 32/133 kB
Progress (4): 17 kB | 52 kB | 262/287 kB | 33/133 kB
Progress (4): 17 kB | 52 kB | 266/287 kB | 33/133 kB
Progress (4): 17 kB | 52 kB | 266/287 kB | 37/133 kB
Progress (4): 17 kB | 52 kB | 270/287 kB | 37/133 kB
Progress (4): 17 kB | 52 kB | 270/287 kB | 41/133 kB
Progress (4): 17 kB | 52 kB | 274/287 kB | 41/133 kB
Progress (4): 17 kB | 52 kB | 274/287 kB | 45/133 kB
Progress (4): 17 kB | 52 kB | 278/287 kB | 45/133 kB
Progress (4): 17 kB | 52 kB | 278/287 kB | 49/133 kB
Progress (4): 17 kB | 52 kB | 282/287 kB | 49/133 kB
Progress (4): 17 kB | 52 kB | 286/287 kB | 49/133 kB
Progress (4): 17 kB | 52 kB | 286/287 kB | 53/133 kB
Progress (4): 17 kB | 52 kB | 287 kB | 53/133 kB    
Progress (4): 17 kB | 52 kB | 287 kB | 57/133 kB
Progress (4): 17 kB | 52 kB | 287 kB | 61/133 kB
Progress (4): 17 kB | 52 kB | 287 kB | 65/133 kB
Progress (4): 17 kB | 52 kB | 287 kB | 66/133 kB
Progress (4): 17 kB | 52 kB | 287 kB | 70/133 kB
Progress (4): 17 kB | 52 kB | 287 kB | 74/133 kB
Progress (4): 17 kB | 52 kB | 287 kB | 78/133 kB
Progress (4): 17 kB | 52 kB | 287 kB | 82/133 kB
Progress (4): 17 kB | 52 kB | 287 kB | 86/133 kB
Progress (4): 17 kB | 52 kB | 287 kB | 90/133 kB
Progress (4): 17 kB | 52 kB | 287 kB | 94/133 kB
Progress (4): 17 kB | 52 kB | 287 kB | 98/133 kB
Progress (4): 17 kB | 52 kB | 287 kB | 98/133 kB
Progress (4): 17 kB | 52 kB | 287 kB | 102/133 kB
Progress (4): 17 kB | 52 kB | 287 kB | 106/133 kB
Progress (4): 17 kB | 52 kB | 287 kB | 110/133 kB
Progress (4): 17 kB | 52 kB | 287 kB | 114/133 kB
Progress (4): 17 kB | 52 kB | 287 kB | 118/133 kB
Progress (4): 17 kB | 52 kB | 287 kB | 122/133 kB
Progress (4): 17 kB | 52 kB | 287 kB | 126/133 kB
Progress (4): 17 kB | 52 kB | 287 kB | 130/133 kB
Progress (4): 17 kB | 52 kB | 287 kB | 133 kB    
Progress (5): 17 kB | 52 kB | 287 kB | 133 kB | 4.1/140 kB
Progress (5): 17 kB | 52 kB | 287 kB | 133 kB | 7.7/140 kB
Progress (5): 17 kB | 52 kB | 287 kB | 133 kB | 12/140 kB 
Progress (5): 17 kB | 52 kB | 287 kB | 133 kB | 16/140 kB
Progress (5): 17 kB | 52 kB | 287 kB | 133 kB | 20/140 kB
Progress (5): 17 kB | 52 kB | 287 kB | 133 kB | 24/140 kB
                                                         
Downloaded from eclipse.maven.central.mirror: https://repo.eclipse.org/content/repositories/maven_central/org/apache/maven/reporting/maven-reporting-impl/2.1/maven-reporting-impl-2.1.jar (17 kB at 66 kB/s)
Progress (4): 52 kB | 287 kB | 133 kB | 28/140 kB
Progress (4): 52 kB | 287 kB | 133 kB | 32/140 kB
Progress (4): 52 kB | 287 kB | 133 kB | 33/140 kB
Progress (4): 52 kB | 287 kB | 133 kB | 37/140 kB
Progress (4): 52 kB | 287 kB | 133 kB | 41/140 kB
Progress (4): 52 kB | 287 kB | 133 kB | 45/140 kB
Progress (4): 52 kB | 287 kB | 133 kB | 49/140 kB
Progress (4): 52 kB | 287 kB | 133 kB | 53/140 kB
Progress (4): 52 kB | 287 kB | 133 kB | 57/140 kB
Progress (4): 52 kB | 287 kB | 133 kB | 61/140 kB
Progress (4): 52 kB | 287 kB | 133 kB | 65/140 kB
Progress (4): 52 kB | 287 kB | 133 kB | 66/140 kB
Progress (4): 52 kB | 287 kB | 133 kB | 70/140 kB
Progress (4): 52 kB | 287 kB | 133 kB | 74/140 kB
Progress (4): 52 kB | 287 kB | 133 kB | 78/140 kB
Progress (4): 52 kB | 287 kB | 133 kB | 82/140 kB
Progress (4): 52 kB | 287 kB | 133 kB | 86/140 kB
Progress (4): 52 kB | 287 kB | 133 kB | 90/140 kB
Progress (4): 52 kB | 287 kB | 133 kB | 94/140 kB
Progress (4): 52 kB | 287 kB | 133 kB | 98/140 kB
Progress (4): 52 kB | 287 kB | 133 kB | 98/140 kB
Progress (4): 52 kB | 287 kB | 133 kB | 102/140 kB
Progress (4): 52 kB | 287 kB | 133 kB | 106/140 kB
Progress (4): 52 kB | 287 kB | 133 kB | 110/140 kB
Progress (4): 52 kB | 287 kB | 133 kB | 114/140 kB
Progress (4): 52 kB | 287 kB | 133 kB | 118/140 kB
Progress (4): 52 kB | 287 kB | 133 kB | 122/140 kB
                                                  
Downloaded from eclipse.maven.central.mirror: https://repo.eclipse.org/content/repositories/maven_central/org/jacoco/org.jacoco.agent/0.7.2.201409121644/org.jacoco.agent-0.7.2.201409121644-runtime.jar (287 kB at 1.1 MB/s)
Progress (3): 52 kB | 133 kB | 126/140 kB
Progress (3): 52 kB | 133 kB | 130/140 kB
Progress (3): 52 kB | 133 kB | 134/140 kB
Progress (3): 52 kB | 133 kB | 138/140 kB
Progress (3): 52 kB | 133 kB | 140 kB    
                                     
Downloaded from eclipse.maven.central.mirror: https://repo.eclipse.org/content/repositories/maven_central/org/jacoco/org.jacoco.core/0.7.2.201409121644/org.jacoco.core-0.7.2.201409121644.jar (133 kB at 517 kB/s)
Downloaded from eclipse.maven.central.mirror: https://repo.eclipse.org/content/repositories/maven_central/org/jacoco/org.jacoco.report/0.7.2.201409121644/org.jacoco.report-0.7.2.201409121644.jar (140 kB at 537 kB/s)
Downloaded from eclipse.maven.central.mirror: https://repo.eclipse.org/content/repositories/maven_central/org/apache/maven/doxia/doxia-decoration-model/1.1.2/doxia-decoration-model-1.1.2.jar (52 kB at 182 kB/s)
[INFO] jacoco.argLine set to -javaagent:/home/hudson/genie.sisu/.jenkins/jobs/sisu-sonar/workspace/.repository/org/jacoco/org.jacoco.agent/0.7.2.201409121644/org.jacoco.agent-0.7.2.201409121644-runtime.jar=destfile=/jobs/genie.sisu/sisu-sonar/workspace/org.eclipse.sisu.inject.tests/target/jacoco.exec
[INFO] 
[INFO] --- maven-resources-plugin:2.7:resources (default-resources) @ org.eclipse.sisu.inject.tests ---
[INFO] Using 'UTF-8' encoding to copy filtered resources.
[INFO] skip non existing resourceDirectory /jobs/genie.sisu/sisu-sonar/workspace/org.eclipse.sisu.inject.tests/src/main/resources
[INFO] 
[INFO] --- maven-compiler-plugin:3.1:compile (default-compile) @ org.eclipse.sisu.inject.tests ---
Downloading from eclipse.maven.central.mirror: https://repo.eclipse.org/content/repositories/maven_central/org/codehaus/plexus/plexus-utils/1.5.1/plexus-utils-1.5.1.pom
Progress (1): 2.3 kB
                    
Downloaded from eclipse.maven.central.mirror: https://repo.eclipse.org/content/repositories/maven_central/org/codehaus/plexus/plexus-utils/1.5.1/plexus-utils-1.5.1.pom (2.3 kB at 144 kB/s)
Downloading from eclipse.maven.central.mirror: https://repo.eclipse.org/content/repositories/maven_central/org/apache/maven/maven-toolchain/1.0/maven-toolchain-1.0.pom
Progress (1): 3.4 kB
                    
Downloaded from eclipse.maven.central.mirror: https://repo.eclipse.org/content/repositories/maven_central/org/apache/maven/maven-toolchain/1.0/maven-toolchain-1.0.pom (3.4 kB at 244 kB/s)
Downloading from eclipse.maven.central.mirror: https://repo.eclipse.org/content/repositories/maven_central/org/apache/maven/shared/maven-shared-utils/0.1/maven-shared-utils-0.1.pom
Progress (1): 4.0 kB
                    
Downloaded from eclipse.maven.central.mirror: https://repo.eclipse.org/content/repositories/maven_central/org/apache/maven/shared/maven-shared-utils/0.1/maven-shared-utils-0.1.pom (4.0 kB at 270 kB/s)
Downloading from eclipse.maven.central.mirror: https://repo.eclipse.org/content/repositories/maven_central/org/apache/maven/shared/maven-shared-incremental/1.1/maven-shared-incremental-1.1.pom
Progress (1): 4.1/4.7 kB
Progress (1): 4.7 kB    
                    
Downloaded from eclipse.maven.central.mirror: https://repo.eclipse.org/content/repositories/maven_central/org/apache/maven/shared/maven-shared-incremental/1.1/maven-shared-incremental-1.1.pom (4.7 kB at 226 kB/s)
Downloading from eclipse.maven.central.mirror: https://repo.eclipse.org/content/repositories/maven_central/org/codehaus/plexus/plexus-utils/3.0.8/plexus-utils-3.0.8.pom
Progress (1): 3.1 kB
                    
Downloaded from eclipse.maven.central.mirror: https://repo.eclipse.org/content/repositories/maven_central/org/codehaus/plexus/plexus-utils/3.0.8/plexus-utils-3.0.8.pom (3.1 kB at 224 kB/s)
Downloading from eclipse.maven.central.mirror: https://repo.eclipse.org/content/repositories/maven_central/org/codehaus/plexus/plexus-compiler-javac/2.2/plexus-compiler-javac-2.2.pom
Progress (1): 769 B
                   
Downloaded from eclipse.maven.central.mirror: https://repo.eclipse.org/content/repositories/maven_central/org/codehaus/plexus/plexus-compiler-javac/2.2/plexus-compiler-javac-2.2.pom (769 B at 43 kB/s)
Downloading from eclipse.maven.central.mirror: https://repo.eclipse.org/content/repositories/maven_central/org/codehaus/plexus/plexus-compilers/2.2/plexus-compilers-2.2.pom
Progress (1): 1.2 kB
                    
Downloaded from eclipse.maven.central.mirror: https://repo.eclipse.org/content/repositories/maven_central/org/codehaus/plexus/plexus-compilers/2.2/plexus-compilers-2.2.pom (1.2 kB at 89 kB/s)
Downloading from eclipse.maven.central.mirror: https://repo.eclipse.org/content/repositories/maven_central/org/codehaus/plexus/plexus-container-default/1.5.5/plexus-container-default-1.5.5.pom
Progress (1): 2.8 kB
                    
Downloaded from eclipse.maven.central.mirror: https://repo.eclipse.org/content/repositories/maven_central/org/codehaus/plexus/plexus-container-default/1.5.5/plexus-container-default-1.5.5.pom (2.8 kB at 184 kB/s)
Downloading from eclipse.maven.central.mirror: https://repo.eclipse.org/content/repositories/maven_central/org/codehaus/plexus/plexus-classworlds/2.2.2/plexus-classworlds-2.2.2.pom
Progress (1): 4.0 kB
                    
Downloaded from eclipse.maven.central.mirror: https://repo.eclipse.org/content/repositories/maven_central/org/codehaus/plexus/plexus-classworlds/2.2.2/plexus-classworlds-2.2.2.pom (4.0 kB at 202 kB/s)
Downloading from eclipse.maven.central.mirror: https://repo.eclipse.org/content/repositories/maven_central/org/codehaus/plexus/plexus/2.0.3/plexus-2.0.3.pom
Progress (1): 4.1/15 kB
Progress (1): 7.7/15 kB
Progress (1): 12/15 kB 
Progress (1): 15 kB   
                   
Downloaded from eclipse.maven.central.mirror: https://repo.eclipse.org/content/repositories/maven_central/org/codehaus/plexus/plexus/2.0.3/plexus-2.0.3.pom (15 kB at 249 kB/s)
Downloading from eclipse.maven.central.mirror: https://repo.eclipse.org/content/repositories/maven_central/org/apache/xbean/xbean-reflect/3.4/xbean-reflect-3.4.pom
Progress (1): 2.8 kB
                    
Downloaded from eclipse.maven.central.mirror: https://repo.eclipse.org/content/repositories/maven_central/org/apache/xbean/xbean-reflect/3.4/xbean-reflect-3.4.pom (2.8 kB at 176 kB/s)
Downloading from eclipse.maven.central.mirror: https://repo.eclipse.org/content/repositories/maven_central/org/apache/xbean/xbean/3.4/xbean-3.4.pom
Progress (1): 4.1/19 kB
Progress (1): 7.7/19 kB
Progress (1): 12/19 kB 
Progress (1): 16/19 kB
Progress (1): 19 kB   
                   
Downloaded from eclipse.maven.central.mirror: https://repo.eclipse.org/content/repositories/maven_central/org/apache/xbean/xbean/3.4/xbean-3.4.pom (19 kB at 806 kB/s)
Downloading from eclipse.maven.central.mirror: https://repo.eclipse.org/content/repositories/maven_central/log4j/log4j/1.2.12/log4j-1.2.12.pom
Progress (1): 145 B
                   
Downloaded from eclipse.maven.central.mirror: https://repo.eclipse.org/content/repositories/maven_central/log4j/log4j/1.2.12/log4j-1.2.12.pom (145 B at 9.7 kB/s)
Downloading from eclipse.maven.central.mirror: https://repo.eclipse.org/content/repositories/maven_central/commons-logging/commons-logging-api/1.1/commons-logging-api-1.1.pom
Progress (1): 4.1/5.3 kB
Progress (1): 5.3 kB    
                    
Downloaded from eclipse.maven.central.mirror: https://repo.eclipse.org/content/repositories/maven_central/commons-logging/commons-logging-api/1.1/commons-logging-api-1.1.pom (5.3 kB at 297 kB/s)
Downloading from eclipse.maven.central.mirror: https://repo.eclipse.org/content/repositories/maven_central/com/google/collections/google-collections/1.0/google-collections-1.0.pom
Progress (1): 2.5 kB
                    
Downloaded from eclipse.maven.central.mirror: https://repo.eclipse.org/content/repositories/maven_central/com/google/collections/google-collections/1.0/google-collections-1.0.pom (2.5 kB at 77 kB/s)
Downloading from eclipse.maven.central.mirror: https://repo.eclipse.org/content/repositories/maven_central/com/google/google/1/google-1.pom
Progress (1): 1.6 kB
                    
Downloaded from eclipse.maven.central.mirror: https://repo.eclipse.org/content/repositories/maven_central/com/google/google/1/google-1.pom (1.6 kB at 130 kB/s)
Downloading from eclipse.maven.central.mirror: https://repo.eclipse.org/content/repositories/maven_central/org/codehaus/plexus/plexus-utils/1.5.1/plexus-utils-1.5.1.jar
Downloading from eclipse.maven.central.mirror: https://repo.eclipse.org/content/repositories/maven_central/org/apache/maven/maven-toolchain/1.0/maven-toolchain-1.0.jar
Downloading from eclipse.maven.central.mirror: https://repo.eclipse.org/content/repositories/maven_central/org/apache/maven/shared/maven-shared-utils/0.1/maven-shared-utils-0.1.jar
Downloading from eclipse.maven.central.mirror: https://repo.eclipse.org/content/repositories/maven_central/org/apache/maven/shared/maven-shared-incremental/1.1/maven-shared-incremental-1.1.jar
Downloading from eclipse.maven.central.mirror: https://repo.eclipse.org/content/repositories/maven_central/org/codehaus/plexus/plexus-compiler-javac/2.2/plexus-compiler-javac-2.2.jar
Progress (1): 4.1/211 kB
Progress (1): 7.7/211 kB
Progress (1): 12/211 kB 
Progress (1): 16/211 kB
Progress (1): 20/211 kB
Progress (1): 24/211 kB
Progress (2): 24/211 kB | 4.1/19 kB
Progress (3): 24/211 kB | 4.1/19 kB | 4.1/14 kB
Progress (3): 24/211 kB | 7.7/19 kB | 4.1/14 kB
Progress (3): 28/211 kB | 7.7/19 kB | 4.1/14 kB
Progress (3): 28/211 kB | 7.7/19 kB | 7.7/14 kB
Progress (3): 32/211 kB | 7.7/19 kB | 7.7/14 kB
Progress (3): 32/211 kB | 12/19 kB | 7.7/14 kB 
Progress (3): 32/211 kB | 12/19 kB | 12/14 kB 
Progress (3): 32/211 kB | 16/19 kB | 12/14 kB
Progress (3): 32/211 kB | 16/19 kB | 14 kB   
Progress (3): 33/211 kB | 16/19 kB | 14 kB
Progress (3): 33/211 kB | 19 kB | 14 kB   
Progress (3): 37/211 kB | 19 kB | 14 kB
Progress (3): 41/211 kB | 19 kB | 14 kB
Progress (4): 41/211 kB | 19 kB | 14 kB | 4.1/155 kB
Progress (4): 45/211 kB | 19 kB | 14 kB | 4.1/155 kB
Progress (4): 45/211 kB | 19 kB | 14 kB | 7.7/155 kB
Progress (4): 49/211 kB | 19 kB | 14 kB | 7.7/155 kB
Progress (4): 49/211 kB | 19 kB | 14 kB | 12/155 kB 
Progress (4): 49/211 kB | 19 kB | 14 kB | 16/155 kB
Progress (4): 53/211 kB | 19 kB | 14 kB | 16/155 kB
Progress (4): 57/211 kB | 19 kB | 14 kB | 16/155 kB
Progress (4): 57/211 kB | 19 kB | 14 kB | 20/155 kB
Progress (4): 57/211 kB | 19 kB | 14 kB | 24/155 kB
Progress (4): 61/211 kB | 19 kB | 14 kB | 24/155 kB
Progress (4): 61/211 kB | 19 kB | 14 kB | 28/155 kB
Progress (4): 65/211 kB | 19 kB | 14 kB | 28/155 kB
Progress (4): 65/211 kB | 19 kB | 14 kB | 32/155 kB
Progress (4): 66/211 kB | 19 kB | 14 kB | 32/155 kB
Progress (4): 66/211 kB | 19 kB | 14 kB | 33/155 kB
Progress (4): 66/211 kB | 19 kB | 14 kB | 37/155 kB
Progress (4): 70/211 kB | 19 kB | 14 kB | 37/155 kB
Progress (4): 70/211 kB | 19 kB | 14 kB | 41/155 kB
Progress (4): 74/211 kB | 19 kB | 14 kB | 41/155 kB
Progress (4): 74/211 kB | 19 kB | 14 kB | 45/155 kB
Progress (4): 74/211 kB | 19 kB | 14 kB | 49/155 kB
Progress (4): 78/211 kB | 19 kB | 14 kB | 49/155 kB
Progress (4): 82/211 kB | 19 kB | 14 kB | 49/155 kB
Progress (4): 82/211 kB | 19 kB | 14 kB | 53/155 kB
Progress (4): 82/211 kB | 19 kB | 14 kB | 57/155 kB
Progress (4): 86/211 kB | 19 kB | 14 kB | 57/155 kB
Progress (4): 86/211 kB | 19 kB | 14 kB | 61/155 kB
Progress (4): 90/211 kB | 19 kB | 14 kB | 61/155 kB
Progress (4): 90/211 kB | 19 kB | 14 kB | 65/155 kB
Progress (4): 90/211 kB | 19 kB | 14 kB | 66/155 kB
Progress (4): 94/211 kB | 19 kB | 14 kB | 66/155 kB
Progress (4): 98/211 kB | 19 kB | 14 kB | 66/155 kB
Progress (4): 102/211 kB | 19 kB | 14 kB | 66/155 kB
Progress (4): 106/211 kB | 19 kB | 14 kB | 66/155 kB
Progress (4): 110/211 kB | 19 kB | 14 kB | 66/155 kB
Progress (4): 114/211 kB | 19 kB | 14 kB | 66/155 kB
Progress (4): 118/211 kB | 19 kB | 14 kB | 66/155 kB
Progress (4): 122/211 kB | 19 kB | 14 kB | 66/155 kB
Progress (4): 126/211 kB | 19 kB | 14 kB | 66/155 kB
Progress (4): 130/211 kB | 19 kB | 14 kB | 66/155 kB
Progress (4): 134/211 kB | 19 kB | 14 kB | 66/155 kB
Progress (4): 138/211 kB | 19 kB | 14 kB | 66/155 kB
Progress (4): 138/211 kB | 19 kB | 14 kB | 70/155 kB
Progress (4): 138/211 kB | 19 kB | 14 kB | 74/155 kB
Progress (4): 142/211 kB | 19 kB | 14 kB | 74/155 kB
Progress (4): 142/211 kB | 19 kB | 14 kB | 78/155 kB
Progress (4): 146/211 kB | 19 kB | 14 kB | 78/155 kB
Progress (4): 146/211 kB | 19 kB | 14 kB | 82/155 kB
Progress (4): 150/211 kB | 19 kB | 14 kB | 82/155 kB
Progress (4): 154/211 kB | 19 kB | 14 kB | 82/155 kB
Progress (4): 158/211 kB | 19 kB | 14 kB | 82/155 kB
Progress (4): 158/211 kB | 19 kB | 14 kB | 86/155 kB
Progress (4): 162/211 kB | 19 kB | 14 kB | 86/155 kB
Progress (4): 162/211 kB | 19 kB | 14 kB | 90/155 kB
Progress (4): 162/211 kB | 19 kB | 14 kB | 94/155 kB
Progress (4): 166/211 kB | 19 kB | 14 kB | 94/155 kB
Progress (4): 166/211 kB | 19 kB | 14 kB | 98/155 kB
Progress (4): 170/211 kB | 19 kB | 14 kB | 98/155 kB
Progress (4): 170/211 kB | 19 kB | 14 kB | 98/155 kB
Progress (4): 170/211 kB | 19 kB | 14 kB | 102/155 kB
Progress (4): 174/211 kB | 19 kB | 14 kB | 102/155 kB
Progress (4): 174/211 kB | 19 kB | 14 kB | 106/155 kB
Progress (4): 178/211 kB | 19 kB | 14 kB | 106/155 kB
Progress (4): 178/211 kB | 19 kB | 14 kB | 110/155 kB
Progress (4): 178/211 kB | 19 kB | 14 kB | 114/155 kB
Progress (4): 182/211 kB | 19 kB | 14 kB | 114/155 kB
Progress (4): 186/211 kB | 19 kB | 14 kB | 114/155 kB
Progress (4): 186/211 kB | 19 kB | 14 kB | 118/155 kB
Progress (4): 186/211 kB | 19 kB | 14 kB | 122/155 kB
Progress (4): 190/211 kB | 19 kB | 14 kB | 122/155 kB
Progress (4): 190/211 kB | 19 kB | 14 kB | 126/155 kB
Progress (4): 194/211 kB | 19 kB | 14 kB | 126/155 kB
Progress (4): 194/211 kB | 19 kB | 14 kB | 130/155 kB
Progress (4): 198/211 kB | 19 kB | 14 kB | 130/155 kB
Progress (4): 198/211 kB | 19 kB | 14 kB | 134/155 kB
Progress (4): 202/211 kB | 19 kB | 14 kB | 134/155 kB
Progress (4): 202/211 kB | 19 kB | 14 kB | 138/155 kB
Progress (4): 206/211 kB | 19 kB | 14 kB | 138/155 kB
Progress (4): 206/211 kB | 19 kB | 14 kB | 142/155 kB
Progress (4): 210/211 kB | 19 kB | 14 kB | 142/155 kB
Progress (4): 210/211 kB | 19 kB | 14 kB | 146/155 kB
Progress (5): 210/211 kB | 19 kB | 14 kB | 146/155 kB | 4.1/33 kB
Progress (5): 211 kB | 19 kB | 14 kB | 146/155 kB | 4.1/33 kB    
Progress (5): 211 kB | 19 kB | 14 kB | 146/155 kB | 7.7/33 kB
Progress (5): 211 kB | 19 kB | 14 kB | 150/155 kB | 7.7/33 kB
Progress (5): 211 kB | 19 kB | 14 kB | 154/155 kB | 7.7/33 kB
Progress (5): 211 kB | 19 kB | 14 kB | 154/155 kB | 12/33 kB 
Progress (5): 211 kB | 19 kB | 14 kB | 155 kB | 12/33 kB    
                                                        
Downloaded from eclipse.maven.central.mirror: https://repo.eclipse.org/content/repositories/maven_central/org/apache/maven/shared/maven-shared-incremental/1.1/maven-shared-incremental-1.1.jar (14 kB at 501 kB/s)
Progress (4): 211 kB | 19 kB | 155 kB | 16/33 kB
                                                
Downloading from eclipse.maven.central.mirror: https://repo.eclipse.org/content/repositories/maven_central/org/codehaus/plexus/plexus-container-default/1.5.5/plexus-container-default-1.5.5.jar
Progress (4): 211 kB | 19 kB | 155 kB | 20/33 kB
Progress (4): 211 kB | 19 kB | 155 kB | 24/33 kB
Progress (4): 211 kB | 19 kB | 155 kB | 28/33 kB
Progress (4): 211 kB | 19 kB | 155 kB | 32/33 kB
Progress (4): 211 kB | 19 kB | 155 kB | 33 kB   
                                             
Downloaded from eclipse.maven.central.mirror: https://repo.eclipse.org/content/repositories/maven_central/org/codehaus/plexus/plexus-utils/1.5.1/plexus-utils-1.5.1.jar (211 kB at 5.7 MB/s)
Downloading from eclipse.maven.central.mirror: https://repo.eclipse.org/content/repositories/maven_central/org/codehaus/plexus/plexus-classworlds/2.2.2/plexus-classworlds-2.2.2.jar
Downloaded from eclipse.maven.central.mirror: https://repo.eclipse.org/content/repositories/maven_central/org/apache/maven/maven-toolchain/1.0/maven-toolchain-1.0.jar (33 kB at 889 kB/s)
Downloading from eclipse.maven.central.mirror: https://repo.eclipse.org/content/repositories/maven_central/org/apache/xbean/xbean-reflect/3.4/xbean-reflect-3.4.jar
Downloaded from eclipse.maven.central.mirror: https://repo.eclipse.org/content/repositories/maven_central/org/apache/maven/shared/maven-shared-utils/0.1/maven-shared-utils-0.1.jar (155 kB at 4.3 MB/s)
Downloading from eclipse.maven.central.mirror: https://repo.eclipse.org/content/repositories/maven_central/log4j/log4j/1.2.12/log4j-1.2.12.jar
Progress (2): 19 kB | 4.1/217 kB
Progress (2): 19 kB | 7.7/217 kB
Progress (2): 19 kB | 12/217 kB 
Progress (2): 19 kB | 16/217 kB
Progress (2): 19 kB | 20/217 kB
Progress (2): 19 kB | 24/217 kB
Progress (2): 19 kB | 28/217 kB
Progress (2): 19 kB | 32/217 kB
Progress (2): 19 kB | 33/217 kB
Progress (2): 19 kB | 37/217 kB
Progress (2): 19 kB | 41/217 kB
Progress (2): 19 kB | 45/217 kB
Progress (2): 19 kB | 49/217 kB
Progress (2): 19 kB | 53/217 kB
Progress (2): 19 kB | 57/217 kB
Progress (2): 19 kB | 61/217 kB
Progress (2): 19 kB | 65/217 kB
Progress (2): 19 kB | 66/217 kB
Progress (2): 19 kB | 70/217 kB
Progress (2): 19 kB | 74/217 kB
Progress (2): 19 kB | 78/217 kB
Progress (2): 19 kB | 82/217 kB
Progress (2): 19 kB | 86/217 kB
Progress (2): 19 kB | 90/217 kB
Progress (2): 19 kB | 94/217 kB
Progress (2): 19 kB | 98/217 kB
Progress (3): 19 kB | 98/217 kB | 4.1/46 kB
Progress (3): 19 kB | 102/217 kB | 4.1/46 kB
Progress (3): 19 kB | 102/217 kB | 7.7/46 kB
Progress (3): 19 kB | 106/217 kB | 7.7/46 kB
Progress (3): 19 kB | 110/217 kB | 7.7/46 kB
Progress (3): 19 kB | 110/217 kB | 12/46 kB 
Progress (3): 19 kB | 114/217 kB | 12/46 kB
Progress (3): 19 kB | 114/217 kB | 16/46 kB
Progress (3): 19 kB | 114/217 kB | 20/46 kB
Progress (3): 19 kB | 114/217 kB | 24/46 kB
Progress (3): 19 kB | 118/217 kB | 24/46 kB
Progress (3): 19 kB | 122/217 kB | 24/46 kB
Progress (3): 19 kB | 122/217 kB | 28/46 kB
Progress (3): 19 kB | 122/217 kB | 32/46 kB
Progress (3): 19 kB | 122/217 kB | 33/46 kB
Progress (3): 19 kB | 126/217 kB | 33/46 kB
Progress (3): 19 kB | 130/217 kB | 33/46 kB
Progress (3): 19 kB | 130/217 kB | 37/46 kB
Progress (3): 19 kB | 130/217 kB | 41/46 kB
Progress (3): 19 kB | 134/217 kB | 41/46 kB
Progress (3): 19 kB | 134/217 kB | 45/46 kB
Progress (3): 19 kB | 138/217 kB | 45/46 kB
Progress (3): 19 kB | 138/217 kB | 46 kB   
Progress (3): 19 kB | 142/217 kB | 46 kB
Progress (3): 19 kB | 146/217 kB | 46 kB
Progress (3): 19 kB | 150/217 kB | 46 kB
Progress (3): 19 kB | 154/217 kB | 46 kB
Progress (3): 19 kB | 158/217 kB | 46 kB
Progress (3): 19 kB | 162/217 kB | 46 kB
Progress (3): 19 kB | 166/217 kB | 46 kB
Progress (3): 19 kB | 170/217 kB | 46 kB
Progress (3): 19 kB | 174/217 kB | 46 kB
Progress (3): 19 kB | 178/217 kB | 46 kB
Progress (3): 19 kB | 182/217 kB | 46 kB
Progress (3): 19 kB | 186/217 kB | 46 kB
Progress (3): 19 kB | 190/217 kB | 46 kB
Progress (3): 19 kB | 194/217 kB | 46 kB
Progress (3): 19 kB | 198/217 kB | 46 kB
Progress (3): 19 kB | 202/217 kB | 46 kB
Progress (3): 19 kB | 206/217 kB | 46 kB
Progress (4): 19 kB | 206/217 kB | 46 kB | 4.1/134 kB
Progress (4): 19 kB | 210/217 kB | 46 kB | 4.1/134 kB
Progress (4): 19 kB | 210/217 kB | 46 kB | 7.7/134 kB
Progress (4): 19 kB | 214/217 kB | 46 kB | 7.7/134 kB
Progress (4): 19 kB | 214/217 kB | 46 kB | 12/134 kB 
Progress (4): 19 kB | 217 kB | 46 kB | 12/134 kB    
Progress (4): 19 kB | 217 kB | 46 kB | 16/134 kB
Progress (4): 19 kB | 217 kB | 46 kB | 20/134 kB
Progress (4): 19 kB | 217 kB | 46 kB | 24/134 kB
Progress (4): 19 kB | 217 kB | 46 kB | 28/134 kB
Progress (4): 19 kB | 217 kB | 46 kB | 32/134 kB
Progress (4): 19 kB | 217 kB | 46 kB | 36/134 kB
Progress (4): 19 kB | 217 kB | 46 kB | 40/134 kB
Progress (4): 19 kB | 217 kB | 46 kB | 44/134 kB
Progress (4): 19 kB | 217 kB | 46 kB | 48/134 kB
Progress (4): 19 kB | 217 kB | 46 kB | 52/134 kB
Progress (4): 19 kB | 217 kB | 46 kB | 56/134 kB
                                                
Downloaded from eclipse.maven.central.mirror: https://repo.eclipse.org/content/repositories/maven_central/org/codehaus/plexus/plexus-classworlds/2.2.2/plexus-classworlds-2.2.2.jar (46 kB at 886 kB/s)
Progress (3): 19 kB | 217 kB | 60/134 kB
                                        
Downloading from eclipse.maven.central.mirror: https://repo.eclipse.org/content/repositories/maven_central/commons-logging/commons-logging-api/1.1/commons-logging-api-1.1.jar
Progress (3): 19 kB | 217 kB | 64/134 kB
Progress (4): 19 kB | 217 kB | 64/134 kB | 4.1/358 kB
Progress (4): 19 kB | 217 kB | 68/134 kB | 4.1/358 kB
Progress (4): 19 kB | 217 kB | 72/134 kB | 4.1/358 kB
Progress (4): 19 kB | 217 kB | 72/134 kB | 7.7/358 kB
Progress (4): 19 kB | 217 kB | 76/134 kB | 7.7/358 kB
Progress (4): 19 kB | 217 kB | 76/134 kB | 12/358 kB 
Progress (4): 19 kB | 217 kB | 80/134 kB | 12/358 kB
Progress (4): 19 kB | 217 kB | 80/134 kB | 16/358 kB
Progress (4): 19 kB | 217 kB | 84/134 kB | 16/358 kB
Progress (4): 19 kB | 217 kB | 84/134 kB | 20/358 kB
Progress (4): 19 kB | 217 kB | 88/134 kB | 20/358 kB
Progress (4): 19 kB | 217 kB | 88/134 kB | 24/358 kB
Progress (4): 19 kB | 217 kB | 92/134 kB | 24/358 kB
Progress (4): 19 kB | 217 kB | 92/134 kB | 28/358 kB
Progress (4): 19 kB | 217 kB | 96/134 kB | 28/358 kB
Progress (4): 19 kB | 217 kB | 96/134 kB | 32/358 kB
Progress (4): 19 kB | 217 kB | 100/134 kB | 32/358 kB
Progress (4): 19 kB | 217 kB | 100/134 kB | 36/358 kB
Progress (4): 19 kB | 217 kB | 104/134 kB | 36/358 kB
Progress (4): 19 kB | 217 kB | 104/134 kB | 40/358 kB
Progress (4): 19 kB | 217 kB | 108/134 kB | 40/358 kB
Progress (4): 19 kB | 217 kB | 108/134 kB | 44/358 kB
Progress (4): 19 kB | 217 kB | 112/134 kB | 44/358 kB
Progress (4): 19 kB | 217 kB | 112/134 kB | 48/358 kB
Progress (4): 19 kB | 217 kB | 116/134 kB | 48/358 kB
Progress (4): 19 kB | 217 kB | 116/134 kB | 52/358 kB
Progress (4): 19 kB | 217 kB | 120/134 kB | 52/358 kB
Progress (4): 19 kB | 217 kB | 120/134 kB | 56/358 kB
Progress (4): 19 kB | 217 kB | 124/134 kB | 56/358 kB
Progress (4): 19 kB | 217 kB | 124/134 kB | 60/358 kB
Progress (4): 19 kB | 217 kB | 128/134 kB | 60/358 kB
Progress (4): 19 kB | 217 kB | 128/134 kB | 64/358 kB
Progress (4): 19 kB | 217 kB | 132/134 kB | 64/358 kB
Progress (4): 19 kB | 217 kB | 132/134 kB | 68/358 kB
Progress (4): 19 kB | 217 kB | 134 kB | 68/358 kB    
Progress (4): 19 kB | 217 kB | 134 kB | 72/358 kB
Progress (4): 19 kB | 217 kB | 134 kB | 76/358 kB
Progress (4): 19 kB | 217 kB | 134 kB | 80/358 kB
Progress (4): 19 kB | 217 kB | 134 kB | 84/358 kB
Progress (4): 19 kB | 217 kB | 134 kB | 88/358 kB
Progress (4): 19 kB | 217 kB | 134 kB | 92/358 kB
Progress (4): 19 kB | 217 kB | 134 kB | 96/358 kB
Progress (4): 19 kB | 217 kB | 134 kB | 100/358 kB
Progress (4): 19 kB | 217 kB | 134 kB | 104/358 kB
Progress (4): 19 kB | 217 kB | 134 kB | 108/358 kB
Progress (4): 19 kB | 217 kB | 134 kB | 112/358 kB
Progress (4): 19 kB | 217 kB | 134 kB | 116/358 kB
Progress (4): 19 kB | 217 kB | 134 kB | 120/358 kB
Progress (4): 19 kB | 217 kB | 134 kB | 124/358 kB
                                                  
Downloaded from eclipse.maven.central.mirror: https://repo.eclipse.org/content/repositories/maven_central/org/codehaus/plexus/plexus-container-default/1.5.5/plexus-container-default-1.5.5.jar (217 kB at 3.8 MB/s)
Progress (3): 19 kB | 134 kB | 128/358 kB
                                         
Downloading from eclipse.maven.central.mirror: https://repo.eclipse.org/content/repositories/maven_central/com/google/collections/google-collections/1.0/google-collections-1.0.jar
Progress (3): 19 kB | 134 kB | 132/358 kB
Progress (3): 19 kB | 134 kB | 136/358 kB
Progress (3): 19 kB | 134 kB | 140/358 kB
Progress (3): 19 kB | 134 kB | 144/358 kB
Progress (3): 19 kB | 134 kB | 148/358 kB
Progress (3): 19 kB | 134 kB | 152/358 kB
Progress (3): 19 kB | 134 kB | 156/358 kB
Progress (3): 19 kB | 134 kB | 160/358 kB
Progress (3): 19 kB | 134 kB | 164/358 kB
Progress (3): 19 kB | 134 kB | 168/358 kB
Progress (3): 19 kB | 134 kB | 172/358 kB
Progress (3): 19 kB | 134 kB | 176/358 kB
Progress (3): 19 kB | 134 kB | 180/358 kB
                                         
Downloaded from eclipse.maven.central.mirror: https://repo.eclipse.org/content/repositories/maven_central/org/apache/xbean/xbean-reflect/3.4/xbean-reflect-3.4.jar (134 kB at 2.3 MB/s)
Progress (2): 19 kB | 184/358 kB
                                
Downloading from eclipse.maven.central.mirror: https://repo.eclipse.org/content/repositories/maven_central/junit/junit/3.8.2/junit-3.8.2.jar
Progress (2): 19 kB | 188/358 kB
Progress (2): 19 kB | 192/358 kB
Progress (3): 19 kB | 192/358 kB | 4.1/45 kB
Progress (3): 19 kB | 196/358 kB | 4.1/45 kB
Progress (3): 19 kB | 196/358 kB | 7.7/45 kB
Progress (3): 19 kB | 200/358 kB | 7.7/45 kB
Progress (3): 19 kB | 200/358 kB | 12/45 kB 
Progress (3): 19 kB | 204/358 kB | 12/45 kB
Progress (3): 19 kB | 204/358 kB | 16/45 kB
Progress (3): 19 kB | 208/358 kB | 16/45 kB
Progress (3): 19 kB | 208/358 kB | 20/45 kB
Progress (3): 19 kB | 212/358 kB | 20/45 kB
Progress (3): 19 kB | 212/358 kB | 24/45 kB
Progress (3): 19 kB | 216/358 kB | 24/45 kB
Progress (3): 19 kB | 216/358 kB | 28/45 kB
Progress (3): 19 kB | 220/358 kB | 28/45 kB
Progress (3): 19 kB | 220/358 kB | 32/45 kB
Progress (3): 19 kB | 224/358 kB | 32/45 kB
Progress (3): 19 kB | 228/358 kB | 32/45 kB
Progress (3): 19 kB | 232/358 kB | 32/45 kB
Progress (3): 19 kB | 236/358 kB | 32/45 kB
Progress (3): 19 kB | 236/358 kB | 36/45 kB
Progress (3): 19 kB | 240/358 kB | 36/45 kB
Progress (3): 19 kB | 240/358 kB | 40/45 kB
Progress (3): 19 kB | 244/358 kB | 40/45 kB
Progress (3): 19 kB | 244/358 kB | 44/45 kB
Progress (3): 19 kB | 248/358 kB | 44/45 kB
Progress (3): 19 kB | 248/358 kB | 45 kB   
Progress (3): 19 kB | 252/358 kB | 45 kB
Progress (3): 19 kB | 256/358 kB | 45 kB
Progress (3): 19 kB | 260/358 kB | 45 kB
Progress (3): 19 kB | 264/358 kB | 45 kB
Progress (3): 19 kB | 268/358 kB | 45 kB
Progress (3): 19 kB | 272/358 kB | 45 kB
Progress (3): 19 kB | 276/358 kB | 45 kB
Progress (3): 19 kB | 280/358 kB | 45 kB
Progress (3): 19 kB | 284/358 kB | 45 kB
Progress (3): 19 kB | 288/358 kB | 45 kB
Progress (3): 19 kB | 292/358 kB | 45 kB
Progress (3): 19 kB | 296/358 kB | 45 kB
Progress (3): 19 kB | 300/358 kB | 45 kB
Progress (3): 19 kB | 304/358 kB | 45 kB
Progress (3): 19 kB | 308/358 kB | 45 kB
Progress (3): 19 kB | 312/358 kB | 45 kB
Progress (3): 19 kB | 316/358 kB | 45 kB
Progress (3): 19 kB | 320/358 kB | 45 kB
Progress (3): 19 kB | 324/358 kB | 45 kB
Progress (3): 19 kB | 328/358 kB | 45 kB
Progress (3): 19 kB | 332/358 kB | 45 kB
Progress (3): 19 kB | 336/358 kB | 45 kB
Progress (3): 19 kB | 340/358 kB | 45 kB
Progress (3): 19 kB | 344/358 kB | 45 kB
Progress (3): 19 kB | 348/358 kB | 45 kB
Progress (3): 19 kB | 352/358 kB | 45 kB
                                        
Downloaded from eclipse.maven.central.mirror: https://repo.eclipse.org/content/repositories/maven_central/commons-logging/commons-logging-api/1.1/commons-logging-api-1.1.jar (45 kB at 697 kB/s)
Progress (2): 19 kB | 356/358 kB
Progress (2): 19 kB | 358 kB    
Progress (3): 19 kB | 358 kB | 4.1/640 kB
Progress (4): 19 kB | 358 kB | 4.1/640 kB | 4.1/121 kB
Progress (4): 19 kB | 358 kB | 7.7/640 kB | 4.1/121 kB
Progress (4): 19 kB | 358 kB | 7.7/640 kB | 7.7/121 kB
Progress (4): 19 kB | 358 kB | 7.7/640 kB | 12/121 kB 
Progress (4): 19 kB | 358 kB | 12/640 kB | 12/121 kB 
Progress (4): 19 kB | 358 kB | 12/640 kB | 16/121 kB
Progress (4): 19 kB | 358 kB | 16/640 kB | 16/121 kB
Progress (4): 19 kB | 358 kB | 16/640 kB | 20/121 kB
Progress (4): 19 kB | 358 kB | 16/640 kB | 24/121 kB
Progress (4): 19 kB | 358 kB | 20/640 kB | 24/121 kB
Progress (4): 19 kB | 358 kB | 24/640 kB | 24/121 kB
Progress (4): 19 kB | 358 kB | 24/640 kB | 28/121 kB
Progress (4): 19 kB | 358 kB | 24/640 kB | 32/121 kB
Progress (4): 19 kB | 358 kB | 24/640 kB | 33/121 kB
Progress (4): 19 kB | 358 kB | 28/640 kB | 33/121 kB
Progress (4): 19 kB | 358 kB | 28/640 kB | 37/121 kB
Progress (4): 19 kB | 358 kB | 32/640 kB | 37/121 kB
Progress (4): 19 kB | 358 kB | 32/640 kB | 41/121 kB
Progress (4): 19 kB | 358 kB | 33/640 kB | 41/121 kB
Progress (4): 19 kB | 358 kB | 33/640 kB | 45/121 kB
Progress (4): 19 kB | 358 kB | 33/640 kB | 49/121 kB
Progress (4): 19 kB | 358 kB | 37/640 kB | 49/121 kB
Progress (4): 19 kB | 358 kB | 37/640 kB | 53/121 kB
Progress (4): 19 kB | 358 kB | 41/640 kB | 53/121 kB
Progress (4): 19 kB | 358 kB | 41/640 kB | 57/121 kB
Progress (4): 19 kB | 358 kB | 41/640 kB | 61/121 kB
Progress (4): 19 kB | 358 kB | 45/640 kB | 61/121 kB
Progress (4): 19 kB | 358 kB | 45/640 kB | 65/121 kB
Progress (4): 19 kB | 358 kB | 49/640 kB | 65/121 kB
Progress (4): 19 kB | 358 kB | 49/640 kB | 66/121 kB
Progress (4): 19 kB | 358 kB | 49/640 kB | 70/121 kB
Progress (4): 19 kB | 358 kB | 53/640 kB | 70/121 kB
Progress (4): 19 kB | 358 kB | 53/640 kB | 74/121 kB
Progress (4): 19 kB | 358 kB | 57/640 kB | 74/121 kB
Progress (4): 19 kB | 358 kB | 57/640 kB | 78/121 kB
Progress (4): 19 kB | 358 kB | 57/640 kB | 82/121 kB
Progress (4): 19 kB | 358 kB | 61/640 kB | 82/121 kB
Progress (4): 19 kB | 358 kB | 61/640 kB | 86/121 kB
Progress (4): 19 kB | 358 kB | 65/640 kB | 86/121 kB
Progress (4): 19 kB | 358 kB | 65/640 kB | 90/121 kB
Progress (4): 19 kB | 358 kB | 66/640 kB | 90/121 kB
Progress (4): 19 kB | 358 kB | 66/640 kB | 94/121 kB
Progress (4): 19 kB | 358 kB | 66/640 kB | 98/121 kB
Progress (4): 19 kB | 358 kB | 66/640 kB | 98/121 kB
Progress (4): 19 kB | 358 kB | 70/640 kB | 98/121 kB
Progress (4): 19 kB | 358 kB | 74/640 kB | 98/121 kB
Progress (4): 19 kB | 358 kB | 74/640 kB | 102/121 kB
Progress (4): 19 kB | 358 kB | 74/640 kB | 106/121 kB
Progress (4): 19 kB | 358 kB | 78/640 kB | 106/121 kB
Progress (4): 19 kB | 358 kB | 78/640 kB | 110/121 kB
Progress (4): 19 kB | 358 kB | 82/640 kB | 110/121 kB
Progress (4): 19 kB | 358 kB | 82/640 kB | 114/121 kB
Progress (4): 19 kB | 358 kB | 82/640 kB | 118/121 kB
Progress (4): 19 kB | 358 kB | 82/640 kB | 121 kB    
Progress (4): 19 kB | 358 kB | 86/640 kB | 121 kB
Progress (4): 19 kB | 358 kB | 90/640 kB | 121 kB
Progress (4): 19 kB | 358 kB | 94/640 kB | 121 kB
Progress (4): 19 kB | 358 kB | 98/640 kB | 121 kB
Progress (4): 19 kB | 358 kB | 102/640 kB | 121 kB
Progress (4): 19 kB | 358 kB | 106/640 kB | 121 kB
Progress (4): 19 kB | 358 kB | 110/640 kB | 121 kB
Progress (4): 19 kB | 358 kB | 114/640 kB | 121 kB
Progress (4): 19 kB | 358 kB | 118/640 kB | 121 kB
Progress (4): 19 kB | 358 kB | 122/640 kB | 121 kB
Progress (4): 19 kB | 358 kB | 126/640 kB | 121 kB
Progress (4): 19 kB | 358 kB | 130/640 kB | 121 kB
Progress (4): 19 kB | 358 kB | 134/640 kB | 121 kB
Progress (4): 19 kB | 358 kB | 138/640 kB | 121 kB
Progress (4): 19 kB | 358 kB | 142/640 kB | 121 kB
Progress (4): 19 kB | 358 kB | 146/640 kB | 121 kB
Progress (4): 19 kB | 358 kB | 150/640 kB | 121 kB
Progress (4): 19 kB | 358 kB | 154/640 kB | 121 kB
Progress (4): 19 kB | 358 kB | 158/640 kB | 121 kB
Progress (4): 19 kB | 358 kB | 162/640 kB | 121 kB
Progress (4): 19 kB | 358 kB | 166/640 kB | 121 kB
Progress (4): 19 kB | 358 kB | 170/640 kB | 121 kB
Progress (4): 19 kB | 358 kB | 174/640 kB | 121 kB
Progress (4): 19 kB | 358 kB | 178/640 kB | 121 kB
Progress (4): 19 kB | 358 kB | 182/640 kB | 121 kB
Progress (4): 19 kB | 358 kB | 186/640 kB | 121 kB
Progress (4): 19 kB | 358 kB | 190/640 kB | 121 kB
Progress (4): 19 kB | 358 kB | 194/640 kB | 121 kB
Progress (4): 19 kB | 358 kB | 198/640 kB | 121 kB
Progress (4): 19 kB | 358 kB | 202/640 kB | 121 kB
Progress (4): 19 kB | 358 kB | 206/640 kB | 121 kB
Progress (4): 19 kB | 358 kB | 210/640 kB | 121 kB
Progress (4): 19 kB | 358 kB | 214/640 kB | 121 kB
Progress (4): 19 kB | 358 kB | 218/640 kB | 121 kB
Progress (4): 19 kB | 358 kB | 222/640 kB | 121 kB
Progress (4): 19 kB | 358 kB | 226/640 kB | 121 kB
Progress (4): 19 kB | 358 kB | 230/640 kB | 121 kB
Progress (4): 19 kB | 358 kB | 234/640 kB | 121 kB
Progress (4): 19 kB | 358 kB | 238/640 kB | 121 kB
Progress (4): 19 kB | 358 kB | 242/640 kB | 121 kB
Progress (4): 19 kB | 358 kB | 246/640 kB | 121 kB
Progress (4): 19 kB | 358 kB | 250/640 kB | 121 kB
                                                  
Downloaded from eclipse.maven.central.mirror: https://repo.eclipse.org/content/repositories/maven_central/junit/junit/3.8.2/junit-3.8.2.jar (121 kB at 1.5 MB/s)
Progress (3): 19 kB | 358 kB | 254/640 kB
Progress (3): 19 kB | 358 kB | 258/640 kB
Progress (3): 19 kB | 358 kB | 262/640 kB
Progress (3): 19 kB | 358 kB | 266/640 kB
Progress (3): 19 kB | 358 kB | 270/640 kB
Progress (3): 19 kB | 358 kB | 274/640 kB
Progress (3): 19 kB | 358 kB | 278/640 kB
Progress (3): 19 kB | 358 kB | 282/640 kB
Progress (3): 19 kB | 358 kB | 286/640 kB
Progress (3): 19 kB | 358 kB | 290/640 kB
Progress (3): 19 kB | 358 kB | 294/640 kB
Progress (3): 19 kB | 358 kB | 298/640 kB
Progress (3): 19 kB | 358 kB | 302/640 kB
Progress (3): 19 kB | 358 kB | 306/640 kB
Progress (3): 19 kB | 358 kB | 310/640 kB
Progress (3): 19 kB | 358 kB | 314/640 kB
Progress (3): 19 kB | 358 kB | 318/640 kB
Progress (3): 19 kB | 358 kB | 322/640 kB
Progress (3): 19 kB | 358 kB | 326/640 kB
Progress (3): 19 kB | 358 kB | 330/640 kB
Progress (3): 19 kB | 358 kB | 334/640 kB
Progress (3): 19 kB | 358 kB | 338/640 kB
Progress (3): 19 kB | 358 kB | 342/640 kB
Progress (3): 19 kB | 358 kB | 346/640 kB
Progress (3): 19 kB | 358 kB | 350/640 kB
Progress (3): 19 kB | 358 kB | 354/640 kB
Progress (3): 19 kB | 358 kB | 358/640 kB
Progress (3): 19 kB | 358 kB | 362/640 kB
Progress (3): 19 kB | 358 kB | 366/640 kB
Progress (3): 19 kB | 358 kB | 370/640 kB
Progress (3): 19 kB | 358 kB | 374/640 kB
Progress (3): 19 kB | 358 kB | 378/640 kB
Progress (3): 19 kB | 358 kB | 382/640 kB
Progress (3): 19 kB | 358 kB | 386/640 kB
Progress (3): 19 kB | 358 kB | 390/640 kB
Progress (3): 19 kB | 358 kB | 394/640 kB
Progress (3): 19 kB | 358 kB | 398/640 kB
Progress (3): 19 kB | 358 kB | 402/640 kB
Progress (3): 19 kB | 358 kB | 406/640 kB
Progress (3): 19 kB | 358 kB | 410/640 kB
Progress (3): 19 kB | 358 kB | 414/640 kB
Progress (3): 19 kB | 358 kB | 418/640 kB
Progress (3): 19 kB | 358 kB | 422/640 kB
Progress (3): 19 kB | 358 kB | 426/640 kB
Progress (3): 19 kB | 358 kB | 430/640 kB
Progress (3): 19 kB | 358 kB | 434/640 kB
Progress (3): 19 kB | 358 kB | 438/640 kB
Progress (3): 19 kB | 358 kB | 442/640 kB
Progress (3): 19 kB | 358 kB | 446/640 kB
Progress (3): 19 kB | 358 kB | 450/640 kB
Progress (3): 19 kB | 358 kB | 454/640 kB
Progress (3): 19 kB | 358 kB | 458/640 kB
Progress (3): 19 kB | 358 kB | 462/640 kB
Progress (3): 19 kB | 358 kB | 466/640 kB
Progress (3): 19 kB | 358 kB | 470/640 kB
Progress (3): 19 kB | 358 kB | 474/640 kB
Progress (3): 19 kB | 358 kB | 478/640 kB
Progress (3): 19 kB | 358 kB | 482/640 kB
Progress (3): 19 kB | 358 kB | 486/640 kB
Progress (3): 19 kB | 358 kB | 490/640 kB
Progress (3): 19 kB | 358 kB | 494/640 kB
Progress (3): 19 kB | 358 kB | 498/640 kB
Progress (3): 19 kB | 358 kB | 502/640 kB
Progress (3): 19 kB | 358 kB | 506/640 kB
Progress (3): 19 kB | 358 kB | 510/640 kB
Progress (3): 19 kB | 358 kB | 514/640 kB
Progress (3): 19 kB | 358 kB | 518/640 kB
Progress (3): 19 kB | 358 kB | 522/640 kB
Progress (3): 19 kB | 358 kB | 526/640 kB
Progress (3): 19 kB | 358 kB | 530/640 kB
Progress (3): 19 kB | 358 kB | 534/640 kB
Progress (3): 19 kB | 358 kB | 538/640 kB
Progress (3): 19 kB | 358 kB | 542/640 kB
Progress (3): 19 kB | 358 kB | 546/640 kB
Progress (3): 19 kB | 358 kB | 550/640 kB
Progress (3): 19 kB | 358 kB | 554/640 kB
Progress (3): 19 kB | 358 kB | 558/640 kB
Progress (3): 19 kB | 358 kB | 562/640 kB
Progress (3): 19 kB | 358 kB | 566/640 kB
Progress (3): 19 kB | 358 kB | 570/640 kB
Progress (3): 19 kB | 358 kB | 574/640 kB
Progress (3): 19 kB | 358 kB | 578/640 kB
Progress (3): 19 kB | 358 kB | 582/640 kB
Progress (3): 19 kB | 358 kB | 586/640 kB
Progress (3): 19 kB | 358 kB | 590/640 kB
Progress (3): 19 kB | 358 kB | 594/640 kB
Progress (3): 19 kB | 358 kB | 598/640 kB
Progress (3): 19 kB | 358 kB | 602/640 kB
Progress (3): 19 kB | 358 kB | 606/640 kB
Progress (3): 19 kB | 358 kB | 610/640 kB
Progress (3): 19 kB | 358 kB | 614/640 kB
Progress (3): 19 kB | 358 kB | 618/640 kB
Progress (3): 19 kB | 358 kB | 622/640 kB
Progress (3): 19 kB | 358 kB | 626/640 kB
Progress (3): 19 kB | 358 kB | 630/640 kB
Progress (3): 19 kB | 358 kB | 634/640 kB
Progress (3): 19 kB | 358 kB | 638/640 kB
Progress (3): 19 kB | 358 kB | 640 kB    
                                     
Downloaded from eclipse.maven.central.mirror: https://repo.eclipse.org/content/repositories/maven_central/log4j/log4j/1.2.12/log4j-1.2.12.jar (358 kB at 2.9 MB/s)
Downloaded from eclipse.maven.central.mirror: https://repo.eclipse.org/content/repositories/maven_central/com/google/collections/google-collections/1.0/google-collections-1.0.jar (640 kB at 4.0 MB/s)
Downloaded from eclipse.maven.central.mirror: https://repo.eclipse.org/content/repositories/maven_central/org/codehaus/plexus/plexus-compiler-javac/2.2/plexus-compiler-javac-2.2.jar (19 kB at 81 kB/s)
[INFO] Changes detected - recompiling the module!
[INFO] Compiling 69 source files to /jobs/genie.sisu/sisu-sonar/workspace/org.eclipse.sisu.inject.tests/target/classes
[INFO] 
[INFO] --- maven-resources-plugin:2.7:testResources (default-testResources) @ org.eclipse.sisu.inject.tests ---
[INFO] Using 'UTF-8' encoding to copy filtered resources.
[INFO] skip non existing resourceDirectory /jobs/genie.sisu/sisu-sonar/workspace/org.eclipse.sisu.inject.tests/src/test/resources
[INFO] 
[INFO] --- maven-compiler-plugin:3.1:testCompile (default-testCompile) @ org.eclipse.sisu.inject.tests ---
[INFO] No sources to compile
[INFO] 
[INFO] --- maven-surefire-plugin:2.17:test (default-test) @ org.eclipse.sisu.inject.tests ---
Downloading from eclipse.maven.central.mirror: https://repo.eclipse.org/content/repositories/maven_central/org/apache/maven/surefire/maven-surefire-common/2.17/maven-surefire-common-2.17.pom
Progress (1): 4.1/6.1 kB
Progress (1): 6.1 kB    
                    
Downloaded from eclipse.maven.central.mirror: https://repo.eclipse.org/content/repositories/maven_central/org/apache/maven/surefire/maven-surefire-common/2.17/maven-surefire-common-2.17.pom (6.1 kB at 305 kB/s)
Downloading from eclipse.maven.central.mirror: https://repo.eclipse.org/content/repositories/maven_central/org/apache/maven/plugin-tools/maven-plugin-annotations/3.2/maven-plugin-annotations-3.2.pom
Progress (1): 1.6 kB
                    
Downloaded from eclipse.maven.central.mirror: https://repo.eclipse.org/content/repositories/maven_central/org/apache/maven/plugin-tools/maven-plugin-annotations/3.2/maven-plugin-annotations-3.2.pom (1.6 kB at 108 kB/s)
Downloading from eclipse.maven.central.mirror: https://repo.eclipse.org/content/repositories/maven_central/org/apache/maven/plugin-tools/maven-plugin-tools/3.2/maven-plugin-tools-3.2.pom
Progress (1): 4.1/17 kB
Progress (1): 7.7/17 kB
Progress (1): 12/17 kB 
Progress (1): 16/17 kB
Progress (1): 17 kB   
                   
Downloaded from eclipse.maven.central.mirror: https://repo.eclipse.org/content/repositories/maven_central/org/apache/maven/plugin-tools/maven-plugin-tools/3.2/maven-plugin-tools-3.2.pom (17 kB at 1.0 MB/s)
Downloading from eclipse.maven.central.mirror: https://repo.eclipse.org/content/repositories/maven_central/org/apache/maven/surefire/surefire-api/2.17/surefire-api-2.17.pom
Progress (1): 2.3 kB
                    
Downloaded from eclipse.maven.central.mirror: https://repo.eclipse.org/content/repositories/maven_central/org/apache/maven/surefire/surefire-api/2.17/surefire-api-2.17.pom (2.3 kB at 115 kB/s)
Downloading from eclipse.maven.central.mirror: https://repo.eclipse.org/content/repositories/maven_central/org/apache/maven/surefire/surefire-booter/2.17/surefire-booter-2.17.pom
Progress (1): 2.8 kB
                    
Downloaded from eclipse.maven.central.mirror: https://repo.eclipse.org/content/repositories/maven_central/org/apache/maven/surefire/surefire-booter/2.17/surefire-booter-2.17.pom (2.8 kB at 189 kB/s)
Downloading from eclipse.maven.central.mirror: https://repo.eclipse.org/content/repositories/maven_central/org/apache/maven/maven-toolchain/2.0.9/maven-toolchain-2.0.9.pom
Progress (1): 3.5 kB
                    
Downloaded from eclipse.maven.central.mirror: https://repo.eclipse.org/content/repositories/maven_central/org/apache/maven/maven-toolchain/2.0.9/maven-toolchain-2.0.9.pom (3.5 kB at 217 kB/s)
Downloading from eclipse.maven.central.mirror: https://repo.eclipse.org/content/repositories/maven_central/org/apache/maven/surefire/maven-surefire-common/2.17/maven-surefire-common-2.17.jar
Downloading from eclipse.maven.central.mirror: https://repo.eclipse.org/content/repositories/maven_central/org/apache/maven/surefire/surefire-booter/2.17/surefire-booter-2.17.jar
Downloading from eclipse.maven.central.mirror: https://repo.eclipse.org/content/repositories/maven_central/org/apache/maven/surefire/surefire-api/2.17/surefire-api-2.17.jar
Downloading from eclipse.maven.central.mirror: https://repo.eclipse.org/content/repositories/maven_central/org/apache/maven/maven-toolchain/2.0.9/maven-toolchain-2.0.9.jar
Downloading from eclipse.maven.central.mirror: https://repo.eclipse.org/content/repositories/maven_central/org/apache/maven/plugin-tools/maven-plugin-annotations/3.2/maven-plugin-annotations-3.2.jar
Progress (1): 4.1/265 kB
Progress (1): 7.7/265 kB
Progress (1): 12/265 kB 
Progress (1): 16/265 kB
Progress (1): 20/265 kB
Progress (1): 24/265 kB
Progress (1): 28/265 kB
Progress (1): 32/265 kB
Progress (1): 33/265 kB
Progress (2): 33/265 kB | 4.1/147 kB
Progress (2): 37/265 kB | 4.1/147 kB
Progress (2): 37/265 kB | 7.7/147 kB
Progress (2): 41/265 kB | 7.7/147 kB
Progress (2): 41/265 kB | 12/147 kB 
Progress (2): 41/265 kB | 16/147 kB
Progress (2): 41/265 kB | 20/147 kB
Progress (2): 45/265 kB | 20/147 kB
Progress (2): 45/265 kB | 24/147 kB
Progress (2): 49/265 kB | 24/147 kB
Progress (2): 49/265 kB | 28/147 kB
Progress (2): 53/265 kB | 28/147 kB
Progress (2): 53/265 kB | 32/147 kB
Progress (2): 57/265 kB | 32/147 kB
Progress (2): 57/265 kB | 36/147 kB
Progress (2): 61/265 kB | 36/147 kB
Progress (2): 61/265 kB | 40/147 kB
Progress (3): 61/265 kB | 40/147 kB | 4.1/38 kB
Progress (3): 65/265 kB | 40/147 kB | 4.1/38 kB
Progress (3): 66/265 kB | 40/147 kB | 4.1/38 kB
Progress (3): 66/265 kB | 44/147 kB | 4.1/38 kB
Progress (3): 66/265 kB | 44/147 kB | 7.7/38 kB
Progress (3): 66/265 kB | 48/147 kB | 7.7/38 kB
Progress (3): 66/265 kB | 48/147 kB | 12/38 kB 
Progress (3): 70/265 kB | 48/147 kB | 12/38 kB
Progress (3): 70/265 kB | 48/147 kB | 16/38 kB
Progress (3): 70/265 kB | 52/147 kB | 16/38 kB
Progress (3): 74/265 kB | 52/147 kB | 16/38 kB
Progress (3): 74/265 kB | 56/147 kB | 16/38 kB
Progress (3): 74/265 kB | 56/147 kB | 20/38 kB
Progress (3): 74/265 kB | 56/147 kB | 24/38 kB
Progress (3): 74/265 kB | 60/147 kB | 24/38 kB
Progress (3): 74/265 kB | 64/147 kB | 24/38 kB
Progress (3): 74/265 kB | 64/147 kB | 28/38 kB
Progress (3): 74/265 kB | 64/147 kB | 32/38 kB
Progress (3): 74/265 kB | 64/147 kB | 33/38 kB
Progress (3): 74/265 kB | 68/147 kB | 33/38 kB
Progress (3): 78/265 kB | 68/147 kB | 33/38 kB
Progress (3): 78/265 kB | 72/147 kB | 33/38 kB
Progress (4): 78/265 kB | 72/147 kB | 33/38 kB | 4.1/15 kB
Progress (4): 78/265 kB | 72/147 kB | 37/38 kB | 4.1/15 kB
Progress (4): 82/265 kB | 72/147 kB | 37/38 kB | 4.1/15 kB
Progress (4): 82/265 kB | 72/147 kB | 38 kB | 4.1/15 kB   
Progress (4): 82/265 kB | 76/147 kB | 38 kB | 4.1/15 kB
Progress (4): 82/265 kB | 76/147 kB | 38 kB | 7.7/15 kB
Progress (4): 82/265 kB | 80/147 kB | 38 kB | 7.7/15 kB
Progress (4): 86/265 kB | 80/147 kB | 38 kB | 7.7/15 kB
Progress (4): 90/265 kB | 80/147 kB | 38 kB | 7.7/15 kB
Progress (4): 90/265 kB | 80/147 kB | 38 kB | 12/15 kB 
Progress (4): 90/265 kB | 84/147 kB | 38 kB | 12/15 kB
Progress (4): 90/265 kB | 84/147 kB | 38 kB | 15 kB   
Progress (4): 90/265 kB | 88/147 kB | 38 kB | 15 kB
Progress (4): 90/265 kB | 92/147 kB | 38 kB | 15 kB
Progress (4): 94/265 kB | 92/147 kB | 38 kB | 15 kB
Progress (4): 94/265 kB | 96/147 kB | 38 kB | 15 kB
Progress (4): 98/265 kB | 96/147 kB | 38 kB | 15 kB
Progress (4): 98/265 kB | 96/147 kB | 38 kB | 15 kB
Progress (4): 98/265 kB | 100/147 kB | 38 kB | 15 kB
Progress (4): 98/265 kB | 104/147 kB | 38 kB | 15 kB
Progress (4): 102/265 kB | 104/147 kB | 38 kB | 15 kB
Progress (4): 106/265 kB | 104/147 kB | 38 kB | 15 kB
Progress (4): 106/265 kB | 108/147 kB | 38 kB | 15 kB
Progress (4): 106/265 kB | 112/147 kB | 38 kB | 15 kB
Progress (4): 110/265 kB | 112/147 kB | 38 kB | 15 kB
Progress (4): 114/265 kB | 112/147 kB | 38 kB | 15 kB
Progress (4): 114/265 kB | 116/147 kB | 38 kB | 15 kB
Progress (4): 114/265 kB | 120/147 kB | 38 kB | 15 kB
Progress (4): 114/265 kB | 124/147 kB | 38 kB | 15 kB
Progress (4): 114/265 kB | 128/147 kB | 38 kB | 15 kB
Progress (4): 118/265 kB | 128/147 kB | 38 kB | 15 kB
Progress (4): 122/265 kB | 128/147 kB | 38 kB | 15 kB
Progress (4): 122/265 kB | 132/147 kB | 38 kB | 15 kB
Progress (4): 122/265 kB | 136/147 kB | 38 kB | 15 kB
Progress (4): 126/265 kB | 136/147 kB | 38 kB | 15 kB
Progress (4): 130/265 kB | 136/147 kB | 38 kB | 15 kB
Progress (4): 130/265 kB | 140/147 kB | 38 kB | 15 kB
Progress (4): 131/265 kB | 140/147 kB | 38 kB | 15 kB
Progress (4): 131/265 kB | 144/147 kB | 38 kB | 15 kB
Progress (5): 131/265 kB | 144/147 kB | 38 kB | 15 kB | 4.1/40 kB
Progress (5): 131/265 kB | 147 kB | 38 kB | 15 kB | 4.1/40 kB    
Progress (5): 135/265 kB | 147 kB | 38 kB | 15 kB | 4.1/40 kB
Progress (5): 135/265 kB | 147 kB | 38 kB | 15 kB | 7.7/40 kB
Progress (5): 139/265 kB | 147 kB | 38 kB | 15 kB | 7.7/40 kB
Progress (5): 139/265 kB | 147 kB | 38 kB | 15 kB | 12/40 kB 
Progress (5): 139/265 kB | 147 kB | 38 kB | 15 kB | 16/40 kB
Progress (5): 143/265 kB | 147 kB | 38 kB | 15 kB | 16/40 kB
Progress (5): 147/265 kB | 147 kB | 38 kB | 15 kB | 16/40 kB
Progress (5): 147/265 kB | 147 kB | 38 kB | 15 kB | 20/40 kB
Progress (5): 147/265 kB | 147 kB | 38 kB | 15 kB | 24/40 kB
Progress (5): 151/265 kB | 147 kB | 38 kB | 15 kB | 24/40 kB
Progress (5): 151/265 kB | 147 kB | 38 kB | 15 kB | 28/40 kB
Progress (5): 155/265 kB | 147 kB | 38 kB | 15 kB | 28/40 kB
Progress (5): 155/265 kB | 147 kB | 38 kB | 15 kB | 32/40 kB
Progress (5): 155/265 kB | 147 kB | 38 kB | 15 kB | 33/40 kB
Progress (5): 155/265 kB | 147 kB | 38 kB | 15 kB | 37/40 kB
Progress (5): 159/265 kB | 147 kB | 38 kB | 15 kB | 37/40 kB
Progress (5): 159/265 kB | 147 kB | 38 kB | 15 kB | 40 kB   
Progress (5): 163/265 kB | 147 kB | 38 kB | 15 kB | 40 kB
Progress (5): 164/265 kB | 147 kB | 38 kB | 15 kB | 40 kB
Progress (5): 168/265 kB | 147 kB | 38 kB | 15 kB | 40 kB
Progress (5): 172/265 kB | 147 kB | 38 kB | 15 kB | 40 kB
Progress (5): 176/265 kB | 147 kB | 38 kB | 15 kB | 40 kB
Progress (5): 180/265 kB | 147 kB | 38 kB | 15 kB | 40 kB
Progress (5): 184/265 kB | 147 kB | 38 kB | 15 kB | 40 kB
Progress (5): 188/265 kB | 147 kB | 38 kB | 15 kB | 40 kB
Progress (5): 192/265 kB | 147 kB | 38 kB | 15 kB | 40 kB
Progress (5): 196/265 kB | 147 kB | 38 kB | 15 kB | 40 kB
Progress (5): 197/265 kB | 147 kB | 38 kB | 15 kB | 40 kB
Progress (5): 201/265 kB | 147 kB | 38 kB | 15 kB | 40 kB
Progress (5): 205/265 kB | 147 kB | 38 kB | 15 kB | 40 kB
Progress (5): 209/265 kB | 147 kB | 38 kB | 15 kB | 40 kB
Progress (5): 213/265 kB | 147 kB | 38 kB | 15 kB | 40 kB
Progress (5): 217/265 kB | 147 kB | 38 kB | 15 kB | 40 kB
Progress (5): 221/265 kB | 147 kB | 38 kB | 15 kB | 40 kB
Progress (5): 225/265 kB | 147 kB | 38 kB | 15 kB | 40 kB
Progress (5): 229/265 kB | 147 kB | 38 kB | 15 kB | 40 kB
Progress (5): 233/265 kB | 147 kB | 38 kB | 15 kB | 40 kB
Progress (5): 237/265 kB | 147 kB | 38 kB | 15 kB | 40 kB
Progress (5): 241/265 kB | 147 kB | 38 kB | 15 kB | 40 kB
Progress (5): 245/265 kB | 147 kB | 38 kB | 15 kB | 40 kB
Progress (5): 249/265 kB | 147 kB | 38 kB | 15 kB | 40 kB
Progress (5): 253/265 kB | 147 kB | 38 kB | 15 kB | 40 kB
Progress (5): 257/265 kB | 147 kB | 38 kB | 15 kB | 40 kB
Progress (5): 261/265 kB | 147 kB | 38 kB | 15 kB | 40 kB
Progress (5): 265/265 kB | 147 kB | 38 kB | 15 kB | 40 kB
Progress (5): 265 kB | 147 kB | 38 kB | 15 kB | 40 kB    
                                                     
Downloaded from eclipse.maven.central.mirror: https://repo.eclipse.org/content/repositories/maven_central/org/apache/maven/maven-toolchain/2.0.9/maven-toolchain-2.0.9.jar (38 kB at 1.3 MB/s)
Downloaded from eclipse.maven.central.mirror: https://repo.eclipse.org/content/repositories/maven_central/org/apache/maven/surefire/surefire-api/2.17/surefire-api-2.17.jar (147 kB at 4.8 MB/s)
Downloaded from eclipse.maven.central.mirror: https://repo.eclipse.org/content/repositories/maven_central/org/apache/maven/plugin-tools/maven-plugin-annotations/3.2/maven-plugin-annotations-3.2.jar (15 kB at 471 kB/s)
Downloaded from eclipse.maven.central.mirror: https://repo.eclipse.org/content/repositories/maven_central/org/apache/maven/surefire/surefire-booter/2.17/surefire-booter-2.17.jar (40 kB at 1.2 MB/s)
Downloaded from eclipse.maven.central.mirror: https://repo.eclipse.org/content/repositories/maven_central/org/apache/maven/surefire/maven-surefire-common/2.17/maven-surefire-common-2.17.jar (265 kB at 8.0 MB/s)
[INFO] Surefire report directory: /jobs/genie.sisu/sisu-sonar/workspace/org.eclipse.sisu.inject.tests/target/surefire-reports
Downloading from eclipse.maven.central.mirror: https://repo.eclipse.org/content/repositories/maven_central/org/apache/maven/surefire/surefire-junit4/2.17/surefire-junit4-2.17.pom
Progress (1): 2.5 kB
                    
Downloaded from eclipse.maven.central.mirror: https://repo.eclipse.org/content/repositories/maven_central/org/apache/maven/surefire/surefire-junit4/2.17/surefire-junit4-2.17.pom (2.5 kB at 131 kB/s)
Downloading from eclipse.maven.central.mirror: https://repo.eclipse.org/content/repositories/maven_central/org/apache/maven/surefire/surefire-providers/2.17/surefire-providers-2.17.pom
Progress (1): 2.4 kB
                    
Downloaded from eclipse.maven.central.mirror: https://repo.eclipse.org/content/repositories/maven_central/org/apache/maven/surefire/surefire-providers/2.17/surefire-providers-2.17.pom (2.4 kB at 183 kB/s)
Downloading from eclipse.maven.central.mirror: https://repo.eclipse.org/content/repositories/maven_central/org/apache/maven/surefire/surefire-junit4/2.17/surefire-junit4-2.17.jar
Progress (1): 4.1/64 kB
Progress (1): 7.7/64 kB
Progress (1): 12/64 kB 
Progress (1): 16/64 kB
Progress (1): 20/64 kB
Progress (1): 24/64 kB
Progress (1): 28/64 kB
Progress (1): 32/64 kB
Progress (1): 33/64 kB
Progress (1): 37/64 kB
Progress (1): 41/64 kB
Progress (1): 45/64 kB
Progress (1): 49/64 kB
Progress (1): 53/64 kB
Progress (1): 57/64 kB
Progress (1): 61/64 kB
Progress (1): 64 kB   
                   
Downloaded from eclipse.maven.central.mirror: https://repo.eclipse.org/content/repositories/maven_central/org/apache/maven/surefire/surefire-junit4/2.17/surefire-junit4-2.17.jar (64 kB at 3.2 MB/s)

-------------------------------------------------------
 T E S T S
-------------------------------------------------------
Running org.eclipse.sisu.bean.DeclaredMembersTest
Tests run: 5, Failures: 0, Errors: 0, Skipped: 0, Time elapsed: 0.077 sec - in org.eclipse.sisu.bean.DeclaredMembersTest
Running org.eclipse.sisu.bean.BeanPropertiesTest
Tests run: 16, Failures: 0, Errors: 0, Skipped: 0, Time elapsed: 0.179 sec - in org.eclipse.sisu.bean.BeanPropertiesTest
Running org.eclipse.sisu.bean.PropertyListenerTest
Tests run: 6, Failures: 0, Errors: 0, Skipped: 0, Time elapsed: 0.345 sec - in org.eclipse.sisu.bean.PropertyListenerTest
Running org.eclipse.sisu.bean.LifecycleTest
Tests run: 5, Failures: 0, Errors: 0, Skipped: 0, Time elapsed: 0.583 sec - in org.eclipse.sisu.bean.LifecycleTest
Running org.eclipse.sisu.space.BundleClassSpaceTest
Tests run: 1, Failures: 0, Errors: 0, Skipped: 1, Time elapsed: 0.001 sec - in org.eclipse.sisu.space.BundleClassSpaceTest
Running org.eclipse.sisu.space.CachingModuleTest
Tests run: 1, Failures: 0, Errors: 0, Skipped: 1, Time elapsed: 0.001 sec - in org.eclipse.sisu.space.CachingModuleTest
Running org.eclipse.sisu.space.FileEntryIteratorTest
Tests run: 1, Failures: 0, Errors: 0, Skipped: 1, Time elapsed: 0 sec - in org.eclipse.sisu.space.FileEntryIteratorTest
Running org.eclipse.sisu.space.BeanWatcherTest
Tests run: 1, Failures: 0, Errors: 0, Skipped: 0, Time elapsed: 0.35 sec - in org.eclipse.sisu.space.BeanWatcherTest
Running org.eclipse.sisu.space.ResourceEnumerationTest
Tests run: 1, Failures: 0, Errors: 0, Skipped: 1, Time elapsed: 0 sec - in org.eclipse.sisu.space.ResourceEnumerationTest
Running org.eclipse.sisu.space.QualifiedModuleTest
Tests run: 1, Failures: 0, Errors: 0, Skipped: 0, Time elapsed: 0.044 sec - in org.eclipse.sisu.space.QualifiedModuleTest
Running org.eclipse.sisu.space.QualifiedProviderTest
Tests run: 1, Failures: 0, Errors: 0, Skipped: 0, Time elapsed: 0.039 sec - in org.eclipse.sisu.space.QualifiedProviderTest
Running org.eclipse.sisu.space.QualifiedTypesTest
Tests run: 2, Failures: 0, Errors: 0, Skipped: 0, Time elapsed: 0.083 sec - in org.eclipse.sisu.space.QualifiedTypesTest
Running org.eclipse.sisu.space.ZipEntryIteratorTest
Tests run: 1, Failures: 0, Errors: 0, Skipped: 1, Time elapsed: 0 sec - in org.eclipse.sisu.space.ZipEntryIteratorTest
Running org.eclipse.sisu.space.QualifiedScanningTest
Tests run: 7, Failures: 0, Errors: 0, Skipped: 0, Time elapsed: 0.226 sec - in org.eclipse.sisu.space.QualifiedScanningTest
Running org.eclipse.sisu.space.DeferredClassTest
Tests run: 3, Failures: 0, Errors: 0, Skipped: 0, Time elapsed: 0.007 sec - in org.eclipse.sisu.space.DeferredClassTest
Running org.eclipse.sisu.space.URLClassSpaceTest
Tests run: 1, Failures: 0, Errors: 0, Skipped: 1, Time elapsed: 0.001 sec - in org.eclipse.sisu.space.URLClassSpaceTest
Running org.eclipse.sisu.space.DeferredProviderTest
Tests run: 4, Failures: 0, Errors: 0, Skipped: 0, Time elapsed: 0.028 sec - in org.eclipse.sisu.space.DeferredProviderTest
Running org.eclipse.sisu.wire.URLTypeConverterTest
Tests run: 2, Failures: 0, Errors: 0, Skipped: 0, Time elapsed: 0.007 sec - in org.eclipse.sisu.wire.URLTypeConverterTest
Running org.eclipse.sisu.wire.NamedIterableAdapterTest
Tests run: 2, Failures: 0, Errors: 0, Skipped: 0, Time elapsed: 0.005 sec - in org.eclipse.sisu.wire.NamedIterableAdapterTest
Running org.eclipse.sisu.wire.FileTypeConverterTest
Tests run: 1, Failures: 0, Errors: 0, Skipped: 0, Time elapsed: 0.003 sec - in org.eclipse.sisu.wire.FileTypeConverterTest
Running org.eclipse.sisu.wire.EntryMapAdapterTest
Tests run: 2, Failures: 0, Errors: 0, Skipped: 0, Time elapsed: 0.001 sec - in org.eclipse.sisu.wire.EntryMapAdapterTest
Running org.eclipse.sisu.wire.BeanImportTest
Tests run: 12, Failures: 0, Errors: 0, Skipped: 0, Time elapsed: 1.03 sec - in org.eclipse.sisu.wire.BeanImportTest
Running org.eclipse.sisu.wire.ParametersTest
Tests run: 2, Failures: 0, Errors: 0, Skipped: 0, Time elapsed: 0.027 sec - in org.eclipse.sisu.wire.ParametersTest
Running org.eclipse.sisu.wire.EntryListAdapterTest
Tests run: 7, Failures: 0, Errors: 0, Skipped: 0, Time elapsed: 0.003 sec - in org.eclipse.sisu.wire.EntryListAdapterTest
Running org.eclipse.sisu.launch.Custom3TestCase
Tests run: 1, Failures: 0, Errors: 0, Skipped: 1, Time elapsed: 0 sec - in org.eclipse.sisu.launch.Custom3TestCase
Running org.eclipse.sisu.launch.AssistedTestCase
Tests run: 1, Failures: 0, Errors: 0, Skipped: 1, Time elapsed: 0 sec - in org.eclipse.sisu.launch.AssistedTestCase
Running org.eclipse.sisu.launch.ExampleTestCase
Tests run: 1, Failures: 0, Errors: 0, Skipped: 1, Time elapsed: 0 sec - in org.eclipse.sisu.launch.ExampleTestCase
Running org.eclipse.sisu.launch.RequireBindingsTestCase
Tests run: 1, Failures: 0, Errors: 0, Skipped: 0, Time elapsed: 1.276 sec - in org.eclipse.sisu.launch.RequireBindingsTestCase
Running org.eclipse.sisu.launch.Custom1TestCase
Tests run: 1, Failures: 0, Errors: 0, Skipped: 0, Time elapsed: 0.024 sec - in org.eclipse.sisu.launch.Custom1TestCase
Running org.eclipse.sisu.launch.PrivateModuleTestCase
Tests run: 1, Failures: 0, Errors: 0, Skipped: 0, Time elapsed: 0.035 sec - in org.eclipse.sisu.launch.PrivateModuleTestCase
Running org.eclipse.sisu.launch.Custom2Test
Tests run: 1, Failures: 0, Errors: 0, Skipped: 0, Time elapsed: 0.064 sec - in org.eclipse.sisu.launch.Custom2Test
Running org.eclipse.sisu.inject.PriorityTest
Tests run: 1, Failures: 0, Errors: 0, Skipped: 0, Time elapsed: 0.01 sec - in org.eclipse.sisu.inject.PriorityTest
Running org.eclipse.sisu.inject.RankedBindingsTest
Tests run: 3, Failures: 0, Errors: 0, Skipped: 0, Time elapsed: 0.007 sec - in org.eclipse.sisu.inject.RankedBindingsTest
Running org.eclipse.sisu.inject.LocatedBeansTest
Tests run: 6, Failures: 0, Errors: 0, Skipped: 0, Time elapsed: 0.017 sec - in org.eclipse.sisu.inject.LocatedBeansTest
Running org.eclipse.sisu.inject.TypeArgumentsTest
Tests run: 6, Failures: 0, Errors: 0, Skipped: 0, Time elapsed: 0.024 sec - in org.eclipse.sisu.inject.TypeArgumentsTest
Running org.eclipse.sisu.inject.WatchedBeansTest
Tests run: 2, Failures: 0, Errors: 0, Skipped: 0, Time elapsed: 0.142 sec - in org.eclipse.sisu.inject.WatchedBeansTest
Running org.eclipse.sisu.inject.RankedSequenceTest
Tests run: 3, Failures: 0, Errors: 0, Skipped: 0, Time elapsed: 13.917 sec - in org.eclipse.sisu.inject.RankedSequenceTest
Running org.eclipse.sisu.inject.MildKeysTest
Tests run: 2, Failures: 0, Errors: 0, Skipped: 0, Time elapsed: 0.897 sec - in org.eclipse.sisu.inject.MildKeysTest
Running org.eclipse.sisu.inject.DefaultBeanLocatorTest
Tests run: 4, Failures: 0, Errors: 0, Skipped: 0, Time elapsed: 0.082 sec - in org.eclipse.sisu.inject.DefaultBeanLocatorTest
Running org.eclipse.sisu.inject.ImplementationsTest
Tests run: 1, Failures: 0, Errors: 0, Skipped: 0, Time elapsed: 0.007 sec - in org.eclipse.sisu.inject.ImplementationsTest
Running org.eclipse.sisu.inject.MildValuesTest
Tests run: 2, Failures: 0, Errors: 0, Skipped: 0, Time elapsed: 0.657 sec - in org.eclipse.sisu.inject.MildValuesTest
Running org.eclipse.sisu.inject.MildElementsTest
Tests run: 2, Failures: 0, Errors: 0, Skipped: 0, Time elapsed: 0.666 sec - in org.eclipse.sisu.inject.MildElementsTest
Running org.eclipse.sisu.inject.LazyBeanEntryTest
Tests run: 4, Failures: 0, Errors: 0, Skipped: 0, Time elapsed: 0.017 sec - in org.eclipse.sisu.inject.LazyBeanEntryTest
Running org.eclipse.sisu.inject.LogsTest
Tests run: 4, Failures: 0, Errors: 0, Skipped: 0, Time elapsed: 0.841 sec - in org.eclipse.sisu.inject.LogsTest

Results :

Tests run: 132, Failures: 0, Errors: 0, Skipped: 9

[INFO] 
[INFO] --- maven-jar-plugin:2.5:jar (default-jar) @ org.eclipse.sisu.inject.tests ---
Downloading from eclipse.maven.central.mirror: https://repo.eclipse.org/content/repositories/maven_central/org/codehaus/plexus/plexus-archiver/2.1/plexus-archiver-2.1.pom
Progress (1): 2.8 kB
                    
Downloaded from eclipse.maven.central.mirror: https://repo.eclipse.org/content/repositories/maven_central/org/codehaus/plexus/plexus-archiver/2.1/plexus-archiver-2.1.pom (2.8 kB at 100 kB/s)
Downloading from eclipse.maven.central.mirror: https://repo.eclipse.org/content/repositories/maven_central/org/codehaus/plexus/plexus-utils/3.0/plexus-utils-3.0.pom
Progress (1): 4.1 kB
                    
Downloaded from eclipse.maven.central.mirror: https://repo.eclipse.org/content/repositories/maven_central/org/codehaus/plexus/plexus-utils/3.0/plexus-utils-3.0.pom (4.1 kB at 226 kB/s)
Downloading from eclipse.maven.central.mirror: https://repo.eclipse.org/content/repositories/maven_central/org/sonatype/spice/spice-parent/16/spice-parent-16.pom
Progress (1): 4.1/8.4 kB
Progress (1): 7.7/8.4 kB
Progress (1): 8.4 kB    
                    
Downloaded from eclipse.maven.central.mirror: https://repo.eclipse.org/content/repositories/maven_central/org/sonatype/spice/spice-parent/16/spice-parent-16.pom (8.4 kB at 398 kB/s)
Downloading from eclipse.maven.central.mirror: https://repo.eclipse.org/content/repositories/maven_central/org/codehaus/plexus/plexus-io/2.0.2/plexus-io-2.0.2.pom
Progress (1): 1.7 kB
                    
Downloaded from eclipse.maven.central.mirror: https://repo.eclipse.org/content/repositories/maven_central/org/codehaus/plexus/plexus-io/2.0.2/plexus-io-2.0.2.pom (1.7 kB at 108 kB/s)
Downloading from eclipse.maven.central.mirror: https://repo.eclipse.org/content/repositories/maven_central/org/codehaus/plexus/plexus-components/1.1.19/plexus-components-1.1.19.pom
Progress (1): 2.7 kB
                    
Downloaded from eclipse.maven.central.mirror: https://repo.eclipse.org/content/repositories/maven_central/org/codehaus/plexus/plexus-components/1.1.19/plexus-components-1.1.19.pom (2.7 kB at 180 kB/s)
Downloading from eclipse.maven.central.mirror: https://repo.eclipse.org/content/repositories/maven_central/org/codehaus/plexus/plexus-archiver/2.4.4/plexus-archiver-2.4.4.pom
Progress (1): 3.5 kB
                    
Downloaded from eclipse.maven.central.mirror: https://repo.eclipse.org/content/repositories/maven_central/org/codehaus/plexus/plexus-archiver/2.4.4/plexus-archiver-2.4.4.pom (3.5 kB at 176 kB/s)
Downloading from eclipse.maven.central.mirror: https://repo.eclipse.org/content/repositories/maven_central/org/codehaus/plexus/plexus-io/2.0.10/plexus-io-2.0.10.pom
Progress (1): 2.2 kB
                    
Downloaded from eclipse.maven.central.mirror: https://repo.eclipse.org/content/repositories/maven_central/org/codehaus/plexus/plexus-io/2.0.10/plexus-io-2.0.10.pom (2.2 kB at 158 kB/s)
Downloading from eclipse.maven.central.mirror: https://repo.eclipse.org/content/repositories/maven_central/org/apache/commons/commons-compress/1.5/commons-compress-1.5.pom
Progress (1): 4.1/11 kB
Progress (1): 7.7/11 kB
Progress (1): 11 kB    
                   
Downloaded from eclipse.maven.central.mirror: https://repo.eclipse.org/content/repositories/maven_central/org/apache/commons/commons-compress/1.5/commons-compress-1.5.pom (11 kB at 663 kB/s)
Downloading from eclipse.maven.central.mirror: https://repo.eclipse.org/content/repositories/maven_central/org/apache/commons/commons-parent/28/commons-parent-28.pom
Progress (1): 4.1/50 kB
Progress (1): 7.7/50 kB
Progress (1): 12/50 kB 
Progress (1): 16/50 kB
Progress (1): 20/50 kB
Progress (1): 24/50 kB
Progress (1): 28/50 kB
Progress (1): 32/50 kB
Progress (1): 36/50 kB
Progress (1): 40/50 kB
Progress (1): 44/50 kB
Progress (1): 48/50 kB
Progress (1): 50 kB   
                   
Downloaded from eclipse.maven.central.mirror: https://repo.eclipse.org/content/repositories/maven_central/org/apache/commons/commons-parent/28/commons-parent-28.pom (50 kB at 3.3 MB/s)
Downloading from eclipse.maven.central.mirror: https://repo.eclipse.org/content/repositories/maven_central/org/tukaani/xz/1.2/xz-1.2.pom
Progress (1): 1.9 kB
                    
Downloaded from eclipse.maven.central.mirror: https://repo.eclipse.org/content/repositories/maven_central/org/tukaani/xz/1.2/xz-1.2.pom (1.9 kB at 159 kB/s)
Downloading from eclipse.maven.central.mirror: https://repo.eclipse.org/content/repositories/maven_central/org/apache/maven/maven-plugin-api/2.0.6/maven-plugin-api-2.0.6.jar
Downloading from eclipse.maven.central.mirror: https://repo.eclipse.org/content/repositories/maven_central/org/apache/maven/maven-core/2.0.6/maven-core-2.0.6.jar
Downloading from eclipse.maven.central.mirror: https://repo.eclipse.org/content/repositories/maven_central/org/apache/maven/maven-settings/2.0.6/maven-settings-2.0.6.jar
Downloading from eclipse.maven.central.mirror: https://repo.eclipse.org/content/repositories/maven_central/org/apache/maven/maven-plugin-parameter-documenter/2.0.6/maven-plugin-parameter-documenter-2.0.6.jar
Downloading from eclipse.maven.central.mirror: https://repo.eclipse.org/content/repositories/maven_central/org/apache/maven/reporting/maven-reporting-api/2.0.6/maven-reporting-api-2.0.6.jar
Progress (1): 4.1/152 kB
Progress (1): 7.7/152 kB
Progress (1): 12/152 kB 
Progress (1): 16/152 kB
Progress (1): 20/152 kB
Progress (1): 24/152 kB
Progress (1): 28/152 kB
Progress (1): 32/152 kB
Progress (1): 33/152 kB
Progress (1): 37/152 kB
Progress (1): 41/152 kB
Progress (1): 45/152 kB
Progress (1): 49/152 kB
Progress (1): 53/152 kB
Progress (1): 57/152 kB
Progress (1): 61/152 kB
Progress (1): 65/152 kB
Progress (1): 66/152 kB
Progress (1): 70/152 kB
Progress (1): 74/152 kB
Progress (1): 78/152 kB
Progress (1): 82/152 kB
Progress (1): 86/152 kB
Progress (1): 90/152 kB
Progress (1): 94/152 kB
Progress (1): 98/152 kB
Progress (1): 98/152 kB
Progress (1): 102/152 kB
Progress (1): 106/152 kB
Progress (1): 110/152 kB
Progress (1): 114/152 kB
Progress (1): 118/152 kB
Progress (1): 122/152 kB
Progress (1): 126/152 kB
Progress (1): 130/152 kB
Progress (1): 134/152 kB
Progress (1): 138/152 kB
Progress (1): 142/152 kB
Progress (1): 146/152 kB
Progress (1): 150/152 kB
Progress (1): 152 kB    
Progress (2): 152 kB | 4.1/9.9 kB
Progress (3): 152 kB | 4.1/9.9 kB | 4.1/13 kB
Progress (3): 152 kB | 7.7/9.9 kB | 4.1/13 kB
Progress (3): 152 kB | 7.7/9.9 kB | 7.7/13 kB
Progress (3): 152 kB | 9.9 kB | 7.7/13 kB    
Progress (3): 152 kB | 9.9 kB | 12/13 kB 
Progress (3): 152 kB | 9.9 kB | 13 kB   
Progress (4): 152 kB | 9.9 kB | 13 kB | 4.1/21 kB
Progress (4): 152 kB | 9.9 kB | 13 kB | 7.7/21 kB
Progress (4): 152 kB | 9.9 kB | 13 kB | 12/21 kB 
Progress (4): 152 kB | 9.9 kB | 13 kB | 16/21 kB
                                                
Downloaded from eclipse.maven.central.mirror: https://repo.eclipse.org/content/repositories/maven_central/org/apache/maven/maven-core/2.0.6/maven-core-2.0.6.jar (152 kB at 6.1 MB/s)
Progress (3): 9.9 kB | 13 kB | 20/21 kB
                                       
Downloading from eclipse.maven.central.mirror: https://repo.eclipse.org/content/repositories/maven_central/org/apache/maven/doxia/doxia-sink-api/1.0-alpha-7/doxia-sink-api-1.0-alpha-7.jar
Progress (3): 9.9 kB | 13 kB | 21 kB
Progress (4): 9.9 kB | 13 kB | 21 kB | 4.1/49 kB
Progress (4): 9.9 kB | 13 kB | 21 kB | 7.7/49 kB
Progress (4): 9.9 kB | 13 kB | 21 kB | 12/49 kB 
Progress (4): 9.9 kB | 13 kB | 21 kB | 16/49 kB
Progress (4): 9.9 kB | 13 kB | 21 kB | 20/49 kB
Progress (4): 9.9 kB | 13 kB | 21 kB | 24/49 kB
Progress (4): 9.9 kB | 13 kB | 21 kB | 28/49 kB
Progress (4): 9.9 kB | 13 kB | 21 kB | 32/49 kB
Progress (4): 9.9 kB | 13 kB | 21 kB | 36/49 kB
Progress (4): 9.9 kB | 13 kB | 21 kB | 40/49 kB
Progress (4): 9.9 kB | 13 kB | 21 kB | 44/49 kB
Progress (4): 9.9 kB | 13 kB | 21 kB | 48/49 kB
Progress (4): 9.9 kB | 13 kB | 21 kB | 49 kB   
                                            
Downloaded from eclipse.maven.central.mirror: https://repo.eclipse.org/content/repositories/maven_central/org/apache/maven/reporting/maven-reporting-api/2.0.6/maven-reporting-api-2.0.6.jar (9.9 kB at 355 kB/s)
Downloading from eclipse.maven.central.mirror: https://repo.eclipse.org/content/repositories/maven_central/org/apache/maven/maven-profile/2.0.6/maven-profile-2.0.6.jar
Downloaded from eclipse.maven.central.mirror: https://repo.eclipse.org/content/repositories/maven_central/org/apache/maven/maven-plugin-api/2.0.6/maven-plugin-api-2.0.6.jar (13 kB at 378 kB/s)
Downloading from eclipse.maven.central.mirror: https://repo.eclipse.org/content/repositories/maven_central/org/apache/maven/maven-model/2.0.6/maven-model-2.0.6.jar
Downloaded from eclipse.maven.central.mirror: https://repo.eclipse.org/content/repositories/maven_central/org/apache/maven/maven-plugin-parameter-documenter/2.0.6/maven-plugin-parameter-documenter-2.0.6.jar (21 kB at 593 kB/s)
Downloaded from eclipse.maven.central.mirror: https://repo.eclipse.org/content/repositories/maven_central/org/apache/maven/maven-settings/2.0.6/maven-settings-2.0.6.jar (49 kB at 1.4 MB/s)
Downloading from eclipse.maven.central.mirror: https://repo.eclipse.org/content/repositories/maven_central/org/apache/maven/maven-repository-metadata/2.0.6/maven-repository-metadata-2.0.6.jar
Downloading from eclipse.maven.central.mirror: https://repo.eclipse.org/content/repositories/maven_central/org/apache/maven/maven-error-diagnostics/2.0.6/maven-error-diagnostics-2.0.6.jar
Progress (1): 4.1/5.9 kB
Progress (2): 4.1/5.9 kB | 4.1/35 kB
Progress (2): 5.9 kB | 4.1/35 kB    
Progress (2): 5.9 kB | 7.7/35 kB
Progress (2): 5.9 kB | 12/35 kB 
Progress (2): 5.9 kB | 16/35 kB
Progress (2): 5.9 kB | 20/35 kB
Progress (2): 5.9 kB | 24/35 kB
Progress (2): 5.9 kB | 28/35 kB
Progress (2): 5.9 kB | 32/35 kB
Progress (2): 5.9 kB | 35 kB   
                            
Downloaded from eclipse.maven.central.mirror: https://repo.eclipse.org/content/repositories/maven_central/org/apache/maven/doxia/doxia-sink-api/1.0-alpha-7/doxia-sink-api-1.0-alpha-7.jar (5.9 kB at 138 kB/s)
Downloading from eclipse.maven.central.mirror: https://repo.eclipse.org/content/repositories/maven_central/org/apache/maven/maven-plugin-descriptor/2.0.6/maven-plugin-descriptor-2.0.6.jar
Downloaded from eclipse.maven.central.mirror: https://repo.eclipse.org/content/repositories/maven_central/org/apache/maven/maven-profile/2.0.6/maven-profile-2.0.6.jar (35 kB at 801 kB/s)
Downloading from eclipse.maven.central.mirror: https://repo.eclipse.org/content/repositories/maven_central/org/apache/maven/maven-artifact-manager/2.0.6/maven-artifact-manager-2.0.6.jar
Progress (1): 4.1/24 kB
Progress (1): 7.7/24 kB
Progress (2): 7.7/24 kB | 4.1/86 kB
Progress (2): 7.7/24 kB | 7.7/86 kB
Progress (2): 7.7/24 kB | 12/86 kB 
Progress (2): 7.7/24 kB | 16/86 kB
Progress (2): 12/24 kB | 16/86 kB 
Progress (2): 12/24 kB | 20/86 kB
Progress (2): 16/24 kB | 20/86 kB
Progress (2): 16/24 kB | 24/86 kB
Progress (3): 16/24 kB | 24/86 kB | 4.1/14 kB
Progress (3): 16/24 kB | 28/86 kB | 4.1/14 kB
Progress (3): 16/24 kB | 28/86 kB | 7.7/14 kB
Progress (3): 20/24 kB | 28/86 kB | 7.7/14 kB
Progress (3): 20/24 kB | 32/86 kB | 7.7/14 kB
Progress (3): 24/24 kB | 32/86 kB | 7.7/14 kB
Progress (3): 24/24 kB | 32/86 kB | 12/14 kB 
Progress (3): 24 kB | 32/86 kB | 12/14 kB   
Progress (4): 24 kB | 32/86 kB | 12/14 kB | 4.1/37 kB
Progress (4): 24 kB | 33/86 kB | 12/14 kB | 4.1/37 kB
Progress (4): 24 kB | 33/86 kB | 12/14 kB | 7.7/37 kB
Progress (4): 24 kB | 37/86 kB | 12/14 kB | 7.7/37 kB
Progress (4): 24 kB | 37/86 kB | 14 kB | 7.7/37 kB   
Progress (4): 24 kB | 41/86 kB | 14 kB | 7.7/37 kB
Progress (4): 24 kB | 41/86 kB | 14 kB | 12/37 kB 
Progress (4): 24 kB | 45/86 kB | 14 kB | 12/37 kB
Progress (4): 24 kB | 45/86 kB | 14 kB | 16/37 kB
Progress (4): 24 kB | 49/86 kB | 14 kB | 16/37 kB
Progress (5): 24 kB | 49/86 kB | 14 kB | 16/37 kB | 4.1/57 kB
Progress (5): 24 kB | 53/86 kB | 14 kB | 16/37 kB | 4.1/57 kB
Progress (5): 24 kB | 53/86 kB | 14 kB | 20/37 kB | 4.1/57 kB
Progress (5): 24 kB | 57/86 kB | 14 kB | 20/37 kB | 4.1/57 kB
Progress (5): 24 kB | 57/86 kB | 14 kB | 20/37 kB | 7.7/57 kB
Progress (5): 24 kB | 61/86 kB | 14 kB | 20/37 kB | 7.7/57 kB
Progress (5): 24 kB | 61/86 kB | 14 kB | 24/37 kB | 7.7/57 kB
Progress (5): 24 kB | 61/86 kB | 14 kB | 24/37 kB | 12/57 kB 
Progress (5): 24 kB | 61/86 kB | 14 kB | 28/37 kB | 12/57 kB
Progress (5): 24 kB | 65/86 kB | 14 kB | 28/37 kB | 12/57 kB
Progress (5): 24 kB | 65/86 kB | 14 kB | 32/37 kB | 12/57 kB
Progress (5): 24 kB | 65/86 kB | 14 kB | 32/37 kB | 16/57 kB
Progress (5): 24 kB | 65/86 kB | 14 kB | 33/37 kB | 16/57 kB
Progress (5): 24 kB | 69/86 kB | 14 kB | 33/37 kB | 16/57 kB
Progress (5): 24 kB | 69/86 kB | 14 kB | 37/37 kB | 16/57 kB
Progress (5): 24 kB | 69/86 kB | 14 kB | 37/37 kB | 20/57 kB
Progress (5): 24 kB | 69/86 kB | 14 kB | 37 kB | 20/57 kB   
Progress (5): 24 kB | 73/86 kB | 14 kB | 37 kB | 20/57 kB
Progress (5): 24 kB | 73/86 kB | 14 kB | 37 kB | 24/57 kB
Progress (5): 24 kB | 77/86 kB | 14 kB | 37 kB | 24/57 kB
Progress (5): 24 kB | 77/86 kB | 14 kB | 37 kB | 28/57 kB
Progress (5): 24 kB | 81/86 kB | 14 kB | 37 kB | 28/57 kB
Progress (5): 24 kB | 81/86 kB | 14 kB | 37 kB | 32/57 kB
Progress (5): 24 kB | 85/86 kB | 14 kB | 37 kB | 32/57 kB
                                                         
Downloaded from eclipse.maven.central.mirror: https://repo.eclipse.org/content/repositories/maven_central/org/apache/maven/maven-repository-metadata/2.0.6/maven-repository-metadata-2.0.6.jar (24 kB at 429 kB/s)
Downloaded from eclipse.maven.central.mirror: https://repo.eclipse.org/content/repositories/maven_central/org/apache/maven/maven-error-diagnostics/2.0.6/maven-error-diagnostics-2.0.6.jar (14 kB at 239 kB/s)
Progress (3): 85/86 kB | 37 kB | 33/57 kB
                                         
Downloading from eclipse.maven.central.mirror: https://repo.eclipse.org/content/repositories/maven_central/org/apache/maven/maven-project/2.0.6/maven-project-2.0.6.jar
Downloading from eclipse.maven.central.mirror: https://repo.eclipse.org/content/repositories/maven_central/org/apache/maven/maven-monitor/2.0.6/maven-monitor-2.0.6.jar
Progress (3): 86 kB | 37 kB | 33/57 kB
Progress (3): 86 kB | 37 kB | 37/57 kB
Progress (3): 86 kB | 37 kB | 41/57 kB
Progress (3): 86 kB | 37 kB | 45/57 kB
Progress (3): 86 kB | 37 kB | 49/57 kB
Progress (3): 86 kB | 37 kB | 53/57 kB
Progress (3): 86 kB | 37 kB | 57 kB   
                                   
Downloaded from eclipse.maven.central.mirror: https://repo.eclipse.org/content/repositories/maven_central/org/apache/maven/maven-plugin-descriptor/2.0.6/maven-plugin-descriptor-2.0.6.jar (37 kB at 595 kB/s)
Downloading from eclipse.maven.central.mirror: https://repo.eclipse.org/content/repositories/maven_central/org/apache/maven/maven-plugin-registry/2.0.6/maven-plugin-registry-2.0.6.jar
Downloaded from eclipse.maven.central.mirror: https://repo.eclipse.org/content/repositories/maven_central/org/apache/maven/maven-artifact-manager/2.0.6/maven-artifact-manager-2.0.6.jar (57 kB at 897 kB/s)
Downloading from eclipse.maven.central.mirror: https://repo.eclipse.org/content/repositories/maven_central/org/apache/maven/maven-artifact/2.0.6/maven-artifact-2.0.6.jar
Downloaded from eclipse.maven.central.mirror: https://repo.eclipse.org/content/repositories/maven_central/org/apache/maven/maven-model/2.0.6/maven-model-2.0.6.jar (86 kB at 1.3 MB/s)
Downloading from eclipse.maven.central.mirror: https://repo.eclipse.org/content/repositories/maven_central/org/codehaus/plexus/plexus-interpolation/1.15/plexus-interpolation-1.15.jar
Progress (1): 4.1/116 kB
Progress (1): 7.7/116 kB
Progress (2): 7.7/116 kB | 4.1/10 kB
Progress (2): 12/116 kB | 4.1/10 kB 
Progress (2): 12/116 kB | 7.7/10 kB
Progress (2): 16/116 kB | 7.7/10 kB
Progress (2): 16/116 kB | 10 kB    
Progress (2): 20/116 kB | 10 kB
Progress (2): 24/116 kB | 10 kB
Progress (2): 28/116 kB | 10 kB
Progress (2): 32/116 kB | 10 kB
Progress (2): 33/116 kB | 10 kB
Progress (2): 37/116 kB | 10 kB
Progress (2): 41/116 kB | 10 kB
Progress (2): 45/116 kB | 10 kB
Progress (2): 49/116 kB | 10 kB
Progress (2): 53/116 kB | 10 kB
Progress (2): 57/116 kB | 10 kB
Progress (2): 61/116 kB | 10 kB
Progress (2): 65/116 kB | 10 kB
Progress (2): 66/116 kB | 10 kB
Progress (2): 70/116 kB | 10 kB
Progress (2): 74/116 kB | 10 kB
Progress (2): 78/116 kB | 10 kB
Progress (2): 82/116 kB | 10 kB
Progress (2): 86/116 kB | 10 kB
Progress (2): 90/116 kB | 10 kB
Progress (2): 94/116 kB | 10 kB
Progress (2): 98/116 kB | 10 kB
Progress (2): 98/116 kB | 10 kB
Progress (2): 102/116 kB | 10 kB
Progress (2): 106/116 kB | 10 kB
Progress (3): 106/116 kB | 10 kB | 4.1/29 kB
Progress (3): 110/116 kB | 10 kB | 4.1/29 kB
Progress (3): 110/116 kB | 10 kB | 7.7/29 kB
                                            
Downloaded from eclipse.maven.central.mirror: https://repo.eclipse.org/content/repositories/maven_central/org/apache/maven/maven-monitor/2.0.6/maven-monitor-2.0.6.jar (10 kB at 146 kB/s)
Progress (3): 110/116 kB | 7.7/29 kB | 4.1/60 kB
Progress (3): 114/116 kB | 7.7/29 kB | 4.1/60 kB
Progress (3): 114/116 kB | 7.7/29 kB | 7.7/60 kB
Progress (3): 114/116 kB | 12/29 kB | 7.7/60 kB 
                                               
Downloading from eclipse.maven.central.mirror: https://repo.eclipse.org/content/repositories/maven_central/org/codehaus/plexus/plexus-archiver/2.4.4/plexus-archiver-2.4.4.jar
Progress (3): 114/116 kB | 16/29 kB | 7.7/60 kB
Progress (3): 114/116 kB | 16/29 kB | 12/60 kB 
Progress (3): 116 kB | 16/29 kB | 12/60 kB    
Progress (3): 116 kB | 16/29 kB | 16/60 kB
Progress (3): 116 kB | 16/29 kB | 20/60 kB
Progress (3): 116 kB | 16/29 kB | 24/60 kB
Progress (4): 116 kB | 16/29 kB | 24/60 kB | 4.1/87 kB
Progress (4): 116 kB | 20/29 kB | 24/60 kB | 4.1/87 kB
Progress (4): 116 kB | 20/29 kB | 24/60 kB | 7.7/87 kB
Progress (4): 116 kB | 20/29 kB | 28/60 kB | 7.7/87 kB
Progress (4): 116 kB | 20/29 kB | 28/60 kB | 12/87 kB 
Progress (4): 116 kB | 24/29 kB | 28/60 kB | 12/87 kB
Progress (4): 116 kB | 24/29 kB | 28/60 kB | 16/87 kB
Progress (4): 116 kB | 24/29 kB | 32/60 kB | 16/87 kB
Progress (4): 116 kB | 24/29 kB | 32/60 kB | 20/87 kB
Progress (4): 116 kB | 28/29 kB | 32/60 kB | 20/87 kB
Progress (4): 116 kB | 28/29 kB | 36/60 kB | 20/87 kB
Progress (4): 116 kB | 29 kB | 36/60 kB | 20/87 kB   
Progress (4): 116 kB | 29 kB | 36/60 kB | 24/87 kB
Progress (4): 116 kB | 29 kB | 40/60 kB | 24/87 kB
Progress (4): 116 kB | 29 kB | 40/60 kB | 28/87 kB
Progress (4): 116 kB | 29 kB | 44/60 kB | 28/87 kB
Progress (4): 116 kB | 29 kB | 44/60 kB | 32/87 kB
Progress (4): 116 kB | 29 kB | 48/60 kB | 32/87 kB
Progress (4): 116 kB | 29 kB | 48/60 kB | 33/87 kB
Progress (4): 116 kB | 29 kB | 52/60 kB | 33/87 kB
Progress (4): 116 kB | 29 kB | 52/60 kB | 37/87 kB
Progress (4): 116 kB | 29 kB | 56/60 kB | 37/87 kB
Progress (4): 116 kB | 29 kB | 56/60 kB | 41/87 kB
Progress (4): 116 kB | 29 kB | 60/60 kB | 41/87 kB
Progress (4): 116 kB | 29 kB | 60/60 kB | 45/87 kB
Progress (4): 116 kB | 29 kB | 60 kB | 45/87 kB   
Progress (4): 116 kB | 29 kB | 60 kB | 49/87 kB
Progress (4): 116 kB | 29 kB | 60 kB | 53/87 kB
Progress (5): 116 kB | 29 kB | 60 kB | 53/87 kB | 4.1/164 kB
Progress (5): 116 kB | 29 kB | 60 kB | 57/87 kB | 4.1/164 kB
                                                            
Downloaded from eclipse.maven.central.mirror: https://repo.eclipse.org/content/repositories/maven_central/org/apache/maven/maven-project/2.0.6/maven-project-2.0.6.jar (116 kB at 1.4 MB/s)
Progress (4): 29 kB | 60 kB | 57/87 kB | 7.7/164 kB
Progress (4): 29 kB | 60 kB | 61/87 kB | 7.7/164 kB
Progress (4): 29 kB | 60 kB | 61/87 kB | 12/164 kB 
                                                  
Downloading from eclipse.maven.central.mirror: https://repo.eclipse.org/content/repositories/maven_central/org/codehaus/plexus/plexus-io/2.0.10/plexus-io-2.0.10.jar
Progress (4): 29 kB | 60 kB | 65/87 kB | 12/164 kB
Progress (4): 29 kB | 60 kB | 65/87 kB | 16/164 kB
Progress (4): 29 kB | 60 kB | 69/87 kB | 16/164 kB
Progress (4): 29 kB | 60 kB | 69/87 kB | 20/164 kB
Progress (4): 29 kB | 60 kB | 73/87 kB | 20/164 kB
Progress (4): 29 kB | 60 kB | 73/87 kB | 24/164 kB
Progress (4): 29 kB | 60 kB | 77/87 kB | 24/164 kB
Progress (4): 29 kB | 60 kB | 77/87 kB | 28/164 kB
Progress (4): 29 kB | 60 kB | 81/87 kB | 28/164 kB
                                                  
Downloaded from eclipse.maven.central.mirror: https://repo.eclipse.org/content/repositories/maven_central/org/apache/maven/maven-plugin-registry/2.0.6/maven-plugin-registry-2.0.6.jar (29 kB at 348 kB/s)
Progress (3): 60 kB | 81/87 kB | 32/164 kB
Progress (3): 60 kB | 85/87 kB | 32/164 kB
                                          
Downloading from eclipse.maven.central.mirror: https://repo.eclipse.org/content/repositories/maven_central/org/apache/commons/commons-compress/1.5/commons-compress-1.5.jar
Progress (3): 60 kB | 87 kB | 32/164 kB
Progress (3): 60 kB | 87 kB | 33/164 kB
Progress (3): 60 kB | 87 kB | 37/164 kB
Progress (3): 60 kB | 87 kB | 41/164 kB
Progress (3): 60 kB | 87 kB | 45/164 kB
Progress (3): 60 kB | 87 kB | 49/164 kB
Progress (3): 60 kB | 87 kB | 53/164 kB
Progress (3): 60 kB | 87 kB | 57/164 kB
                                       
Downloaded from eclipse.maven.central.mirror: https://repo.eclipse.org/content/repositories/maven_central/org/codehaus/plexus/plexus-interpolation/1.15/plexus-interpolation-1.15.jar (60 kB at 711 kB/s)
Progress (2): 87 kB | 61/164 kB
                               
Downloading from eclipse.maven.central.mirror: https://repo.eclipse.org/content/repositories/maven_central/org/tukaani/xz/1.2/xz-1.2.jar
Progress (2): 87 kB | 65/164 kB
Progress (2): 87 kB | 69/164 kB
Progress (2): 87 kB | 73/164 kB
Progress (2): 87 kB | 77/164 kB
Progress (2): 87 kB | 81/164 kB
Progress (2): 87 kB | 85/164 kB
Progress (2): 87 kB | 89/164 kB
Progress (2): 87 kB | 93/164 kB
Progress (2): 87 kB | 97/164 kB
Progress (2): 87 kB | 101/164 kB
Progress (2): 87 kB | 105/164 kB
Progress (2): 87 kB | 109/164 kB
Progress (2): 87 kB | 113/164 kB
Progress (2): 87 kB | 117/164 kB
Progress (2): 87 kB | 121/164 kB
Progress (2): 87 kB | 125/164 kB
Progress (2): 87 kB | 129/164 kB
Progress (2): 87 kB | 133/164 kB
Progress (2): 87 kB | 137/164 kB
Progress (2): 87 kB | 141/164 kB
Progress (2): 87 kB | 145/164 kB
Progress (2): 87 kB | 149/164 kB
Progress (2): 87 kB | 153/164 kB
Progress (3): 87 kB | 153/164 kB | 4.1/256 kB
Progress (3): 87 kB | 157/164 kB | 4.1/256 kB
Progress (3): 87 kB | 157/164 kB | 7.7/256 kB
Progress (3): 87 kB | 161/164 kB | 7.7/256 kB
Progress (3): 87 kB | 161/164 kB | 12/256 kB 
Progress (3): 87 kB | 164 kB | 12/256 kB    
Progress (3): 87 kB | 164 kB | 16/256 kB
Progress (3): 87 kB | 164 kB | 20/256 kB
                                        
Downloaded from eclipse.maven.central.mirror: https://repo.eclipse.org/content/repositories/maven_central/org/apache/maven/maven-artifact/2.0.6/maven-artifact-2.0.6.jar (87 kB at 950 kB/s)
Progress (2): 164 kB | 24/256 kB
Progress (3): 164 kB | 24/256 kB | 4.1/59 kB
Progress (3): 164 kB | 28/256 kB | 4.1/59 kB
Progress (3): 164 kB | 28/256 kB | 7.7/59 kB
Progress (3): 164 kB | 32/256 kB | 7.7/59 kB
Progress (3): 164 kB | 32/256 kB | 12/59 kB 
Progress (3): 164 kB | 33/256 kB | 12/59 kB
Progress (4): 164 kB | 33/256 kB | 12/59 kB | 4.1/95 kB
Progress (4): 164 kB | 33/256 kB | 16/59 kB | 4.1/95 kB
Progress (4): 164 kB | 33/256 kB | 16/59 kB | 7.7/95 kB
Progress (4): 164 kB | 37/256 kB | 16/59 kB | 7.7/95 kB
Progress (4): 164 kB | 37/256 kB | 16/59 kB | 12/95 kB 
Progress (4): 164 kB | 37/256 kB | 20/59 kB | 12/95 kB
Progress (4): 164 kB | 37/256 kB | 20/59 kB | 16/95 kB
Progress (4): 164 kB | 41/256 kB | 20/59 kB | 16/95 kB
Progress (4): 164 kB | 41/256 kB | 20/59 kB | 20/95 kB
Progress (4): 164 kB | 41/256 kB | 24/59 kB | 20/95 kB
Progress (4): 164 kB | 41/256 kB | 24/59 kB | 24/95 kB
Progress (4): 164 kB | 45/256 kB | 24/59 kB | 24/95 kB
Progress (4): 164 kB | 45/256 kB | 24/59 kB | 28/95 kB
Progress (4): 164 kB | 45/256 kB | 28/59 kB | 28/95 kB
Progress (4): 164 kB | 45/256 kB | 28/59 kB | 32/95 kB
Progress (4): 164 kB | 49/256 kB | 28/59 kB | 32/95 kB
Progress (4): 164 kB | 49/256 kB | 28/59 kB | 33/95 kB
                                                      
Downloaded from eclipse.maven.central.mirror: https://repo.eclipse.org/content/repositories/maven_central/org/codehaus/plexus/plexus-archiver/2.4.4/plexus-archiver-2.4.4.jar (164 kB at 1.7 MB/s)
Progress (3): 49/256 kB | 28/59 kB | 37/95 kB
Progress (3): 49/256 kB | 32/59 kB | 37/95 kB
Progress (3): 49/256 kB | 32/59 kB | 41/95 kB
Progress (3): 53/256 kB | 32/59 kB | 41/95 kB
Progress (3): 53/256 kB | 32/59 kB | 45/95 kB
Progress (3): 53/256 kB | 33/59 kB | 45/95 kB
Progress (3): 53/256 kB | 33/59 kB | 49/95 kB
Progress (3): 53/256 kB | 37/59 kB | 49/95 kB
Progress (3): 57/256 kB | 37/59 kB | 49/95 kB
Progress (3): 57/256 kB | 41/59 kB | 49/95 kB
Progress (3): 57/256 kB | 41/59 kB | 53/95 kB
Progress (3): 57/256 kB | 45/59 kB | 53/95 kB
Progress (3): 61/256 kB | 45/59 kB | 53/95 kB
Progress (3): 61/256 kB | 49/59 kB | 53/95 kB
Progress (3): 61/256 kB | 49/59 kB | 57/95 kB
Progress (3): 61/256 kB | 53/59 kB | 57/95 kB
Progress (3): 61/256 kB | 53/59 kB | 61/95 kB
Progress (3): 65/256 kB | 53/59 kB | 61/95 kB
Progress (3): 65/256 kB | 53/59 kB | 65/95 kB
Progress (3): 65/256 kB | 57/59 kB | 65/95 kB
Progress (3): 65/256 kB | 57/59 kB | 66/95 kB
Progress (3): 66/256 kB | 57/59 kB | 66/95 kB
Progress (3): 66/256 kB | 57/59 kB | 70/95 kB
Progress (3): 66/256 kB | 59 kB | 70/95 kB   
Progress (3): 70/256 kB | 59 kB | 70/95 kB
Progress (3): 70/256 kB | 59 kB | 74/95 kB
Progress (3): 74/256 kB | 59 kB | 74/95 kB
Progress (3): 74/256 kB | 59 kB | 78/95 kB
Progress (3): 78/256 kB | 59 kB | 78/95 kB
Progress (3): 78/256 kB | 59 kB | 82/95 kB
Progress (3): 82/256 kB | 59 kB | 82/95 kB
Progress (3): 82/256 kB | 59 kB | 86/95 kB
Progress (3): 82/256 kB | 59 kB | 90/95 kB
Progress (3): 86/256 kB | 59 kB | 90/95 kB
Progress (3): 86/256 kB | 59 kB | 94/95 kB
Progress (3): 90/256 kB | 59 kB | 94/95 kB
Progress (3): 90/256 kB | 59 kB | 95 kB   
Progress (3): 94/256 kB | 59 kB | 95 kB
Progress (3): 98/256 kB | 59 kB | 95 kB
Progress (3): 98/256 kB | 59 kB | 95 kB
Progress (3): 102/256 kB | 59 kB | 95 kB
Progress (3): 106/256 kB | 59 kB | 95 kB
Progress (3): 110/256 kB | 59 kB | 95 kB
Progress (3): 114/256 kB | 59 kB | 95 kB
Progress (3): 118/256 kB | 59 kB | 95 kB
Progress (3): 122/256 kB | 59 kB | 95 kB
Progress (3): 126/256 kB | 59 kB | 95 kB
Progress (3): 130/256 kB | 59 kB | 95 kB
                                        
Downloaded from eclipse.maven.central.mirror: https://repo.eclipse.org/content/repositories/maven_central/org/codehaus/plexus/plexus-io/2.0.10/plexus-io-2.0.10.jar (59 kB at 549 kB/s)
Progress (2): 134/256 kB | 95 kB
Progress (2): 138/256 kB | 95 kB
Progress (2): 142/256 kB | 95 kB
Progress (2): 146/256 kB | 95 kB
Progress (2): 150/256 kB | 95 kB
Progress (2): 154/256 kB | 95 kB
Progress (2): 158/256 kB | 95 kB
                                
Downloaded from eclipse.maven.central.mirror: https://repo.eclipse.org/content/repositories/maven_central/org/tukaani/xz/1.2/xz-1.2.jar (95 kB at 878 kB/s)
Progress (1): 162/256 kB
Progress (1): 166/256 kB
Progress (1): 170/256 kB
Progress (1): 174/256 kB
Progress (1): 178/256 kB
Progress (1): 182/256 kB
Progress (1): 186/256 kB
Progress (1): 190/256 kB
Progress (1): 194/256 kB
Progress (1): 198/256 kB
Progress (1): 202/256 kB
Progress (1): 206/256 kB
Progress (1): 210/256 kB
Progress (1): 214/256 kB
Progress (1): 218/256 kB
Progress (1): 222/256 kB
Progress (1): 226/256 kB
Progress (1): 230/256 kB
Progress (1): 234/256 kB
Progress (1): 238/256 kB
Progress (1): 242/256 kB
Progress (1): 246/256 kB
Progress (1): 250/256 kB
Progress (1): 254/256 kB
Progress (1): 256 kB    
                    
Downloaded from eclipse.maven.central.mirror: https://repo.eclipse.org/content/repositories/maven_central/org/apache/commons/commons-compress/1.5/commons-compress-1.5.jar (256 kB at 2.2 MB/s)
[INFO] Building jar: /jobs/genie.sisu/sisu-sonar/workspace/org.eclipse.sisu.inject.tests/target/org.eclipse.sisu.inject.tests-0.9.0-SNAPSHOT.jar
[INFO] 
[INFO] ------------------------------------------------------------------------
[INFO] Building org.eclipse.sisu.inject.site 0.9.0-SNAPSHOT
[INFO] ------------------------------------------------------------------------
[INFO] 
[INFO] --- maven-clean-plugin:2.6:clean (default-clean) @ org.eclipse.sisu.inject.site ---
[INFO] Deleting /jobs/genie.sisu/sisu-sonar/workspace/org.eclipse.sisu.inject.site/target
[INFO] 
[INFO] --- tycho-packaging-plugin:0.24.0:build-qualifier-aggregator (default-build-qualifier-aggregator) @ org.eclipse.sisu.inject.site ---
[INFO] The project's OSGi version is 0.9.0.201801190723
[INFO] 
[INFO] --- maven-enforcer-plugin:1.2:enforce (enforce-maven) @ org.eclipse.sisu.inject.site ---
[INFO] 
[INFO] --- maven-clean-plugin:2.6:clean (default-clean-1) @ org.eclipse.sisu.inject.site ---
[INFO] 
[INFO] --- maven-resources-plugin:2.7:resources (default-resources) @ org.eclipse.sisu.inject.site ---
[INFO] Using 'UTF-8' encoding to copy filtered resources.
[INFO] skip non existing resourceDirectory /jobs/genie.sisu/sisu-sonar/workspace/org.eclipse.sisu.inject.site/src/main/resources
[INFO] 
[INFO] --- target-platform-configuration:0.24.0:target-platform (default-target-platform) @ org.eclipse.sisu.inject.site ---
[INFO] 
[INFO] --- tycho-p2-publisher-plugin:0.24.0:publish-products (default-publish-products) @ org.eclipse.sisu.inject.site ---
[INFO] 
[INFO] --- tycho-p2-publisher-plugin:0.24.0:publish-categories (default-publish-categories) @ org.eclipse.sisu.inject.site ---
[INFO] 
[INFO] --- tycho-p2-publisher-plugin:0.24.0:attach-artifacts (default-attach-artifacts) @ org.eclipse.sisu.inject.site ---
[INFO] 
[INFO] --- tycho-p2-repository-plugin:0.24.0:assemble-repository (default-assemble-repository) @ org.eclipse.sisu.inject.site ---
[INFO] 
[INFO] --- tycho-p2-repository-plugin:0.24.0:archive-repository (default-archive-repository) @ org.eclipse.sisu.inject.site ---
[INFO] Building zip: /jobs/genie.sisu/sisu-sonar/workspace/org.eclipse.sisu.inject.site/target/org.eclipse.sisu.inject.site-0.9.0-SNAPSHOT.zip
[INFO] 
[INFO] --- maven-antrun-plugin:1.7:run (add-notices) @ org.eclipse.sisu.inject.site ---
Downloading from eclipse.maven.central.mirror: https://repo.eclipse.org/content/repositories/maven_central/org/apache/maven/maven-plugin-api/2.0.11/maven-plugin-api-2.0.11.pom
Progress (1): 1.5 kB
                    
Downloaded from eclipse.maven.central.mirror: https://repo.eclipse.org/content/repositories/maven_central/org/apache/maven/maven-plugin-api/2.0.11/maven-plugin-api-2.0.11.pom (1.5 kB at 91 kB/s)
Downloading from eclipse.maven.central.mirror: https://repo.eclipse.org/content/repositories/maven_central/org/apache/maven/maven/2.0.11/maven-2.0.11.pom
Progress (1): 4.1/22 kB
Progress (1): 7.7/22 kB
Progress (1): 12/22 kB 
Progress (1): 16/22 kB
Progress (1): 20/22 kB
Progress (1): 22 kB   
                   
Downloaded from eclipse.maven.central.mirror: https://repo.eclipse.org/content/repositories/maven_central/org/apache/maven/maven/2.0.11/maven-2.0.11.pom (22 kB at 1.1 MB/s)
Downloading from eclipse.maven.central.mirror: https://repo.eclipse.org/content/repositories/maven_central/org/apache/maven/maven-parent/12/maven-parent-12.pom
Progress (1): 4.1/22 kB
Progress (1): 7.7/22 kB
Progress (1): 12/22 kB 
Progress (1): 16/22 kB
Progress (1): 20/22 kB
Progress (1): 22 kB   
                   
Downloaded from eclipse.maven.central.mirror: https://repo.eclipse.org/content/repositories/maven_central/org/apache/maven/maven-parent/12/maven-parent-12.pom (22 kB at 1.1 MB/s)
Downloading from eclipse.maven.central.mirror: https://repo.eclipse.org/content/repositories/maven_central/org/apache/maven/maven-project/2.0.11/maven-project-2.0.11.pom
Progress (1): 2.8 kB
                    
Downloaded from eclipse.maven.central.mirror: https://repo.eclipse.org/content/repositories/maven_central/org/apache/maven/maven-project/2.0.11/maven-project-2.0.11.pom (2.8 kB at 231 kB/s)
Downloading from eclipse.maven.central.mirror: https://repo.eclipse.org/content/repositories/maven_central/org/apache/maven/maven-settings/2.0.11/maven-settings-2.0.11.pom
Progress (1): 2.2 kB
                    
Downloaded from eclipse.maven.central.mirror: https://repo.eclipse.org/content/repositories/maven_central/org/apache/maven/maven-settings/2.0.11/maven-settings-2.0.11.pom (2.2 kB at 218 kB/s)
Downloading from eclipse.maven.central.mirror: https://repo.eclipse.org/content/repositories/maven_central/org/apache/maven/maven-model/2.0.11/maven-model-2.0.11.pom
Progress (1): 3.2 kB
                    
Downloaded from eclipse.maven.central.mirror: https://repo.eclipse.org/content/repositories/maven_central/org/apache/maven/maven-model/2.0.11/maven-model-2.0.11.pom (3.2 kB at 232 kB/s)
Downloading from eclipse.maven.central.mirror: https://repo.eclipse.org/content/repositories/maven_central/org/apache/maven/maven-profile/2.0.11/maven-profile-2.0.11.pom
Progress (1): 2.0 kB
                    
Downloaded from eclipse.maven.central.mirror: https://repo.eclipse.org/content/repositories/maven_central/org/apache/maven/maven-profile/2.0.11/maven-profile-2.0.11.pom (2.0 kB at 146 kB/s)
Downloading from eclipse.maven.central.mirror: https://repo.eclipse.org/content/repositories/maven_central/org/apache/maven/maven-artifact-manager/2.0.11/maven-artifact-manager-2.0.11.pom
Progress (1): 2.6 kB
                    
Downloaded from eclipse.maven.central.mirror: https://repo.eclipse.org/content/repositories/maven_central/org/apache/maven/maven-artifact-manager/2.0.11/maven-artifact-manager-2.0.11.pom (2.6 kB at 188 kB/s)
Downloading from eclipse.maven.central.mirror: https://repo.eclipse.org/content/repositories/maven_central/org/apache/maven/maven-repository-metadata/2.0.11/maven-repository-metadata-2.0.11.pom
Progress (1): 2.3 kB
                    
Downloaded from eclipse.maven.central.mirror: https://repo.eclipse.org/content/repositories/maven_central/org/apache/maven/maven-repository-metadata/2.0.11/maven-repository-metadata-2.0.11.pom (2.3 kB at 125 kB/s)
Downloading from eclipse.maven.central.mirror: https://repo.eclipse.org/content/repositories/maven_central/org/apache/maven/maven-artifact/2.0.11/maven-artifact-2.0.11.pom
Progress (1): 1.6 kB
                    
Downloaded from eclipse.maven.central.mirror: https://repo.eclipse.org/content/repositories/maven_central/org/apache/maven/maven-artifact/2.0.11/maven-artifact-2.0.11.pom (1.6 kB at 63 kB/s)
Downloading from eclipse.maven.central.mirror: https://repo.eclipse.org/content/repositories/maven_central/org/apache/maven/maven-plugin-registry/2.0.11/maven-plugin-registry-2.0.11.pom
Progress (1): 1.9 kB
                    
Downloaded from eclipse.maven.central.mirror: https://repo.eclipse.org/content/repositories/maven_central/org/apache/maven/maven-plugin-registry/2.0.11/maven-plugin-registry-2.0.11.pom (1.9 kB at 121 kB/s)
Downloading from eclipse.maven.central.mirror: https://repo.eclipse.org/content/repositories/maven_central/org/codehaus/plexus/plexus-utils/2.0.5/plexus-utils-2.0.5.pom
Progress (1): 3.3 kB
                    
Downloaded from eclipse.maven.central.mirror: https://repo.eclipse.org/content/repositories/maven_central/org/codehaus/plexus/plexus-utils/2.0.5/plexus-utils-2.0.5.pom (3.3 kB at 222 kB/s)
Downloading from eclipse.maven.central.mirror: https://repo.eclipse.org/content/repositories/maven_central/org/apache/ant/ant/1.8.2/ant-1.8.2.pom
Progress (1): 4.1/9.9 kB
Progress (1): 7.7/9.9 kB
Progress (1): 9.9 kB    
                    
Downloaded from eclipse.maven.central.mirror: https://repo.eclipse.org/content/repositories/maven_central/org/apache/ant/ant/1.8.2/ant-1.8.2.pom (9.9 kB at 366 kB/s)
Downloading from eclipse.maven.central.mirror: https://repo.eclipse.org/content/repositories/maven_central/org/apache/ant/ant-parent/1.8.2/ant-parent-1.8.2.pom
Progress (1): 4.1/4.7 kB
Progress (1): 4.7 kB    
                    
Downloaded from eclipse.maven.central.mirror: https://repo.eclipse.org/content/repositories/maven_central/org/apache/ant/ant-parent/1.8.2/ant-parent-1.8.2.pom (4.7 kB at 204 kB/s)
Downloading from eclipse.maven.central.mirror: https://repo.eclipse.org/content/repositories/maven_central/org/apache/ant/ant-launcher/1.8.2/ant-launcher-1.8.2.pom
Progress (1): 2.4 kB
                    
Downloaded from eclipse.maven.central.mirror: https://repo.eclipse.org/content/repositories/maven_central/org/apache/ant/ant-launcher/1.8.2/ant-launcher-1.8.2.pom (2.4 kB at 64 kB/s)
Downloading from eclipse.maven.central.mirror: https://repo.eclipse.org/content/repositories/maven_central/org/apache/maven/maven-plugin-api/2.0.11/maven-plugin-api-2.0.11.jar
Downloading from eclipse.maven.central.mirror: https://repo.eclipse.org/content/repositories/maven_central/org/apache/maven/maven-project/2.0.11/maven-project-2.0.11.jar
Downloading from eclipse.maven.central.mirror: https://repo.eclipse.org/content/repositories/maven_central/org/apache/maven/maven-settings/2.0.11/maven-settings-2.0.11.jar
Downloading from eclipse.maven.central.mirror: https://repo.eclipse.org/content/repositories/maven_central/org/apache/maven/maven-profile/2.0.11/maven-profile-2.0.11.jar
Downloading from eclipse.maven.central.mirror: https://repo.eclipse.org/content/repositories/maven_central/org/apache/maven/maven-model/2.0.11/maven-model-2.0.11.jar
Progress (1): 4.1/13 kB
Progress (1): 7.7/13 kB
Progress (1): 12/13 kB 
Progress (1): 13 kB   
Progress (2): 13 kB | 4.1/37 kB
Progress (3): 13 kB | 4.1/37 kB | 4.1/51 kB
Progress (3): 13 kB | 7.7/37 kB | 4.1/51 kB
Progress (3): 13 kB | 7.7/37 kB | 7.7/51 kB
Progress (3): 13 kB | 12/37 kB | 7.7/51 kB 
Progress (3): 13 kB | 12/37 kB | 12/51 kB 
Progress (3): 13 kB | 16/37 kB | 12/51 kB
Progress (3): 13 kB | 16/37 kB | 16/51 kB
Progress (3): 13 kB | 16/37 kB | 20/51 kB
Progress (3): 13 kB | 20/37 kB | 20/51 kB
Progress (3): 13 kB | 20/37 kB | 24/51 kB
Progress (3): 13 kB | 24/37 kB | 24/51 kB
Progress (3): 13 kB | 24/37 kB | 28/51 kB
Progress (3): 13 kB | 24/37 kB | 32/51 kB
Progress (3): 13 kB | 28/37 kB | 32/51 kB
Progress (3): 13 kB | 28/37 kB | 36/51 kB
Progress (3): 13 kB | 32/37 kB | 36/51 kB
Progress (3): 13 kB | 32/37 kB | 40/51 kB
Progress (3): 13 kB | 36/37 kB | 40/51 kB
Progress (3): 13 kB | 36/37 kB | 44/51 kB
Progress (3): 13 kB | 37 kB | 44/51 kB   
Progress (3): 13 kB | 37 kB | 48/51 kB
Progress (3): 13 kB | 37 kB | 51 kB   
Progress (4): 13 kB | 37 kB | 51 kB | 4.1/97 kB
Progress (4): 13 kB | 37 kB | 51 kB | 7.7/97 kB
Progress (4): 13 kB | 37 kB | 51 kB | 12/97 kB 
Progress (4): 13 kB | 37 kB | 51 kB | 16/97 kB
Progress (4): 13 kB | 37 kB | 51 kB | 20/97 kB
Progress (4): 13 kB | 37 kB | 51 kB | 24/97 kB
Progress (4): 13 kB | 37 kB | 51 kB | 28/97 kB
Progress (4): 13 kB | 37 kB | 51 kB | 32/97 kB
Progress (4): 13 kB | 37 kB | 51 kB | 33/97 kB
Progress (4): 13 kB | 37 kB | 51 kB | 37/97 kB
Progress (4): 13 kB | 37 kB | 51 kB | 41/97 kB
Progress (4): 13 kB | 37 kB | 51 kB | 45/97 kB
Progress (4): 13 kB | 37 kB | 51 kB | 49/97 kB
Progress (4): 13 kB | 37 kB | 51 kB | 53/97 kB
Progress (4): 13 kB | 37 kB | 51 kB | 57/97 kB
Progress (4): 13 kB | 37 kB | 51 kB | 61/97 kB
Progress (4): 13 kB | 37 kB | 51 kB | 65/97 kB
Progress (4): 13 kB | 37 kB | 51 kB | 69/97 kB
Progress (4): 13 kB | 37 kB | 51 kB | 73/97 kB
Progress (4): 13 kB | 37 kB | 51 kB | 77/97 kB
Progress (4): 13 kB | 37 kB | 51 kB | 81/97 kB
Progress (4): 13 kB | 37 kB | 51 kB | 85/97 kB
Progress (4): 13 kB | 37 kB | 51 kB | 89/97 kB
                                              
Downloaded from eclipse.maven.central.mirror: https://repo.eclipse.org/content/repositories/maven_central/org/apache/maven/maven-plugin-api/2.0.11/maven-plugin-api-2.0.11.jar (13 kB at 523 kB/s)
Downloading from eclipse.maven.central.mirror: https://repo.eclipse.org/content/repositories/maven_central/org/apache/maven/maven-artifact-manager/2.0.11/maven-artifact-manager-2.0.11.jar
Progress (3): 37 kB | 51 kB | 93/97 kB
Progress (3): 37 kB | 51 kB | 97 kB   
                                   
Downloaded from eclipse.maven.central.mirror: https://repo.eclipse.org/content/repositories/maven_central/org/apache/maven/maven-profile/2.0.11/maven-profile-2.0.11.jar (37 kB at 1.5 MB/s)
Downloading from eclipse.maven.central.mirror: https://repo.eclipse.org/content/repositories/maven_central/org/apache/maven/maven-repository-metadata/2.0.11/maven-repository-metadata-2.0.11.jar
Downloaded from eclipse.maven.central.mirror: https://repo.eclipse.org/content/repositories/maven_central/org/apache/maven/maven-settings/2.0.11/maven-settings-2.0.11.jar (51 kB at 2.0 MB/s)
Downloading from eclipse.maven.central.mirror: https://repo.eclipse.org/content/repositories/maven_central/org/apache/maven/maven-plugin-registry/2.0.11/maven-plugin-registry-2.0.11.jar
Progress (2): 97 kB | 4.1/123 kB
Progress (2): 97 kB | 7.7/123 kB
Progress (2): 97 kB | 12/123 kB 
Progress (2): 97 kB | 16/123 kB
Progress (2): 97 kB | 20/123 kB
Progress (2): 97 kB | 24/123 kB
Progress (2): 97 kB | 28/123 kB
Progress (2): 97 kB | 32/123 kB
Progress (2): 97 kB | 33/123 kB
Progress (2): 97 kB | 37/123 kB
Progress (2): 97 kB | 41/123 kB
Progress (2): 97 kB | 45/123 kB
Progress (2): 97 kB | 49/123 kB
Progress (2): 97 kB | 53/123 kB
Progress (2): 97 kB | 57/123 kB
Progress (2): 97 kB | 61/123 kB
Progress (2): 97 kB | 65/123 kB
Progress (2): 97 kB | 66/123 kB
Progress (2): 97 kB | 70/123 kB
Progress (2): 97 kB | 74/123 kB
Progress (2): 97 kB | 78/123 kB
Progress (2): 97 kB | 82/123 kB
Progress (2): 97 kB | 86/123 kB
Progress (2): 97 kB | 90/123 kB
                               
Downloaded from eclipse.maven.central.mirror: https://repo.eclipse.org/content/repositories/maven_central/org/apache/maven/maven-model/2.0.11/maven-model-2.0.11.jar (97 kB at 3.0 MB/s)
Progress (1): 94/123 kB
                       
Downloading from eclipse.maven.central.mirror: https://repo.eclipse.org/content/repositories/maven_central/org/codehaus/plexus/plexus-interpolation/1.1/plexus-interpolation-1.1.jar
Progress (1): 98/123 kB
Progress (1): 98/123 kB
Progress (1): 102/123 kB
Progress (1): 106/123 kB
Progress (1): 110/123 kB
Progress (1): 114/123 kB
Progress (2): 114/123 kB | 4.1/31 kB
Progress (2): 114/123 kB | 7.7/31 kB
Progress (2): 118/123 kB | 7.7/31 kB
Progress (2): 118/123 kB | 12/31 kB 
Progress (2): 122/123 kB | 12/31 kB
Progress (3): 122/123 kB | 12/31 kB | 4.1/26 kB
Progress (3): 122/123 kB | 16/31 kB | 4.1/26 kB
Progress (3): 123 kB | 16/31 kB | 4.1/26 kB    
Progress (3): 123 kB | 16/31 kB | 7.7/26 kB
Progress (3): 123 kB | 20/31 kB | 7.7/26 kB
Progress (3): 123 kB | 24/31 kB | 7.7/26 kB
Progress (3): 123 kB | 24/31 kB | 12/26 kB 
Progress (3): 123 kB | 28/31 kB | 12/26 kB
Progress (3): 123 kB | 28/31 kB | 16/26 kB
Progress (3): 123 kB | 31 kB | 16/26 kB   
Progress (3): 123 kB | 31 kB | 20/26 kB
Progress (3): 123 kB | 31 kB | 24/26 kB
Progress (3): 123 kB | 31 kB | 26 kB   
Progress (4): 123 kB | 31 kB | 26 kB | 4.1/58 kB
Progress (4): 123 kB | 31 kB | 26 kB | 7.7/58 kB
Progress (4): 123 kB | 31 kB | 26 kB | 12/58 kB 
Progress (4): 123 kB | 31 kB | 26 kB | 16/58 kB
Progress (4): 123 kB | 31 kB | 26 kB | 20/58 kB
Progress (4): 123 kB | 31 kB | 26 kB | 24/58 kB
Progress (4): 123 kB | 31 kB | 26 kB | 28/58 kB
Progress (4): 123 kB | 31 kB | 26 kB | 32/58 kB
Progress (4): 123 kB | 31 kB | 26 kB | 33/58 kB
Progress (4): 123 kB | 31 kB | 26 kB | 37/58 kB
Progress (4): 123 kB | 31 kB | 26 kB | 41/58 kB
Progress (4): 123 kB | 31 kB | 26 kB | 45/58 kB
Progress (4): 123 kB | 31 kB | 26 kB | 49/58 kB
Progress (4): 123 kB | 31 kB | 26 kB | 53/58 kB
Progress (4): 123 kB | 31 kB | 26 kB | 57/58 kB
Progress (4): 123 kB | 31 kB | 26 kB | 58 kB   
                                            
Downloaded from eclipse.maven.central.mirror: https://repo.eclipse.org/content/repositories/maven_central/org/apache/maven/maven-project/2.0.11/maven-project-2.0.11.jar (123 kB at 3.0 MB/s)
Downloading from eclipse.maven.central.mirror: https://repo.eclipse.org/content/repositories/maven_central/org/apache/maven/maven-artifact/2.0.11/maven-artifact-2.0.11.jar
Downloaded from eclipse.maven.central.mirror: https://repo.eclipse.org/content/repositories/maven_central/org/apache/maven/maven-repository-metadata/2.0.11/maven-repository-metadata-2.0.11.jar (26 kB at 640 kB/s)
Downloaded from eclipse.maven.central.mirror: https://repo.eclipse.org/content/repositories/maven_central/org/apache/maven/maven-plugin-registry/2.0.11/maven-plugin-registry-2.0.11.jar (31 kB at 766 kB/s)
Downloading from eclipse.maven.central.mirror: https://repo.eclipse.org/content/repositories/maven_central/org/codehaus/plexus/plexus-utils/2.0.5/plexus-utils-2.0.5.jar
Downloading from eclipse.maven.central.mirror: https://repo.eclipse.org/content/repositories/maven_central/org/apache/ant/ant/1.8.2/ant-1.8.2.jar
Progress (2): 58 kB | 4.1/35 kB
Progress (2): 58 kB | 7.7/35 kB
Progress (2): 58 kB | 12/35 kB 
Progress (2): 58 kB | 16/35 kB
Progress (2): 58 kB | 20/35 kB
Progress (2): 58 kB | 24/35 kB
Progress (2): 58 kB | 28/35 kB
Progress (2): 58 kB | 32/35 kB
Progress (2): 58 kB | 35 kB   
                           
Downloaded from eclipse.maven.central.mirror: https://repo.eclipse.org/content/repositories/maven_central/org/apache/maven/maven-artifact-manager/2.0.11/maven-artifact-manager-2.0.11.jar (58 kB at 1.3 MB/s)
Downloading from eclipse.maven.central.mirror: https://repo.eclipse.org/content/repositories/maven_central/org/apache/ant/ant-launcher/1.8.2/ant-launcher-1.8.2.jar
Progress (2): 35 kB | 4.1/223 kB
Progress (2): 35 kB | 7.7/223 kB
Progress (2): 35 kB | 12/223 kB 
Progress (2): 35 kB | 16/223 kB
                               
Downloaded from eclipse.maven.central.mirror: https://repo.eclipse.org/content/repositories/maven_central/org/codehaus/plexus/plexus-interpolation/1.1/plexus-interpolation-1.1.jar (35 kB at 724 kB/s)
Progress (1): 20/223 kB
Progress (1): 24/223 kB
Progress (1): 28/223 kB
Progress (1): 32/223 kB
Progress (1): 33/223 kB
Progress (2): 33/223 kB | 4.1/90 kB
Progress (2): 33/223 kB | 7.7/90 kB
Progress (2): 37/223 kB | 7.7/90 kB
Progress (2): 37/223 kB | 12/90 kB 
Progress (2): 41/223 kB | 12/90 kB
Progress (2): 41/223 kB | 16/90 kB
Progress (3): 41/223 kB | 16/90 kB | 4.1/12 kB
Progress (3): 41/223 kB | 20/90 kB | 4.1/12 kB
Progress (3): 45/223 kB | 20/90 kB | 4.1/12 kB
Progress (3): 45/223 kB | 20/90 kB | 7.7/12 kB
Progress (3): 49/223 kB | 20/90 kB | 7.7/12 kB
Progress (4): 49/223 kB | 20/90 kB | 7.7/12 kB | 0/1.9 MB
Progress (4): 49/223 kB | 24/90 kB | 7.7/12 kB | 0/1.9 MB
Progress (4): 53/223 kB | 24/90 kB | 7.7/12 kB | 0/1.9 MB
Progress (4): 53/223 kB | 24/90 kB | 7.7/12 kB | 0/1.9 MB
Progress (4): 57/223 kB | 24/90 kB | 7.7/12 kB | 0/1.9 MB
Progress (4): 57/223 kB | 24/90 kB | 12/12 kB | 0/1.9 MB 
Progress (4): 57/223 kB | 24/90 kB | 12/12 kB | 0/1.9 MB
Progress (4): 57/223 kB | 28/90 kB | 12/12 kB | 0/1.9 MB
Progress (4): 57/223 kB | 28/90 kB | 12/12 kB | 0/1.9 MB
Progress (4): 61/223 kB | 28/90 kB | 12/12 kB | 0/1.9 MB
Progress (4): 61/223 kB | 28/90 kB | 12 kB | 0/1.9 MB   
Progress (4): 65/223 kB | 28/90 kB | 12 kB | 0/1.9 MB
Progress (4): 65/223 kB | 28/90 kB | 12 kB | 0/1.9 MB
Progress (4): 65/223 kB | 32/90 kB | 12 kB | 0/1.9 MB
Progress (4): 65/223 kB | 32/90 kB | 12 kB | 0/1.9 MB
Progress (4): 66/223 kB | 32/90 kB | 12 kB | 0/1.9 MB
Progress (4): 66/223 kB | 33/90 kB | 12 kB | 0/1.9 MB
Progress (4): 66/223 kB | 33/90 kB | 12 kB | 0/1.9 MB
Progress (4): 70/223 kB | 33/90 kB | 12 kB | 0/1.9 MB
Progress (4): 70/223 kB | 33/90 kB | 12 kB | 0/1.9 MB
Progress (4): 70/223 kB | 37/90 kB | 12 kB | 0/1.9 MB
Progress (4): 70/223 kB | 37/90 kB | 12 kB | 0/1.9 MB
Progress (4): 74/223 kB | 37/90 kB | 12 kB | 0/1.9 MB
Progress (4): 74/223 kB | 41/90 kB | 12 kB | 0/1.9 MB
Progress (4): 74/223 kB | 41/90 kB | 12 kB | 0/1.9 MB
Progress (4): 78/223 kB | 41/90 kB | 12 kB | 0/1.9 MB
Progress (4): 78/223 kB | 41/90 kB | 12 kB | 0/1.9 MB
Progress (4): 78/223 kB | 45/90 kB | 12 kB | 0/1.9 MB
Progress (4): 82/223 kB | 45/90 kB | 12 kB | 0/1.9 MB
Progress (4): 82/223 kB | 45/90 kB | 12 kB | 0/1.9 MB
Progress (4): 82/223 kB | 49/90 kB | 12 kB | 0/1.9 MB
Progress (4): 82/223 kB | 49/90 kB | 12 kB | 0/1.9 MB
Progress (4): 86/223 kB | 49/90 kB | 12 kB | 0/1.9 MB
Progress (4): 86/223 kB | 53/90 kB | 12 kB | 0/1.9 MB
Progress (4): 90/223 kB | 53/90 kB | 12 kB | 0/1.9 MB
Progress (4): 90/223 kB | 53/90 kB | 12 kB | 0.1/1.9 MB
Progress (4): 90/223 kB | 57/90 kB | 12 kB | 0.1/1.9 MB
Progress (4): 90/223 kB | 57/90 kB | 12 kB | 0.1/1.9 MB
Progress (4): 94/223 kB | 57/90 kB | 12 kB | 0.1/1.9 MB
Progress (4): 94/223 kB | 61/90 kB | 12 kB | 0.1/1.9 MB
Progress (4): 94/223 kB | 61/90 kB | 12 kB | 0.1/1.9 MB
Progress (4): 98/223 kB | 61/90 kB | 12 kB | 0.1/1.9 MB
Progress (4): 98/223 kB | 61/90 kB | 12 kB | 0.1/1.9 MB
Progress (4): 98/223 kB | 65/90 kB | 12 kB | 0.1/1.9 MB
Progress (4): 98/223 kB | 65/90 kB | 12 kB | 0.1/1.9 MB
Progress (4): 98/223 kB | 65/90 kB | 12 kB | 0.1/1.9 MB
Progress (4): 98/223 kB | 65/90 kB | 12 kB | 0.1/1.9 MB
Progress (4): 98/223 kB | 69/90 kB | 12 kB | 0.1/1.9 MB
Progress (4): 98/223 kB | 69/90 kB | 12 kB | 0.1/1.9 MB
Progress (4): 102/223 kB | 69/90 kB | 12 kB | 0.1/1.9 MB
Progress (4): 102/223 kB | 73/90 kB | 12 kB | 0.1/1.9 MB
Progress (4): 106/223 kB | 73/90 kB | 12 kB | 0.1/1.9 MB
Progress (4): 106/223 kB | 73/90 kB | 12 kB | 0.1/1.9 MB
Progress (4): 106/223 kB | 77/90 kB | 12 kB | 0.1/1.9 MB
Progress (4): 106/223 kB | 77/90 kB | 12 kB | 0.1/1.9 MB
Progress (4): 110/223 kB | 77/90 kB | 12 kB | 0.1/1.9 MB
                                                        
Downloaded from eclipse.maven.central.mirror: https://repo.eclipse.org/content/repositories/maven_central/org/apache/ant/ant-launcher/1.8.2/ant-launcher-1.8.2.jar (12 kB at 212 kB/s)
Progress (3): 110/223 kB | 81/90 kB | 0.1/1.9 MB
Progress (3): 110/223 kB | 81/90 kB | 0.1/1.9 MB
Progress (3): 114/223 kB | 81/90 kB | 0.1/1.9 MB
Progress (3): 114/223 kB | 85/90 kB | 0.1/1.9 MB
Progress (3): 114/223 kB | 85/90 kB | 0.1/1.9 MB
Progress (3): 118/223 kB | 85/90 kB | 0.1/1.9 MB
Progress (3): 118/223 kB | 89/90 kB | 0.1/1.9 MB
Progress (3): 122/223 kB | 89/90 kB | 0.1/1.9 MB
Progress (3): 122/223 kB | 90 kB | 0.1/1.9 MB   
Progress (3): 122/223 kB | 90 kB | 0.1/1.9 MB
Progress (3): 126/223 kB | 90 kB | 0.1/1.9 MB
Progress (3): 126/223 kB | 90 kB | 0.1/1.9 MB
Progress (3): 130/223 kB | 90 kB | 0.1/1.9 MB
Progress (3): 131/223 kB | 90 kB | 0.1/1.9 MB
Progress (3): 131/223 kB | 90 kB | 0.1/1.9 MB
Progress (3): 135/223 kB | 90 kB | 0.1/1.9 MB
Progress (3): 135/223 kB | 90 kB | 0.1/1.9 MB
Progress (3): 139/223 kB | 90 kB | 0.1/1.9 MB
Progress (3): 139/223 kB | 90 kB | 0.1/1.9 MB
Progress (3): 143/223 kB | 90 kB | 0.1/1.9 MB
Progress (3): 143/223 kB | 90 kB | 0.1/1.9 MB
Progress (3): 147/223 kB | 90 kB | 0.1/1.9 MB
Progress (3): 147/223 kB | 90 kB | 0.1/1.9 MB
Progress (3): 151/223 kB | 90 kB | 0.1/1.9 MB
Progress (3): 151/223 kB | 90 kB | 0.1/1.9 MB
Progress (3): 155/223 kB | 90 kB | 0.1/1.9 MB
Progress (3): 155/223 kB | 90 kB | 0.1/1.9 MB
Progress (3): 159/223 kB | 90 kB | 0.1/1.9 MB
Progress (3): 159/223 kB | 90 kB | 0.1/1.9 MB
Progress (3): 163/223 kB | 90 kB | 0.1/1.9 MB
Progress (3): 163/223 kB | 90 kB | 0.1/1.9 MB
Progress (3): 167/223 kB | 90 kB | 0.1/1.9 MB
Progress (3): 167/223 kB | 90 kB | 0.1/1.9 MB
Progress (3): 171/223 kB | 90 kB | 0.1/1.9 MB
Progress (3): 171/223 kB | 90 kB | 0.1/1.9 MB
Progress (3): 175/223 kB | 90 kB | 0.1/1.9 MB
Progress (3): 175/223 kB | 90 kB | 0.1/1.9 MB
Progress (3): 179/223 kB | 90 kB | 0.1/1.9 MB
Progress (3): 179/223 kB | 90 kB | 0.1/1.9 MB
Progress (3): 183/223 kB | 90 kB | 0.1/1.9 MB
Progress (3): 183/223 kB | 90 kB | 0.2/1.9 MB
Progress (3): 187/223 kB | 90 kB | 0.2/1.9 MB
Progress (3): 187/223 kB | 90 kB | 0.2/1.9 MB
Progress (3): 191/223 kB | 90 kB | 0.2/1.9 MB
Progress (3): 191/223 kB | 90 kB | 0.2/1.9 MB
Progress (3): 195/223 kB | 90 kB | 0.2/1.9 MB
Progress (3): 195/223 kB | 90 kB | 0.2/1.9 MB
Progress (3): 199/223 kB | 90 kB | 0.2/1.9 MB
Progress (3): 199/223 kB | 90 kB | 0.2/1.9 MB
Progress (3): 203/223 kB | 90 kB | 0.2/1.9 MB
Progress (3): 203/223 kB | 90 kB | 0.2/1.9 MB
Progress (3): 207/223 kB | 90 kB | 0.2/1.9 MB
Progress (3): 207/223 kB | 90 kB | 0.2/1.9 MB
Progress (3): 211/223 kB | 90 kB | 0.2/1.9 MB
                                             
Downloaded from eclipse.maven.central.mirror: https://repo.eclipse.org/content/repositories/maven_central/org/apache/maven/maven-artifact/2.0.11/maven-artifact-2.0.11.jar (90 kB at 1.4 MB/s)
Progress (2): 215/223 kB | 0.2/1.9 MB
Progress (2): 215/223 kB | 0.2/1.9 MB
Progress (2): 219/223 kB | 0.2/1.9 MB
Progress (2): 219/223 kB | 0.2/1.9 MB
Progress (2): 223/223 kB | 0.2/1.9 MB
Progress (2): 223 kB | 0.2/1.9 MB    
Progress (2): 223 kB | 0.2/1.9 MB
Progress (2): 223 kB | 0.2/1.9 MB
Progress (2): 223 kB | 0.2/1.9 MB
Progress (2): 223 kB | 0.2/1.9 MB
Progress (2): 223 kB | 0.2/1.9 MB
Progress (2): 223 kB | 0.2/1.9 MB
Progress (2): 223 kB | 0.2/1.9 MB
Progress (2): 223 kB | 0.2/1.9 MB
Progress (2): 223 kB | 0.2/1.9 MB
Progress (2): 223 kB | 0.2/1.9 MB
Progress (2): 223 kB | 0.2/1.9 MB
Progress (2): 223 kB | 0.2/1.9 MB
Progress (2): 223 kB | 0.2/1.9 MB
Progress (2): 223 kB | 0.2/1.9 MB
Progress (2): 223 kB | 0.2/1.9 MB
Progress (2): 223 kB | 0.2/1.9 MB
Progress (2): 223 kB | 0.3/1.9 MB
Progress (2): 223 kB | 0.3/1.9 MB
Progress (2): 223 kB | 0.3/1.9 MB
Progress (2): 223 kB | 0.3/1.9 MB
Progress (2): 223 kB | 0.3/1.9 MB
Progress (2): 223 kB | 0.3/1.9 MB
Progress (2): 223 kB | 0.3/1.9 MB
Progress (2): 223 kB | 0.3/1.9 MB
Progress (2): 223 kB | 0.3/1.9 MB
Progress (2): 223 kB | 0.3/1.9 MB
Progress (2): 223 kB | 0.3/1.9 MB
Progress (2): 223 kB | 0.3/1.9 MB
Progress (2): 223 kB | 0.3/1.9 MB
                                 
Downloaded from eclipse.maven.central.mirror: https://repo.eclipse.org/content/repositories/maven_central/org/codehaus/plexus/plexus-utils/2.0.5/plexus-utils-2.0.5.jar (223 kB at 3.3 MB/s)
Progress (1): 0.3/1.9 MB
Progress (1): 0.3/1.9 MB
Progress (1): 0.3/1.9 MB
Progress (1): 0.3/1.9 MB
Progress (1): 0.3/1.9 MB
Progress (1): 0.3/1.9 MB
Progress (1): 0.3/1.9 MB
Progress (1): 0.3/1.9 MB
Progress (1): 0.3/1.9 MB
Progress (1): 0.3/1.9 MB
Progress (1): 0.3/1.9 MB
Progress (1): 0.3/1.9 MB
Progress (1): 0.4/1.9 MB
Progress (1): 0.4/1.9 MB
Progress (1): 0.4/1.9 MB
Progress (1): 0.4/1.9 MB
Progress (1): 0.4/1.9 MB
Progress (1): 0.4/1.9 MB
Progress (1): 0.4/1.9 MB
Progress (1): 0.4/1.9 MB
Progress (1): 0.4/1.9 MB
Progress (1): 0.4/1.9 MB
Progress (1): 0.4/1.9 MB
Progress (1): 0.4/1.9 MB
Progress (1): 0.4/1.9 MB
Progress (1): 0.4/1.9 MB
Progress (1): 0.4/1.9 MB
Progress (1): 0.4/1.9 MB
Progress (1): 0.4/1.9 MB
Progress (1): 0.4/1.9 MB
Progress (1): 0.4/1.9 MB
Progress (1): 0.4/1.9 MB
Progress (1): 0.4/1.9 MB
Progress (1): 0.4/1.9 MB
Progress (1): 0.4/1.9 MB
Progress (1): 0.4/1.9 MB
Progress (1): 0.4/1.9 MB
Progress (1): 0.5/1.9 MB
Progress (1): 0.5/1.9 MB
Progress (1): 0.5/1.9 MB
Progress (1): 0.5/1.9 MB
Progress (1): 0.5/1.9 MB
Progress (1): 0.5/1.9 MB
Progress (1): 0.5/1.9 MB
Progress (1): 0.5/1.9 MB
Progress (1): 0.5/1.9 MB
Progress (1): 0.5/1.9 MB
Progress (1): 0.5/1.9 MB
Progress (1): 0.5/1.9 MB
Progress (1): 0.5/1.9 MB
Progress (1): 0.5/1.9 MB
Progress (1): 0.5/1.9 MB
Progress (1): 0.5/1.9 MB
Progress (1): 0.5/1.9 MB
Progress (1): 0.5/1.9 MB
Progress (1): 0.5/1.9 MB
Progress (1): 0.5/1.9 MB
Progress (1): 0.5/1.9 MB
Progress (1): 0.5/1.9 MB
Progress (1): 0.5/1.9 MB
Progress (1): 0.5/1.9 MB
Progress (1): 0.5/1.9 MB
Progress (1): 0.6/1.9 MB
Progress (1): 0.6/1.9 MB
Progress (1): 0.6/1.9 MB
Progress (1): 0.6/1.9 MB
Progress (1): 0.6/1.9 MB
Progress (1): 0.6/1.9 MB
Progress (1): 0.6/1.9 MB
Progress (1): 0.6/1.9 MB
Progress (1): 0.6/1.9 MB
Progress (1): 0.6/1.9 MB
Progress (1): 0.6/1.9 MB
Progress (1): 0.6/1.9 MB
Progress (1): 0.6/1.9 MB
Progress (1): 0.6/1.9 MB
Progress (1): 0.6/1.9 MB
Progress (1): 0.6/1.9 MB
Progress (1): 0.6/1.9 MB
Progress (1): 0.6/1.9 MB
Progress (1): 0.6/1.9 MB
Progress (1): 0.6/1.9 MB
Progress (1): 0.6/1.9 MB
Progress (1): 0.6/1.9 MB
Progress (1): 0.6/1.9 MB
Progress (1): 0.6/1.9 MB
Progress (1): 0.6/1.9 MB
Progress (1): 0.7/1.9 MB
Progress (1): 0.7/1.9 MB
Progress (1): 0.7/1.9 MB
Progress (1): 0.7/1.9 MB
Progress (1): 0.7/1.9 MB
Progress (1): 0.7/1.9 MB
Progress (1): 0.7/1.9 MB
Progress (1): 0.7/1.9 MB
Progress (1): 0.7/1.9 MB
Progress (1): 0.7/1.9 MB
Progress (1): 0.7/1.9 MB
Progress (1): 0.7/1.9 MB
Progress (1): 0.7/1.9 MB
Progress (1): 0.7/1.9 MB
Progress (1): 0.7/1.9 MB
Progress (1): 0.7/1.9 MB
Progress (1): 0.7/1.9 MB
Progress (1): 0.7/1.9 MB
Progress (1): 0.7/1.9 MB
Progress (1): 0.7/1.9 MB
Progress (1): 0.7/1.9 MB
Progress (1): 0.7/1.9 MB
Progress (1): 0.7/1.9 MB
Progress (1): 0.7/1.9 MB
Progress (1): 0.7/1.9 MB
Progress (1): 0.8/1.9 MB
Progress (1): 0.8/1.9 MB
Progress (1): 0.8/1.9 MB
Progress (1): 0.8/1.9 MB
Progress (1): 0.8/1.9 MB
Progress (1): 0.8/1.9 MB
Progress (1): 0.8/1.9 MB
Progress (1): 0.8/1.9 MB
Progress (1): 0.8/1.9 MB
Progress (1): 0.8/1.9 MB
Progress (1): 0.8/1.9 MB
Progress (1): 0.8/1.9 MB
Progress (1): 0.8/1.9 MB
Progress (1): 0.8/1.9 MB
Progress (1): 0.8/1.9 MB
Progress (1): 0.8/1.9 MB
Progress (1): 0.8/1.9 MB
Progress (1): 0.8/1.9 MB
Progress (1): 0.8/1.9 MB
Progress (1): 0.8/1.9 MB
Progress (1): 0.8/1.9 MB
Progress (1): 0.8/1.9 MB
Progress (1): 0.8/1.9 MB
Progress (1): 0.8/1.9 MB
Progress (1): 0.8/1.9 MB
Progress (1): 0.9/1.9 MB
Progress (1): 0.9/1.9 MB
Progress (1): 0.9/1.9 MB
Progress (1): 0.9/1.9 MB
Progress (1): 0.9/1.9 MB
Progress (1): 0.9/1.9 MB
Progress (1): 0.9/1.9 MB
Progress (1): 0.9/1.9 MB
Progress (1): 0.9/1.9 MB
Progress (1): 0.9/1.9 MB
Progress (1): 0.9/1.9 MB
Progress (1): 0.9/1.9 MB
Progress (1): 0.9/1.9 MB
Progress (1): 0.9/1.9 MB
Progress (1): 0.9/1.9 MB
Progress (1): 0.9/1.9 MB
Progress (1): 0.9/1.9 MB
Progress (1): 0.9/1.9 MB
Progress (1): 0.9/1.9 MB
Progress (1): 0.9/1.9 MB
Progress (1): 0.9/1.9 MB
Progress (1): 0.9/1.9 MB
Progress (1): 0.9/1.9 MB
Progress (1): 0.9/1.9 MB
Progress (1): 0.9/1.9 MB
Progress (1): 1.0/1.9 MB
Progress (1): 1.0/1.9 MB
Progress (1): 1.0/1.9 MB
Progress (1): 1.0/1.9 MB
Progress (1): 1.0/1.9 MB
Progress (1): 1.0/1.9 MB
Progress (1): 1.0/1.9 MB
Progress (1): 1.0/1.9 MB
Progress (1): 1.0/1.9 MB
Progress (1): 1.0/1.9 MB
Progress (1): 1.0/1.9 MB
Progress (1): 1.0/1.9 MB
Progress (1): 1.0/1.9 MB
Progress (1): 1.0/1.9 MB
Progress (1): 1.0/1.9 MB
Progress (1): 1.0/1.9 MB
Progress (1): 1.0/1.9 MB
Progress (1): 1.0/1.9 MB
Progress (1): 1.0/1.9 MB
Progress (1): 1.0/1.9 MB
Progress (1): 1.0/1.9 MB
Progress (1): 1.0/1.9 MB
Progress (1): 1.0/1.9 MB
Progress (1): 1.0/1.9 MB
Progress (1): 1.0/1.9 MB
Progress (1): 1.1/1.9 MB
Progress (1): 1.1/1.9 MB
Progress (1): 1.1/1.9 MB
Progress (1): 1.1/1.9 MB
Progress (1): 1.1/1.9 MB
Progress (1): 1.1/1.9 MB
Progress (1): 1.1/1.9 MB
Progress (1): 1.1/1.9 MB
Progress (1): 1.1/1.9 MB
Progress (1): 1.1/1.9 MB
Progress (1): 1.1/1.9 MB
Progress (1): 1.1/1.9 MB
Progress (1): 1.1/1.9 MB
Progress (1): 1.1/1.9 MB
Progress (1): 1.1/1.9 MB
Progress (1): 1.1/1.9 MB
Progress (1): 1.1/1.9 MB
Progress (1): 1.1/1.9 MB
Progress (1): 1.1/1.9 MB
Progress (1): 1.1/1.9 MB
Progress (1): 1.1/1.9 MB
Progress (1): 1.1/1.9 MB
Progress (1): 1.1/1.9 MB
Progress (1): 1.1/1.9 MB
Progress (1): 1.1/1.9 MB
Progress (1): 1.2/1.9 MB
Progress (1): 1.2/1.9 MB
Progress (1): 1.2/1.9 MB
Progress (1): 1.2/1.9 MB
Progress (1): 1.2/1.9 MB
Progress (1): 1.2/1.9 MB
Progress (1): 1.2/1.9 MB
Progress (1): 1.2/1.9 MB
Progress (1): 1.2/1.9 MB
Progress (1): 1.2/1.9 MB
Progress (1): 1.2/1.9 MB
Progress (1): 1.2/1.9 MB
Progress (1): 1.2/1.9 MB
Progress (1): 1.2/1.9 MB
Progress (1): 1.2/1.9 MB
Progress (1): 1.2/1.9 MB
Progress (1): 1.2/1.9 MB
Progress (1): 1.2/1.9 MB
Progress (1): 1.2/1.9 MB
Progress (1): 1.2/1.9 MB
Progress (1): 1.2/1.9 MB
Progress (1): 1.2/1.9 MB
Progress (1): 1.2/1.9 MB
Progress (1): 1.2/1.9 MB
Progress (1): 1.2/1.9 MB
Progress (1): 1.3/1.9 MB
Progress (1): 1.3/1.9 MB
Progress (1): 1.3/1.9 MB
Progress (1): 1.3/1.9 MB
Progress (1): 1.3/1.9 MB
Progress (1): 1.3/1.9 MB
Progress (1): 1.3/1.9 MB
Progress (1): 1.3/1.9 MB
Progress (1): 1.3/1.9 MB
Progress (1): 1.3/1.9 MB
Progress (1): 1.3/1.9 MB
Progress (1): 1.3/1.9 MB
Progress (1): 1.3/1.9 MB
Progress (1): 1.3/1.9 MB
Progress (1): 1.3/1.9 MB
Progress (1): 1.3/1.9 MB
Progress (1): 1.3/1.9 MB
Progress (1): 1.3/1.9 MB
Progress (1): 1.3/1.9 MB
Progress (1): 1.3/1.9 MB
Progress (1): 1.3/1.9 MB
Progress (1): 1.3/1.9 MB
Progress (1): 1.3/1.9 MB
Progress (1): 1.3/1.9 MB
Progress (1): 1.3/1.9 MB
Progress (1): 1.4/1.9 MB
Progress (1): 1.4/1.9 MB
Progress (1): 1.4/1.9 MB
Progress (1): 1.4/1.9 MB
Progress (1): 1.4/1.9 MB
Progress (1): 1.4/1.9 MB
Progress (1): 1.4/1.9 MB
Progress (1): 1.4/1.9 MB
Progress (1): 1.4/1.9 MB
Progress (1): 1.4/1.9 MB
Progress (1): 1.4/1.9 MB
Progress (1): 1.4/1.9 MB
Progress (1): 1.4/1.9 MB
Progress (1): 1.4/1.9 MB
Progress (1): 1.4/1.9 MB
Progress (1): 1.4/1.9 MB
Progress (1): 1.4/1.9 MB
Progress (1): 1.4/1.9 MB
Progress (1): 1.4/1.9 MB
Progress (1): 1.4/1.9 MB
Progress (1): 1.4/1.9 MB
Progress (1): 1.4/1.9 MB
Progress (1): 1.4/1.9 MB
Progress (1): 1.4/1.9 MB
Progress (1): 1.4/1.9 MB
Progress (1): 1.5/1.9 MB
Progress (1): 1.5/1.9 MB
Progress (1): 1.5/1.9 MB
Progress (1): 1.5/1.9 MB
Progress (1): 1.5/1.9 MB
Progress (1): 1.5/1.9 MB
Progress (1): 1.5/1.9 MB
Progress (1): 1.5/1.9 MB
Progress (1): 1.5/1.9 MB
Progress (1): 1.5/1.9 MB
Progress (1): 1.5/1.9 MB
Progress (1): 1.5/1.9 MB
Progress (1): 1.5/1.9 MB
Progress (1): 1.5/1.9 MB
Progress (1): 1.5/1.9 MB
Progress (1): 1.5/1.9 MB
Progress (1): 1.5/1.9 MB
Progress (1): 1.5/1.9 MB
Progress (1): 1.5/1.9 MB
Progress (1): 1.5/1.9 MB
Progress (1): 1.5/1.9 MB
Progress (1): 1.5/1.9 MB
Progress (1): 1.5/1.9 MB
Progress (1): 1.5/1.9 MB
Progress (1): 1.5/1.9 MB
Progress (1): 1.6/1.9 MB
Progress (1): 1.6/1.9 MB
Progress (1): 1.6/1.9 MB
Progress (1): 1.6/1.9 MB
Progress (1): 1.6/1.9 MB
Progress (1): 1.6/1.9 MB
Progress (1): 1.6/1.9 MB
Progress (1): 1.6/1.9 MB
Progress (1): 1.6/1.9 MB
Progress (1): 1.6/1.9 MB
Progress (1): 1.6/1.9 MB
Progress (1): 1.6/1.9 MB
Progress (1): 1.6/1.9 MB
Progress (1): 1.6/1.9 MB
Progress (1): 1.6/1.9 MB
Progress (1): 1.6/1.9 MB
Progress (1): 1.6/1.9 MB
Progress (1): 1.6/1.9 MB
Progress (1): 1.6/1.9 MB
Progress (1): 1.6/1.9 MB
Progress (1): 1.6/1.9 MB
Progress (1): 1.6/1.9 MB
Progress (1): 1.6/1.9 MB
Progress (1): 1.6/1.9 MB
Progress (1): 1.6/1.9 MB
Progress (1): 1.7/1.9 MB
Progress (1): 1.7/1.9 MB
Progress (1): 1.7/1.9 MB
Progress (1): 1.7/1.9 MB
Progress (1): 1.7/1.9 MB
Progress (1): 1.7/1.9 MB
Progress (1): 1.7/1.9 MB
Progress (1): 1.7/1.9 MB
Progress (1): 1.7/1.9 MB
Progress (1): 1.7/1.9 MB
Progress (1): 1.7/1.9 MB
Progress (1): 1.7/1.9 MB
Progress (1): 1.7/1.9 MB
Progress (1): 1.7/1.9 MB
Progress (1): 1.7/1.9 MB
Progress (1): 1.7/1.9 MB
Progress (1): 1.7/1.9 MB
Progress (1): 1.7/1.9 MB
Progress (1): 1.7/1.9 MB
Progress (1): 1.7/1.9 MB
Progress (1): 1.7/1.9 MB
Progress (1): 1.7/1.9 MB
Progress (1): 1.7/1.9 MB
Progress (1): 1.7/1.9 MB
Progress (1): 1.7/1.9 MB
Progress (1): 1.8/1.9 MB
Progress (1): 1.8/1.9 MB
Progress (1): 1.8/1.9 MB
Progress (1): 1.8/1.9 MB
Progress (1): 1.8/1.9 MB
Progress (1): 1.8/1.9 MB
Progress (1): 1.8/1.9 MB
Progress (1): 1.8/1.9 MB
Progress (1): 1.8/1.9 MB
Progress (1): 1.8/1.9 MB
Progress (1): 1.8/1.9 MB
Progress (1): 1.8/1.9 MB
Progress (1): 1.8/1.9 MB
Progress (1): 1.8/1.9 MB
Progress (1): 1.8/1.9 MB
Progress (1): 1.8/1.9 MB
Progress (1): 1.8/1.9 MB
Progress (1): 1.8/1.9 MB
Progress (1): 1.8/1.9 MB
Progress (1): 1.8/1.9 MB
Progress (1): 1.8/1.9 MB
Progress (1): 1.8/1.9 MB
Progress (1): 1.8/1.9 MB
Progress (1): 1.8/1.9 MB
Progress (1): 1.8/1.9 MB
Progress (1): 1.9/1.9 MB
Progress (1): 1.9/1.9 MB
Progress (1): 1.9/1.9 MB
Progress (1): 1.9/1.9 MB
Progress (1): 1.9/1.9 MB
Progress (1): 1.9/1.9 MB
Progress (1): 1.9/1.9 MB
Progress (1): 1.9/1.9 MB
Progress (1): 1.9/1.9 MB
Progress (1): 1.9/1.9 MB
Progress (1): 1.9/1.9 MB
Progress (1): 1.9/1.9 MB
Progress (1): 1.9/1.9 MB
Progress (1): 1.9/1.9 MB
Progress (1): 1.9/1.9 MB
Progress (1): 1.9/1.9 MB
Progress (1): 1.9/1.9 MB
Progress (1): 1.9/1.9 MB
Progress (1): 1.9/1.9 MB
Progress (1): 1.9/1.9 MB
Progress (1): 1.9/1.9 MB
Progress (1): 1.9 MB    
                    
Downloaded from eclipse.maven.central.mirror: https://repo.eclipse.org/content/repositories/maven_central/org/apache/ant/ant/1.8.2/ant-1.8.2.jar (1.9 MB at 15 MB/s)
[INFO] Executing tasks

main:
      [zip] Updating zip: /jobs/genie.sisu/sisu-sonar/workspace/org.eclipse.sisu.inject.site/target/org.eclipse.sisu.inject.site-0.9.0-SNAPSHOT.zip
[INFO] Executed tasks
[INFO] ------------------------------------------------------------------------
[INFO] Reactor Summary:
[INFO] 
[INFO] Sisu Inject ........................................ SUCCESS [  1.716 s]
[INFO] org.eclipse.sisu.inject ............................ SUCCESS [ 11.271 s]
[INFO] org.eclipse.sisu.inject.extender ................... SUCCESS [  0.892 s]
[INFO] org.eclipse.sisu.inject.tests ...................... SUCCESS [ 32.193 s]
[INFO] org.eclipse.sisu.inject.site ....................... SUCCESS [  1.971 s]
[INFO] ------------------------------------------------------------------------
[INFO] BUILD SUCCESS
[INFO] ------------------------------------------------------------------------
[INFO] Total time: 01:09 min
[INFO] Finished at: 2018-01-19T02:24:19-05:00
[INFO] Final Memory: 68M/2445M
[INFO] ------------------------------------------------------------------------
[workspace] $ mvn -f /home/hudson/genie.sisu/.jenkins/jobs/sisu-sonar/workspace/pom.xml -e -B sonar:sonar -Dmaven.repo.local=/home/hudson/genie.sisu/.jenkins/jobs/sisu-sonar/workspace/.maven/repo "-Dsonar.profile=Sonar way with Findbugs" -Dsonar.dynamicAnalysis=reuseReports -Dsonar.surefire.reportsPath=/home/hudson/genie.sisu/.jenkins/jobs/sisu-sonar/workspace/org.eclipse.sisu.inject.tests/target/surefire-reports -Dsonar.jacoco.reportPath=/home/hudson/genie.sisu/.jenkins/jobs/sisu-sonar/workspace/org.eclipse.sisu.inject.tests/target/jacoco.exec -Dsonar.skippedModules=org.eclipse.sisu.inject.tests -Dsonar.exclusions=**/asm/** -Dhttp.proxyHost=proxy.eclipse.org -Dhttp.proxyPort=9898 -Dhttps.proxyHost=proxy.eclipse.org -Dhttps.proxyPort=9898 -Dhttp.nonProxyHosts=*.eclipse.org -Dhttps.nonProxyHosts=*.eclipse.org -Dsonar.jdbc.url=jdbc:mysql://dbmaster:3306/sonar?autoReconnect=true&useUnicode=true&characterEncoding=utf8 ******** ******** -Dsonar.host.url=https://sonar.eclipse.org
FATAL: command execution failed
java.io.IOException: error=2, No such file or directory
	at java.lang.UNIXProcess.forkAndExec(Native Method)
	at java.lang.UNIXProcess.<init>(UNIXProcess.java:247)
	at java.lang.ProcessImpl.start(ProcessImpl.java:134)
	at java.lang.ProcessBuilder.start(ProcessBuilder.java:1029)
Caused: java.io.IOException: Cannot run program "mvn" (in directory "/home/hudson/genie.sisu/.jenkins/jobs/sisu-sonar/workspace"): error=2, No such file or directory
	at java.lang.ProcessBuilder.start(ProcessBuilder.java:1048)
	at hudson.Proc$LocalProc.<init>(Proc.java:249)
	at hudson.Proc$LocalProc.<init>(Proc.java:218)
	at hudson.Launcher$LocalLauncher.launch(Launcher.java:930)
	at hudson.Launcher$ProcStarter.start(Launcher.java:450)
	at hudson.Launcher$ProcStarter.join(Launcher.java:461)
	at hudson.tasks.Maven.perform(Maven.java:367)
	at hudson.plugins.sonar.utils.SonarMaven.executeMaven(SonarMaven.java:185)
	at hudson.plugins.sonar.SonarPublisher.executeSonar(SonarPublisher.java:370)
	at hudson.plugins.sonar.SonarPublisher.perform(SonarPublisher.java:328)
	at hudson.tasks.BuildStepMonitor$3.perform(BuildStepMonitor.java:45)
	at hudson.model.AbstractBuild$AbstractBuildExecution.perform(AbstractBuild.java:744)
	at hudson.model.AbstractBuild$AbstractBuildExecution.performAllBuildSteps(AbstractBuild.java:690)
	at hudson.model.Build$BuildExecution.post2(Build.java:186)
	at hudson.model.AbstractBuild$AbstractBuildExecution.post(AbstractBuild.java:635)
	at hudson.model.Run.execute(Run.java:1749)
	at hudson.model.FreeStyleBuild.run(FreeStyleBuild.java:43)
	at hudson.model.ResourceController.execute(ResourceController.java:97)
	at hudson.model.Executor.run(Executor.java:421)
SonarQube analysis completed: FAILURE
Build step 'SonarQube analysis with Maven' changed build result to FAILURE
Build step 'SonarQube analysis with Maven' marked build as failure
Started calculate disk usage of build
Finished Calculation of disk usage of build in 0 seconds
Started calculate disk usage of workspace
Finished Calculation of disk usage of workspace in 0 seconds
Finished: FAILURE