Hudson logo

FailedConsole Output

Skipping 119 KB.. Full Log
ec)
Downloaded: https://repo.eclipse.org/content/repositories/maven_central/org/codehaus/plexus/plexus-interpolation/1.19/plexus-interpolation-1.19.jar (0 B at 0.0 KB/sec)
[INFO] Using 'UTF-8' encoding to copy filtered resources.
[INFO] skip non existing resourceDirectory /jobs/genie.sisu/sisu-sonar/workspace/org.eclipse.sisu.inject/src/main/resources
[INFO] 
[INFO] --- tycho-compiler-plugin:0.24.0:compile (default-compile) @ org.eclipse.sisu.inject ---
Downloading: https://repo.eclipse.org/content/repositories/maven_central/org/apache/maven/maven-compat/3.0/maven-compat-3.0.pom
Downloaded: https://repo.eclipse.org/content/repositories/maven_central/org/apache/maven/maven-compat/3.0/maven-compat-3.0.pom (0 B at 0.0 KB/sec)
Downloading: https://repo.eclipse.org/content/repositories/maven_central/org/apache/maven/wagon/wagon-provider-api/1.0-beta-6/wagon-provider-api-1.0-beta-6.pom
Downloaded: https://repo.eclipse.org/content/repositories/maven_central/org/apache/maven/wagon/wagon-provider-api/1.0-beta-6/wagon-provider-api-1.0-beta-6.pom (0 B at 0.0 KB/sec)
Downloading: https://repo.eclipse.org/content/repositories/maven_central/org/apache/maven/wagon/wagon/1.0-beta-6/wagon-1.0-beta-6.pom
Downloaded: https://repo.eclipse.org/content/repositories/maven_central/org/apache/maven/wagon/wagon/1.0-beta-6/wagon-1.0-beta-6.pom (0 B at 0.0 KB/sec)
Downloading: https://repo.eclipse.org/content/repositories/maven_central/org/codehaus/plexus/plexus-compiler-manager/2.2/plexus-compiler-manager-2.2.pom
Downloaded: https://repo.eclipse.org/content/repositories/maven_central/org/codehaus/plexus/plexus-compiler-manager/2.2/plexus-compiler-manager-2.2.pom (0 B at 0.0 KB/sec)
Downloading: https://repo.eclipse.org/content/repositories/maven_central/org/codehaus/plexus/plexus-compiler/2.2/plexus-compiler-2.2.pom
Downloaded: https://repo.eclipse.org/content/repositories/maven_central/org/codehaus/plexus/plexus-compiler/2.2/plexus-compiler-2.2.pom (0 B at 0.0 KB/sec)
Downloading: https://repo.eclipse.org/content/repositories/maven_central/org/codehaus/plexus/plexus-compiler-api/2.2/plexus-compiler-api-2.2.pom
Downloaded: https://repo.eclipse.org/content/repositories/maven_central/org/codehaus/plexus/plexus-compiler-api/2.2/plexus-compiler-api-2.2.pom (0 B at 0.0 KB/sec)
Downloading: https://repo.eclipse.org/content/repositories/maven_central/org/eclipse/tycho/tycho-compiler-jdt/0.24.0/tycho-compiler-jdt-0.24.0.pom
Downloaded: https://repo.eclipse.org/content/repositories/maven_central/org/eclipse/tycho/tycho-compiler-jdt/0.24.0/tycho-compiler-jdt-0.24.0.pom (0 B at 0.0 KB/sec)
Downloading: https://repo.eclipse.org/content/repositories/maven_central/org/eclipse/tycho/org.eclipse.jdt.core/3.11.1.v20150902-1521/org.eclipse.jdt.core-3.11.1.v20150902-1521.pom
Downloaded: https://repo.eclipse.org/content/repositories/maven_central/org/eclipse/tycho/org.eclipse.jdt.core/3.11.1.v20150902-1521/org.eclipse.jdt.core-3.11.1.v20150902-1521.pom (0 B at 0.0 KB/sec)
Downloading: https://repo.eclipse.org/content/repositories/maven_central/org/eclipse/tycho/org.eclipse.jdt.compiler.apt/1.2.0.v20150514-0146/org.eclipse.jdt.compiler.apt-1.2.0.v20150514-0146.pom
Downloaded: https://repo.eclipse.org/content/repositories/maven_central/org/eclipse/tycho/org.eclipse.jdt.compiler.apt/1.2.0.v20150514-0146/org.eclipse.jdt.compiler.apt-1.2.0.v20150514-0146.pom (0 B at 0.0 KB/sec)
Downloading: https://repo.eclipse.org/content/repositories/maven_central/org/codehaus/plexus/plexus-compiler-manager/2.2/plexus-compiler-manager-2.2.jar
Downloading: https://repo.eclipse.org/content/repositories/maven_central/org/codehaus/plexus/plexus-compiler-api/2.2/plexus-compiler-api-2.2.jar
Downloading: https://repo.eclipse.org/content/repositories/maven_central/org/eclipse/tycho/tycho-compiler-jdt/0.24.0/tycho-compiler-jdt-0.24.0.jar
Downloading: https://repo.eclipse.org/content/repositories/maven_central/org/eclipse/tycho/org.eclipse.jdt.core/3.11.1.v20150902-1521/org.eclipse.jdt.core-3.11.1.v20150902-1521.jar
Downloading: https://repo.eclipse.org/content/repositories/maven_central/org/eclipse/tycho/org.eclipse.jdt.compiler.apt/1.2.0.v20150514-0146/org.eclipse.jdt.compiler.apt-1.2.0.v20150514-0146.jar
Downloaded: https://repo.eclipse.org/content/repositories/maven_central/org/codehaus/plexus/plexus-compiler-api/2.2/plexus-compiler-api-2.2.jar (0 B at 0.0 KB/sec)
Downloaded: https://repo.eclipse.org/content/repositories/maven_central/org/codehaus/plexus/plexus-compiler-manager/2.2/plexus-compiler-manager-2.2.jar (0 B at 0.0 KB/sec)
Downloaded: https://repo.eclipse.org/content/repositories/maven_central/org/eclipse/tycho/tycho-compiler-jdt/0.24.0/tycho-compiler-jdt-0.24.0.jar (0 B at 0.0 KB/sec)
Downloaded: https://repo.eclipse.org/content/repositories/maven_central/org/eclipse/tycho/org.eclipse.jdt.core/3.11.1.v20150902-1521/org.eclipse.jdt.core-3.11.1.v20150902-1521.jar (0 B at 0.0 KB/sec)
Downloaded: https://repo.eclipse.org/content/repositories/maven_central/org/eclipse/tycho/org.eclipse.jdt.compiler.apt/1.2.0.v20150514-0146/org.eclipse.jdt.compiler.apt-1.2.0.v20150514-0146.jar (0 B at 0.0 KB/sec)
[INFO] Compiling 168 source files to /jobs/genie.sisu/sisu-sonar/workspace/org.eclipse.sisu.inject/target/classes
[INFO] 
[INFO] --- maven-resources-plugin:2.7:testResources (default-testResources) @ org.eclipse.sisu.inject ---
[INFO] Using 'UTF-8' encoding to copy filtered resources.
[INFO] skip non existing resourceDirectory /jobs/genie.sisu/sisu-sonar/workspace/org.eclipse.sisu.inject/src/test/resources
[INFO] 
[INFO] --- tycho-source-plugin:0.24.0:plugin-source (plugin-source) @ org.eclipse.sisu.inject ---
[WARNING] bundle localization file /jobs/genie.sisu/sisu-sonar/workspace/org.eclipse.sisu.inject/plugin.properties not found
[INFO] Building jar: /jobs/genie.sisu/sisu-sonar/workspace/org.eclipse.sisu.inject/target/org.eclipse.sisu.inject-0.9.0-SNAPSHOT-sources.jar
[INFO] 
[INFO] --- target-platform-configuration:0.24.0:target-platform (default-target-platform) @ org.eclipse.sisu.inject ---
[INFO] 
[INFO] --- tycho-packaging-plugin:0.24.0:package-plugin (default-package-plugin) @ org.eclipse.sisu.inject ---
SLF4J: Failed to load class "org.slf4j.impl.StaticLoggerBinder".
SLF4J: Defaulting to no-operation (NOP) logger implementation
SLF4J: See http://www.slf4j.org/codes.html#StaticLoggerBinder for further details.
[INFO] Building jar: /jobs/genie.sisu/sisu-sonar/workspace/org.eclipse.sisu.inject/target/org.eclipse.sisu.inject-0.9.0-SNAPSHOT.jar
[INFO] 
[INFO] --- tycho-p2-plugin:0.24.0:p2-metadata-default (default-p2-metadata-default) @ org.eclipse.sisu.inject ---
[INFO] 
[INFO] --- animal-sniffer-maven-plugin:1.11:check (check-java6) @ org.eclipse.sisu.inject ---
Downloading: https://repo.eclipse.org/content/repositories/maven_central/org/codehaus/mojo/animal-sniffer/1.11/animal-sniffer-1.11.pom
Downloaded: https://repo.eclipse.org/content/repositories/maven_central/org/codehaus/mojo/animal-sniffer/1.11/animal-sniffer-1.11.pom (0 B at 0.0 KB/sec)
Downloading: https://repo.eclipse.org/content/repositories/maven_central/org/ow2/asm/asm-all/4.0/asm-all-4.0.pom
Downloaded: https://repo.eclipse.org/content/repositories/maven_central/org/ow2/asm/asm-all/4.0/asm-all-4.0.pom (0 B at 0.0 KB/sec)
Downloading: https://repo.eclipse.org/content/repositories/maven_central/org/ow2/asm/asm-parent/4.0/asm-parent-4.0.pom
Downloaded: https://repo.eclipse.org/content/repositories/maven_central/org/ow2/asm/asm-parent/4.0/asm-parent-4.0.pom (0 B at 0.0 KB/sec)
Downloading: https://repo.eclipse.org/content/repositories/maven_central/org/codehaus/mojo/java-boot-classpath-detector/1.11/java-boot-classpath-detector-1.11.pom
Downloaded: https://repo.eclipse.org/content/repositories/maven_central/org/codehaus/mojo/java-boot-classpath-detector/1.11/java-boot-classpath-detector-1.11.pom (0 B at 0.0 KB/sec)
Downloading: https://repo.eclipse.org/content/repositories/maven_central/org/apache/maven/maven-core/2.0.1/maven-core-2.0.1.pom
Downloaded: https://repo.eclipse.org/content/repositories/maven_central/org/apache/maven/maven-core/2.0.1/maven-core-2.0.1.pom (0 B at 0.0 KB/sec)
Downloading: https://repo.eclipse.org/content/repositories/maven_central/org/apache/maven/maven-settings/2.0.1/maven-settings-2.0.1.pom
Downloaded: https://repo.eclipse.org/content/repositories/maven_central/org/apache/maven/maven-settings/2.0.1/maven-settings-2.0.1.pom (0 B at 0.0 KB/sec)
Downloading: https://repo.eclipse.org/content/repositories/maven_central/org/apache/maven/maven-model/2.0.1/maven-model-2.0.1.pom
Downloaded: https://repo.eclipse.org/content/repositories/maven_central/org/apache/maven/maven-model/2.0.1/maven-model-2.0.1.pom (0 B at 0.0 KB/sec)
Downloading: https://repo.eclipse.org/content/repositories/maven_central/org/codehaus/plexus/plexus-utils/1.0.5/plexus-utils-1.0.5.pom
Downloaded: https://repo.eclipse.org/content/repositories/maven_central/org/codehaus/plexus/plexus-utils/1.0.5/plexus-utils-1.0.5.pom (0 B at 0.0 KB/sec)
Downloading: https://repo.eclipse.org/content/repositories/maven_central/org/apache/maven/maven-plugin-parameter-documenter/2.0.1/maven-plugin-parameter-documenter-2.0.1.pom
Downloaded: https://repo.eclipse.org/content/repositories/maven_central/org/apache/maven/maven-plugin-parameter-documenter/2.0.1/maven-plugin-parameter-documenter-2.0.1.pom (0 B at 0.0 KB/sec)
Downloading: https://repo.eclipse.org/content/repositories/maven_central/org/apache/maven/reporting/maven-reporting-api/2.0.1/maven-reporting-api-2.0.1.pom
Downloaded: https://repo.eclipse.org/content/repositories/maven_central/org/apache/maven/reporting/maven-reporting-api/2.0.1/maven-reporting-api-2.0.1.pom (0 B at 0.0 KB/sec)
Downloading: https://repo.eclipse.org/content/repositories/maven_central/org/apache/maven/reporting/maven-reporting/2.0.1/maven-reporting-2.0.1.pom
Downloaded: https://repo.eclipse.org/content/repositories/maven_central/org/apache/maven/reporting/maven-reporting/2.0.1/maven-reporting-2.0.1.pom (0 B at 0.0 KB/sec)
Downloading: https://repo.eclipse.org/content/repositories/maven_central/org/apache/maven/doxia/doxia-sink-api/1.0-alpha-6/doxia-sink-api-1.0-alpha-6.pom
Downloaded: https://repo.eclipse.org/content/repositories/maven_central/org/apache/maven/doxia/doxia-sink-api/1.0-alpha-6/doxia-sink-api-1.0-alpha-6.pom (0 B at 0.0 KB/sec)
Downloading: https://repo.eclipse.org/content/repositories/maven_central/org/apache/maven/doxia/doxia/1.0-alpha-6/doxia-1.0-alpha-6.pom
Downloaded: https://repo.eclipse.org/content/repositories/maven_central/org/apache/maven/doxia/doxia/1.0-alpha-6/doxia-1.0-alpha-6.pom (0 B at 0.0 KB/sec)
Downloading: https://repo.eclipse.org/content/repositories/maven_central/org/apache/maven/maven-profile/2.0.1/maven-profile-2.0.1.pom
Downloaded: https://repo.eclipse.org/content/repositories/maven_central/org/apache/maven/maven-profile/2.0.1/maven-profile-2.0.1.pom (0 B at 0.0 KB/sec)
Downloading: https://repo.eclipse.org/content/repositories/maven_central/org/apache/maven/maven-artifact/2.0.1/maven-artifact-2.0.1.pom
Downloaded: https://repo.eclipse.org/content/repositories/maven_central/org/apache/maven/maven-artifact/2.0.1/maven-artifact-2.0.1.pom (0 B at 0.0 KB/sec)
Downloading: https://repo.eclipse.org/content/repositories/maven_central/org/apache/maven/maven-repository-metadata/2.0.1/maven-repository-metadata-2.0.1.pom
Downloaded: https://repo.eclipse.org/content/repositories/maven_central/org/apache/maven/maven-repository-metadata/2.0.1/maven-repository-metadata-2.0.1.pom (0 B at 0.0 KB/sec)
Downloading: https://repo.eclipse.org/content/repositories/maven_central/org/apache/maven/maven-error-diagnostics/2.0.1/maven-error-diagnostics-2.0.1.pom
Downloaded: https://repo.eclipse.org/content/repositories/maven_central/org/apache/maven/maven-error-diagnostics/2.0.1/maven-error-diagnostics-2.0.1.pom (0 B at 0.0 KB/sec)
Downloading: https://repo.eclipse.org/content/repositories/maven_central/org/apache/maven/maven-project/2.0.1/maven-project-2.0.1.pom
Downloaded: https://repo.eclipse.org/content/repositories/maven_central/org/apache/maven/maven-project/2.0.1/maven-project-2.0.1.pom (0 B at 0.0 KB/sec)
Downloading: https://repo.eclipse.org/content/repositories/maven_central/org/apache/maven/maven-artifact-manager/2.0.1/maven-artifact-manager-2.0.1.pom
Downloaded: https://repo.eclipse.org/content/repositories/maven_central/org/apache/maven/maven-artifact-manager/2.0.1/maven-artifact-manager-2.0.1.pom (0 B at 0.0 KB/sec)
Downloading: https://repo.eclipse.org/content/repositories/maven_central/org/apache/maven/maven-plugin-registry/2.0.1/maven-plugin-registry-2.0.1.pom
Downloaded: https://repo.eclipse.org/content/repositories/maven_central/org/apache/maven/maven-plugin-registry/2.0.1/maven-plugin-registry-2.0.1.pom (0 B at 0.0 KB/sec)
Downloading: https://repo.eclipse.org/content/repositories/maven_central/org/apache/maven/maven-plugin-descriptor/2.0.1/maven-plugin-descriptor-2.0.1.pom
Downloaded: https://repo.eclipse.org/content/repositories/maven_central/org/apache/maven/maven-plugin-descriptor/2.0.1/maven-plugin-descriptor-2.0.1.pom (0 B at 0.0 KB/sec)
Downloading: https://repo.eclipse.org/content/repositories/maven_central/org/apache/maven/maven-monitor/2.0.1/maven-monitor-2.0.1.pom
Downloaded: https://repo.eclipse.org/content/repositories/maven_central/org/apache/maven/maven-monitor/2.0.1/maven-monitor-2.0.1.pom (0 B at 0.0 KB/sec)
Downloading: https://repo.eclipse.org/content/repositories/maven_central/org/apache/maven/maven-toolchain/2.2.1/maven-toolchain-2.2.1.pom
Downloaded: https://repo.eclipse.org/content/repositories/maven_central/org/apache/maven/maven-toolchain/2.2.1/maven-toolchain-2.2.1.pom (0 B at 0.0 KB/sec)
Downloading: https://repo.eclipse.org/content/repositories/maven_central/org/apache/maven/maven-artifact/2.0.8/maven-artifact-2.0.8.pom
Downloaded: https://repo.eclipse.org/content/repositories/maven_central/org/apache/maven/maven-artifact/2.0.8/maven-artifact-2.0.8.pom (0 B at 0.0 KB/sec)
Downloading: https://repo.eclipse.org/content/repositories/maven_central/org/codehaus/plexus/plexus-utils/1.4.6/plexus-utils-1.4.6.pom
Downloaded: https://repo.eclipse.org/content/repositories/maven_central/org/codehaus/plexus/plexus-utils/1.4.6/plexus-utils-1.4.6.pom (0 B at 0.0 KB/sec)
Downloading: https://repo.eclipse.org/content/repositories/maven_central/org/apache/maven/maven-project/2.0.8/maven-project-2.0.8.pom
Downloaded: https://repo.eclipse.org/content/repositories/maven_central/org/apache/maven/maven-project/2.0.8/maven-project-2.0.8.pom (0 B at 0.0 KB/sec)
Downloading: https://repo.eclipse.org/content/repositories/maven_central/org/apache/maven/maven-settings/2.0.8/maven-settings-2.0.8.pom
Downloaded: https://repo.eclipse.org/content/repositories/maven_central/org/apache/maven/maven-settings/2.0.8/maven-settings-2.0.8.pom (0 B at 0.0 KB/sec)
Downloading: https://repo.eclipse.org/content/repositories/maven_central/org/apache/maven/maven-profile/2.0.8/maven-profile-2.0.8.pom
Downloaded: https://repo.eclipse.org/content/repositories/maven_central/org/apache/maven/maven-profile/2.0.8/maven-profile-2.0.8.pom (0 B at 0.0 KB/sec)
Downloading: https://repo.eclipse.org/content/repositories/maven_central/org/apache/maven/maven-artifact-manager/2.0.8/maven-artifact-manager-2.0.8.pom
Downloaded: https://repo.eclipse.org/content/repositories/maven_central/org/apache/maven/maven-artifact-manager/2.0.8/maven-artifact-manager-2.0.8.pom (0 B at 0.0 KB/sec)
Downloading: https://repo.eclipse.org/content/repositories/maven_central/org/apache/maven/maven-repository-metadata/2.0.8/maven-repository-metadata-2.0.8.pom
Downloaded: https://repo.eclipse.org/content/repositories/maven_central/org/apache/maven/maven-repository-metadata/2.0.8/maven-repository-metadata-2.0.8.pom (0 B at 0.0 KB/sec)
Downloading: https://repo.eclipse.org/content/repositories/maven_central/org/apache/maven/maven-plugin-registry/2.0.8/maven-plugin-registry-2.0.8.pom
Downloaded: https://repo.eclipse.org/content/repositories/maven_central/org/apache/maven/maven-plugin-registry/2.0.8/maven-plugin-registry-2.0.8.pom (0 B at 0.0 KB/sec)
Downloading: https://repo.eclipse.org/content/repositories/maven_central/org/codehaus/plexus/plexus-utils/1.4.9/plexus-utils-1.4.9.pom
Downloaded: https://repo.eclipse.org/content/repositories/maven_central/org/codehaus/plexus/plexus-utils/1.4.9/plexus-utils-1.4.9.pom (0 B at 0.0 KB/sec)
Downloading: https://repo.eclipse.org/content/repositories/maven_central/org/apache/maven/maven-project/2.0/maven-project-2.0.pom
Downloaded: https://repo.eclipse.org/content/repositories/maven_central/org/apache/maven/maven-project/2.0/maven-project-2.0.pom (0 B at 0.0 KB/sec)
Downloading: https://repo.eclipse.org/content/repositories/maven_central/org/apache/maven/maven/2.0/maven-2.0.pom
Downloaded: https://repo.eclipse.org/content/repositories/maven_central/org/apache/maven/maven/2.0/maven-2.0.pom (0 B at 0.0 KB/sec)
Downloading: https://repo.eclipse.org/content/repositories/maven_central/org/apache/maven/maven-profile/2.0/maven-profile-2.0.pom
Downloaded: https://repo.eclipse.org/content/repositories/maven_central/org/apache/maven/maven-profile/2.0/maven-profile-2.0.pom (0 B at 0.0 KB/sec)
Downloading: https://repo.eclipse.org/content/repositories/maven_central/org/apache/maven/maven-model/2.0/maven-model-2.0.pom
Downloaded: https://repo.eclipse.org/content/repositories/maven_central/org/apache/maven/maven-model/2.0/maven-model-2.0.pom (0 B at 0.0 KB/sec)
Downloading: https://repo.eclipse.org/content/repositories/maven_central/org/apache/maven/maven-artifact-manager/2.0/maven-artifact-manager-2.0.pom
Downloaded: https://repo.eclipse.org/content/repositories/maven_central/org/apache/maven/maven-artifact-manager/2.0/maven-artifact-manager-2.0.pom (0 B at 0.0 KB/sec)
Downloading: https://repo.eclipse.org/content/repositories/maven_central/org/apache/maven/maven-repository-metadata/2.0/maven-repository-metadata-2.0.pom
Downloaded: https://repo.eclipse.org/content/repositories/maven_central/org/apache/maven/maven-repository-metadata/2.0/maven-repository-metadata-2.0.pom (0 B at 0.0 KB/sec)
Downloading: https://repo.eclipse.org/content/repositories/maven_central/org/apache/maven/maven-artifact/2.0/maven-artifact-2.0.pom
Downloaded: https://repo.eclipse.org/content/repositories/maven_central/org/apache/maven/maven-artifact/2.0/maven-artifact-2.0.pom (0 B at 0.0 KB/sec)
Downloading: https://repo.eclipse.org/content/repositories/maven_central/org/apache/maven/maven-core/2.0/maven-core-2.0.pom
Downloaded: https://repo.eclipse.org/content/repositories/maven_central/org/apache/maven/maven-core/2.0/maven-core-2.0.pom (0 B at 0.0 KB/sec)
Downloading: https://repo.eclipse.org/content/repositories/maven_central/org/apache/maven/maven-settings/2.0/maven-settings-2.0.pom
Downloaded: https://repo.eclipse.org/content/repositories/maven_central/org/apache/maven/maven-settings/2.0/maven-settings-2.0.pom (0 B at 0.0 KB/sec)
Downloading: https://repo.eclipse.org/content/repositories/maven_central/org/apache/maven/maven-plugin-parameter-documenter/2.0/maven-plugin-parameter-documenter-2.0.pom
Downloaded: https://repo.eclipse.org/content/repositories/maven_central/org/apache/maven/maven-plugin-parameter-documenter/2.0/maven-plugin-parameter-documenter-2.0.pom (0 B at 0.0 KB/sec)
Downloading: https://repo.eclipse.org/content/repositories/maven_central/org/apache/maven/reporting/maven-reporting-api/2.0/maven-reporting-api-2.0.pom
Downloaded: https://repo.eclipse.org/content/repositories/maven_central/org/apache/maven/reporting/maven-reporting-api/2.0/maven-reporting-api-2.0.pom (0 B at 0.0 KB/sec)
Downloading: https://repo.eclipse.org/content/repositories/maven_central/org/apache/maven/reporting/maven-reporting/2.0/maven-reporting-2.0.pom
Downloaded: https://repo.eclipse.org/content/repositories/maven_central/org/apache/maven/reporting/maven-reporting/2.0/maven-reporting-2.0.pom (0 B at 0.0 KB/sec)
Downloading: https://repo.eclipse.org/content/repositories/maven_central/doxia/doxia-sink-api/1.0-alpha-4/doxia-sink-api-1.0-alpha-4.pom
Downloaded: https://repo.eclipse.org/content/repositories/maven_central/doxia/doxia-sink-api/1.0-alpha-4/doxia-sink-api-1.0-alpha-4.pom (0 B at 0.0 KB/sec)
Downloading: https://repo.eclipse.org/content/repositories/maven_central/org/apache/maven/maven-error-diagnostics/2.0/maven-error-diagnostics-2.0.pom
Downloaded: https://repo.eclipse.org/content/repositories/maven_central/org/apache/maven/maven-error-diagnostics/2.0/maven-error-diagnostics-2.0.pom (0 B at 0.0 KB/sec)
Downloading: https://repo.eclipse.org/content/repositories/maven_central/org/apache/maven/maven-plugin-registry/2.0/maven-plugin-registry-2.0.pom
Downloaded: https://repo.eclipse.org/content/repositories/maven_central/org/apache/maven/maven-plugin-registry/2.0/maven-plugin-registry-2.0.pom (0 B at 0.0 KB/sec)
Downloading: https://repo.eclipse.org/content/repositories/maven_central/org/apache/maven/maven-plugin-descriptor/2.0/maven-plugin-descriptor-2.0.pom
Downloaded: https://repo.eclipse.org/content/repositories/maven_central/org/apache/maven/maven-plugin-descriptor/2.0/maven-plugin-descriptor-2.0.pom (0 B at 0.0 KB/sec)
Downloading: https://repo.eclipse.org/content/repositories/maven_central/org/apache/maven/maven-monitor/2.0/maven-monitor-2.0.pom
Downloaded: https://repo.eclipse.org/content/repositories/maven_central/org/apache/maven/maven-monitor/2.0/maven-monitor-2.0.pom (0 B at 0.0 KB/sec)
Downloading: https://repo.eclipse.org/content/repositories/maven_central/org/codehaus/plexus/plexus-utils/1.4.2/plexus-utils-1.4.2.pom
Downloaded: https://repo.eclipse.org/content/repositories/maven_central/org/codehaus/plexus/plexus-utils/1.4.2/plexus-utils-1.4.2.pom (0 B at 0.0 KB/sec)
Downloading: https://repo.eclipse.org/content/repositories/maven_central/org/codehaus/plexus/plexus-utils/1.2/plexus-utils-1.2.pom
Downloaded: https://repo.eclipse.org/content/repositories/maven_central/org/codehaus/plexus/plexus-utils/1.2/plexus-utils-1.2.pom (0 B at 0.0 KB/sec)
Downloading: https://repo.eclipse.org/content/repositories/maven_central/org/codehaus/plexus/plexus/1.0.5/plexus-1.0.5.pom
Downloaded: https://repo.eclipse.org/content/repositories/maven_central/org/codehaus/plexus/plexus/1.0.5/plexus-1.0.5.pom (0 B at 0.0 KB/sec)
Downloading: https://repo.eclipse.org/content/repositories/maven_central/org/codehaus/plexus/plexus-utils/1.5.6/plexus-utils-1.5.6.pom
Downloaded: https://repo.eclipse.org/content/repositories/maven_central/org/codehaus/plexus/plexus-utils/1.5.6/plexus-utils-1.5.6.pom (0 B at 0.0 KB/sec)
Downloading: https://repo.eclipse.org/content/repositories/maven_central/org/codehaus/plexus/plexus/1.0.12/plexus-1.0.12.pom
Downloaded: https://repo.eclipse.org/content/repositories/maven_central/org/codehaus/plexus/plexus/1.0.12/plexus-1.0.12.pom (0 B at 0.0 KB/sec)
Downloading: https://repo.eclipse.org/content/repositories/maven_central/org/codehaus/mojo/animal-sniffer/1.11/animal-sniffer-1.11.jar
Downloading: https://repo.eclipse.org/content/repositories/maven_central/org/ow2/asm/asm-all/4.0/asm-all-4.0.jar
Downloading: https://repo.eclipse.org/content/repositories/maven_central/org/codehaus/mojo/java-boot-classpath-detector/1.11/java-boot-classpath-detector-1.11.jar
Downloading: https://repo.eclipse.org/content/repositories/maven_central/org/apache/maven/reporting/maven-reporting-api/2.0.1/maven-reporting-api-2.0.1.jar
Downloading: https://repo.eclipse.org/content/repositories/maven_central/org/apache/maven/doxia/doxia-sink-api/1.0-alpha-6/doxia-sink-api-1.0-alpha-6.jar
Downloaded: https://repo.eclipse.org/content/repositories/maven_central/org/apache/maven/doxia/doxia-sink-api/1.0-alpha-6/doxia-sink-api-1.0-alpha-6.jar (0 B at 0.0 KB/sec)
Downloading: https://repo.eclipse.org/content/repositories/maven_central/org/apache/maven/shared/maven-plugin-testing-harness/1.1/maven-plugin-testing-harness-1.1.jar
Downloaded: https://repo.eclipse.org/content/repositories/maven_central/org/apache/maven/reporting/maven-reporting-api/2.0.1/maven-reporting-api-2.0.1.jar (0 B at 0.0 KB/sec)
Downloading: https://repo.eclipse.org/content/repositories/maven_central/org/codehaus/plexus/plexus-archiver/1.0-alpha-7/plexus-archiver-1.0-alpha-7.jar
Downloaded: https://repo.eclipse.org/content/repositories/maven_central/org/codehaus/mojo/java-boot-classpath-detector/1.11/java-boot-classpath-detector-1.11.jar (0 B at 0.0 KB/sec)
Downloading: https://repo.eclipse.org/content/repositories/maven_central/org/codehaus/plexus/plexus-utils/1.5.6/plexus-utils-1.5.6.jar
Downloaded: https://repo.eclipse.org/content/repositories/maven_central/org/codehaus/plexus/plexus-archiver/1.0-alpha-7/plexus-archiver-1.0-alpha-7.jar (0 B at 0.0 KB/sec)
Downloaded: https://repo.eclipse.org/content/repositories/maven_central/org/codehaus/mojo/animal-sniffer/1.11/animal-sniffer-1.11.jar (0 B at 0.0 KB/sec)
Downloaded: https://repo.eclipse.org/content/repositories/maven_central/org/ow2/asm/asm-all/4.0/asm-all-4.0.jar (0 B at 0.0 KB/sec)
Downloaded: https://repo.eclipse.org/content/repositories/maven_central/org/codehaus/plexus/plexus-utils/1.5.6/plexus-utils-1.5.6.jar (0 B at 0.0 KB/sec)
Downloaded: https://repo.eclipse.org/content/repositories/maven_central/org/apache/maven/shared/maven-plugin-testing-harness/1.1/maven-plugin-testing-harness-1.1.jar (0 B at 0.0 KB/sec)
[INFO] Checking unresolved references to org.codehaus.mojo.signature:java16:1.1
Downloading: https://repo.eclipse.org/content/repositories/maven_central/org/codehaus/mojo/signature/java16/1.1/java16-1.1.signature
Downloaded: https://repo.eclipse.org/content/repositories/maven_central/org/codehaus/mojo/signature/java16/1.1/java16-1.1.signature (0 B at 0.0 KB/sec)
[INFO]                                                                         
[INFO] ------------------------------------------------------------------------
[INFO] Building org.eclipse.sisu.inject.extender 0.9.0-SNAPSHOT
[INFO] ------------------------------------------------------------------------
[INFO] 
[INFO] --- maven-clean-plugin:2.6:clean (default-clean) @ org.eclipse.sisu.inject.extender ---
[INFO] Deleting /jobs/genie.sisu/sisu-sonar/workspace/org.eclipse.sisu.inject.extender/target
[INFO] 
[INFO] --- tycho-packaging-plugin:0.24.0:build-qualifier (default-build-qualifier) @ org.eclipse.sisu.inject.extender ---
[INFO] The project's OSGi version is 0.9.0.201707280401
[INFO] 
[INFO] --- tycho-packaging-plugin:0.24.0:validate-id (default-validate-id) @ org.eclipse.sisu.inject.extender ---
[INFO] 
[INFO] --- tycho-packaging-plugin:0.24.0:validate-version (default-validate-version) @ org.eclipse.sisu.inject.extender ---
[INFO] 
[INFO] --- maven-enforcer-plugin:1.2:enforce (enforce-maven) @ org.eclipse.sisu.inject.extender ---
[INFO] 
[INFO] --- maven-resources-plugin:2.7:resources (default-resources) @ org.eclipse.sisu.inject.extender ---
[INFO] Using 'UTF-8' encoding to copy filtered resources.
[INFO] skip non existing resourceDirectory /jobs/genie.sisu/sisu-sonar/workspace/org.eclipse.sisu.inject.extender/src/main/resources
[INFO] 
[INFO] --- tycho-compiler-plugin:0.24.0:compile (default-compile) @ org.eclipse.sisu.inject.extender ---
[INFO] Nothing to compile - all classes are up to date
[INFO] 
[INFO] --- maven-resources-plugin:2.7:testResources (default-testResources) @ org.eclipse.sisu.inject.extender ---
[INFO] Using 'UTF-8' encoding to copy filtered resources.
[INFO] skip non existing resourceDirectory /jobs/genie.sisu/sisu-sonar/workspace/org.eclipse.sisu.inject.extender/src/test/resources
[INFO] 
[INFO] --- tycho-source-plugin:0.24.0:plugin-source (plugin-source) @ org.eclipse.sisu.inject.extender ---
[WARNING] bundle localization file /jobs/genie.sisu/sisu-sonar/workspace/org.eclipse.sisu.inject.extender/plugin.properties not found
[INFO] Building jar: /jobs/genie.sisu/sisu-sonar/workspace/org.eclipse.sisu.inject.extender/target/org.eclipse.sisu.inject.extender-0.9.0-SNAPSHOT-sources.jar
[INFO] 
[INFO] --- target-platform-configuration:0.24.0:target-platform (default-target-platform) @ org.eclipse.sisu.inject.extender ---
[INFO] 
[INFO] --- tycho-packaging-plugin:0.24.0:package-plugin (default-package-plugin) @ org.eclipse.sisu.inject.extender ---
[INFO] Building jar: /jobs/genie.sisu/sisu-sonar/workspace/org.eclipse.sisu.inject.extender/target/org.eclipse.sisu.inject.extender-0.9.0-SNAPSHOT.jar
[INFO] 
[INFO] --- tycho-p2-plugin:0.24.0:p2-metadata-default (default-p2-metadata-default) @ org.eclipse.sisu.inject.extender ---
[INFO] 
[INFO] --- animal-sniffer-maven-plugin:1.11:check (check-java6) @ org.eclipse.sisu.inject.extender ---
[INFO] Checking unresolved references to org.codehaus.mojo.signature:java16:1.1
[INFO]                                                                         
[INFO] ------------------------------------------------------------------------
[INFO] Building org.eclipse.sisu.inject.tests 0.9.0-SNAPSHOT
[INFO] ------------------------------------------------------------------------
Downloading: https://repo.eclipse.org/content/repositories/maven_central/org/jacoco/jacoco-maven-plugin/0.7.2.201409121644/jacoco-maven-plugin-0.7.2.201409121644.pom
Downloaded: https://repo.eclipse.org/content/repositories/maven_central/org/jacoco/jacoco-maven-plugin/0.7.2.201409121644/jacoco-maven-plugin-0.7.2.201409121644.pom (0 B at 0.0 KB/sec)
Downloading: https://repo.eclipse.org/content/repositories/maven_central/org/jacoco/org.jacoco.build/0.7.2.201409121644/org.jacoco.build-0.7.2.201409121644.pom
Downloaded: https://repo.eclipse.org/content/repositories/maven_central/org/jacoco/org.jacoco.build/0.7.2.201409121644/org.jacoco.build-0.7.2.201409121644.pom (0 B at 0.0 KB/sec)
Downloading: https://repo.eclipse.org/content/repositories/maven_central/org/jacoco/jacoco-maven-plugin/0.7.2.201409121644/jacoco-maven-plugin-0.7.2.201409121644.jar
Downloaded: https://repo.eclipse.org/content/repositories/maven_central/org/jacoco/jacoco-maven-plugin/0.7.2.201409121644/jacoco-maven-plugin-0.7.2.201409121644.jar (0 B at 0.0 KB/sec)
Downloading: https://repo.eclipse.org/content/repositories/maven_central/org/apache/maven/plugins/maven-compiler-plugin/3.1/maven-compiler-plugin-3.1.pom
Downloaded: https://repo.eclipse.org/content/repositories/maven_central/org/apache/maven/plugins/maven-compiler-plugin/3.1/maven-compiler-plugin-3.1.pom (0 B at 0.0 KB/sec)
Downloading: https://repo.eclipse.org/content/repositories/maven_central/org/apache/maven/plugins/maven-plugins/24/maven-plugins-24.pom
Downloaded: https://repo.eclipse.org/content/repositories/maven_central/org/apache/maven/plugins/maven-plugins/24/maven-plugins-24.pom (0 B at 0.0 KB/sec)
Downloading: https://repo.eclipse.org/content/repositories/maven_central/org/apache/maven/plugins/maven-compiler-plugin/3.1/maven-compiler-plugin-3.1.jar
Downloaded: https://repo.eclipse.org/content/repositories/maven_central/org/apache/maven/plugins/maven-compiler-plugin/3.1/maven-compiler-plugin-3.1.jar (0 B at 0.0 KB/sec)
Downloading: https://repo.eclipse.org/content/repositories/maven_central/org/apache/maven/plugins/maven-surefire-plugin/2.17/maven-surefire-plugin-2.17.pom
Downloaded: https://repo.eclipse.org/content/repositories/maven_central/org/apache/maven/plugins/maven-surefire-plugin/2.17/maven-surefire-plugin-2.17.pom (0 B at 0.0 KB/sec)
Downloading: https://repo.eclipse.org/content/repositories/maven_central/org/apache/maven/surefire/surefire/2.17/surefire-2.17.pom
Downloaded: https://repo.eclipse.org/content/repositories/maven_central/org/apache/maven/surefire/surefire/2.17/surefire-2.17.pom (0 B at 0.0 KB/sec)
Downloading: https://repo.eclipse.org/content/repositories/maven_central/org/apache/maven/plugins/maven-surefire-plugin/2.17/maven-surefire-plugin-2.17.jar
Downloaded: https://repo.eclipse.org/content/repositories/maven_central/org/apache/maven/plugins/maven-surefire-plugin/2.17/maven-surefire-plugin-2.17.jar (0 B at 0.0 KB/sec)
Downloading: https://repo.eclipse.org/content/repositories/maven_central/org/apache/maven/plugins/maven-jar-plugin/2.5/maven-jar-plugin-2.5.pom
Downloaded: https://repo.eclipse.org/content/repositories/maven_central/org/apache/maven/plugins/maven-jar-plugin/2.5/maven-jar-plugin-2.5.pom (0 B at 0.0 KB/sec)
Downloading: https://repo.eclipse.org/content/repositories/maven_central/org/apache/maven/plugins/maven-jar-plugin/2.5/maven-jar-plugin-2.5.jar
Downloaded: https://repo.eclipse.org/content/repositories/maven_central/org/apache/maven/plugins/maven-jar-plugin/2.5/maven-jar-plugin-2.5.jar (0 B at 0.0 KB/sec)
Downloading: https://repo.eclipse.org/content/repositories/maven_central/com/google/inject/guice/3.0/guice-3.0.pom
Downloaded: https://repo.eclipse.org/content/repositories/maven_central/com/google/inject/guice/3.0/guice-3.0.pom (0 B at 0.0 KB/sec)
Downloading: https://repo.eclipse.org/content/repositories/maven_central/com/google/inject/guice-parent/3.0/guice-parent-3.0.pom
Downloaded: https://repo.eclipse.org/content/repositories/maven_central/com/google/inject/guice-parent/3.0/guice-parent-3.0.pom (0 B at 0.0 KB/sec)
Downloading: https://repo.eclipse.org/content/repositories/maven_central/javax/annotation/javax.annotation-api/1.2/javax.annotation-api-1.2.pom
Downloaded: https://repo.eclipse.org/content/repositories/maven_central/javax/annotation/javax.annotation-api/1.2/javax.annotation-api-1.2.pom (0 B at 0.0 KB/sec)
Downloading: https://repo.eclipse.org/content/repositories/maven_central/net/java/jvnet-parent/3/jvnet-parent-3.pom
Downloaded: https://repo.eclipse.org/content/repositories/maven_central/net/java/jvnet-parent/3/jvnet-parent-3.pom (0 B at 0.0 KB/sec)
Downloading: https://repo.eclipse.org/content/repositories/maven_central/javax/enterprise/cdi-api/1.0/cdi-api-1.0.pom
Downloaded: https://repo.eclipse.org/content/repositories/maven_central/javax/enterprise/cdi-api/1.0/cdi-api-1.0.pom (0 B at 0.0 KB/sec)
Downloading: https://repo.eclipse.org/content/repositories/maven_central/org/jboss/weld/weld-api-parent/1.0/weld-api-parent-1.0.pom
Downloaded: https://repo.eclipse.org/content/repositories/maven_central/org/jboss/weld/weld-api-parent/1.0/weld-api-parent-1.0.pom (0 B at 0.0 KB/sec)
Downloading: https://repo.eclipse.org/content/repositories/maven_central/org/jboss/weld/weld-api-bom/1.0/weld-api-bom-1.0.pom
Downloaded: https://repo.eclipse.org/content/repositories/maven_central/org/jboss/weld/weld-api-bom/1.0/weld-api-bom-1.0.pom (0 B at 0.0 KB/sec)
Downloading: https://repo.eclipse.org/content/repositories/maven_central/org/jboss/weld/weld-parent/6/weld-parent-6.pom
Downloaded: https://repo.eclipse.org/content/repositories/maven_central/org/jboss/weld/weld-parent/6/weld-parent-6.pom (0 B at 0.0 KB/sec)
Downloading: https://repo.eclipse.org/content/repositories/maven_central/javax/annotation/jsr250-api/1.0/jsr250-api-1.0.pom
Downloaded: https://repo.eclipse.org/content/repositories/maven_central/javax/annotation/jsr250-api/1.0/jsr250-api-1.0.pom (0 B at 0.0 KB/sec)
Downloading: https://repo.eclipse.org/content/repositories/maven_central/org/slf4j/slf4j-api/1.6.4/slf4j-api-1.6.4.pom
Downloaded: https://repo.eclipse.org/content/repositories/maven_central/org/slf4j/slf4j-api/1.6.4/slf4j-api-1.6.4.pom (0 B at 0.0 KB/sec)
Downloading: https://repo.eclipse.org/content/repositories/maven_central/org/slf4j/slf4j-parent/1.6.4/slf4j-parent-1.6.4.pom
Downloaded: https://repo.eclipse.org/content/repositories/maven_central/org/slf4j/slf4j-parent/1.6.4/slf4j-parent-1.6.4.pom (0 B at 0.0 KB/sec)
Downloading: https://repo.eclipse.org/content/repositories/maven_central/ch/qos/logback/logback-classic/1.0.7/logback-classic-1.0.7.pom
Downloaded: https://repo.eclipse.org/content/repositories/maven_central/ch/qos/logback/logback-classic/1.0.7/logback-classic-1.0.7.pom (0 B at 0.0 KB/sec)
Downloading: https://repo.eclipse.org/content/repositories/maven_central/ch/qos/logback/logback-parent/1.0.7/logback-parent-1.0.7.pom
Downloaded: https://repo.eclipse.org/content/repositories/maven_central/ch/qos/logback/logback-parent/1.0.7/logback-parent-1.0.7.pom (0 B at 0.0 KB/sec)
Downloading: https://repo.eclipse.org/content/repositories/maven_central/ch/qos/logback/logback-core/1.0.7/logback-core-1.0.7.pom
Downloaded: https://repo.eclipse.org/content/repositories/maven_central/ch/qos/logback/logback-core/1.0.7/logback-core-1.0.7.pom (0 B at 0.0 KB/sec)
Downloading: https://repo.eclipse.org/content/repositories/maven_central/org/slf4j/slf4j-api/1.6.6/slf4j-api-1.6.6.pom
Downloaded: https://repo.eclipse.org/content/repositories/maven_central/org/slf4j/slf4j-api/1.6.6/slf4j-api-1.6.6.pom (0 B at 0.0 KB/sec)
Downloading: https://repo.eclipse.org/content/repositories/maven_central/org/slf4j/slf4j-parent/1.6.6/slf4j-parent-1.6.6.pom
Downloaded: https://repo.eclipse.org/content/repositories/maven_central/org/slf4j/slf4j-parent/1.6.6/slf4j-parent-1.6.6.pom (0 B at 0.0 KB/sec)
Downloading: https://repo.eclipse.org/content/repositories/maven_central/com/google/inject/extensions/guice-assistedinject/3.0/guice-assistedinject-3.0.pom
Downloaded: https://repo.eclipse.org/content/repositories/maven_central/com/google/inject/extensions/guice-assistedinject/3.0/guice-assistedinject-3.0.pom (0 B at 0.0 KB/sec)
Downloading: https://repo.eclipse.org/content/repositories/maven_central/com/google/inject/extensions/extensions-parent/3.0/extensions-parent-3.0.pom
Downloaded: https://repo.eclipse.org/content/repositories/maven_central/com/google/inject/extensions/extensions-parent/3.0/extensions-parent-3.0.pom (0 B at 0.0 KB/sec)
Downloading: https://repo.eclipse.org/content/repositories/maven_central/org/osgi/org.osgi.core/4.2.0/org.osgi.core-4.2.0.pom
Downloaded: https://repo.eclipse.org/content/repositories/maven_central/org/osgi/org.osgi.core/4.2.0/org.osgi.core-4.2.0.pom (0 B at 0.0 KB/sec)
Downloading: https://repo.eclipse.org/content/repositories/maven_central/org/apache/felix/org.apache.felix.framework/4.2.1/org.apache.felix.framework-4.2.1.pom
Downloaded: https://repo.eclipse.org/content/repositories/maven_central/org/apache/felix/org.apache.felix.framework/4.2.1/org.apache.felix.framework-4.2.1.pom (0 B at 0.0 KB/sec)
Downloading: https://repo.eclipse.org/content/repositories/maven_central/org/apache/felix/felix-parent/2.1/felix-parent-2.1.pom
Downloaded: https://repo.eclipse.org/content/repositories/maven_central/org/apache/felix/felix-parent/2.1/felix-parent-2.1.pom (0 B at 0.0 KB/sec)
Downloading: https://repo.eclipse.org/content/repositories/maven_central/com/google/inject/guice/3.0/guice-3.0.jar
Downloading: https://repo.eclipse.org/content/repositories/maven_central/javax/annotation/javax.annotation-api/1.2/javax.annotation-api-1.2.jar
Downloading: https://repo.eclipse.org/content/repositories/maven_central/javax/enterprise/cdi-api/1.0/cdi-api-1.0.jar
Downloading: https://repo.eclipse.org/content/repositories/maven_central/javax/annotation/jsr250-api/1.0/jsr250-api-1.0.jar
Downloading: https://repo.eclipse.org/content/repositories/maven_central/org/slf4j/slf4j-api/1.6.4/slf4j-api-1.6.4.jar
Downloaded: https://repo.eclipse.org/content/repositories/maven_central/com/google/inject/guice/3.0/guice-3.0.jar (0 B at 0.0 KB/sec)
Downloading: https://repo.eclipse.org/content/repositories/maven_central/junit/junit/4.11/junit-4.11.jar
Downloaded: https://repo.eclipse.org/content/repositories/maven_central/org/slf4j/slf4j-api/1.6.4/slf4j-api-1.6.4.jar (0 B at 0.0 KB/sec)
Downloading: https://repo.eclipse.org/content/repositories/maven_central/org/hamcrest/hamcrest-core/1.3/hamcrest-core-1.3.jar
Downloaded: https://repo.eclipse.org/content/repositories/maven_central/javax/annotation/jsr250-api/1.0/jsr250-api-1.0.jar (0 B at 0.0 KB/sec)
Downloading: https://repo.eclipse.org/content/repositories/maven_central/ch/qos/logback/logback-classic/1.0.7/logback-classic-1.0.7.jar
Downloaded: https://repo.eclipse.org/content/repositories/maven_central/javax/enterprise/cdi-api/1.0/cdi-api-1.0.jar (0 B at 0.0 KB/sec)
Downloading: https://repo.eclipse.org/content/repositories/maven_central/ch/qos/logback/logback-core/1.0.7/logback-core-1.0.7.jar
Downloaded: https://repo.eclipse.org/content/repositories/maven_central/junit/junit/4.11/junit-4.11.jar (0 B at 0.0 KB/sec)
Downloading: https://repo.eclipse.org/content/repositories/maven_central/com/google/inject/extensions/guice-assistedinject/3.0/guice-assistedinject-3.0.jar
Downloaded: https://repo.eclipse.org/content/repositories/maven_central/javax/annotation/javax.annotation-api/1.2/javax.annotation-api-1.2.jar (0 B at 0.0 KB/sec)
Downloading: https://repo.eclipse.org/content/repositories/maven_central/org/osgi/org.osgi.core/4.2.0/org.osgi.core-4.2.0.jar
Downloaded: https://repo.eclipse.org/content/repositories/maven_central/org/hamcrest/hamcrest-core/1.3/hamcrest-core-1.3.jar (0 B at 0.0 KB/sec)
Downloading: https://repo.eclipse.org/content/repositories/maven_central/org/apache/felix/org.apache.felix.framework/4.2.1/org.apache.felix.framework-4.2.1.jar
Downloaded: https://repo.eclipse.org/content/repositories/maven_central/ch/qos/logback/logback-core/1.0.7/logback-core-1.0.7.jar (0 B at 0.0 KB/sec)
Downloaded: https://repo.eclipse.org/content/repositories/maven_central/ch/qos/logback/logback-classic/1.0.7/logback-classic-1.0.7.jar (0 B at 0.0 KB/sec)
Downloaded: https://repo.eclipse.org/content/repositories/maven_central/com/google/inject/extensions/guice-assistedinject/3.0/guice-assistedinject-3.0.jar (0 B at 0.0 KB/sec)
Downloaded: https://repo.eclipse.org/content/repositories/maven_central/org/apache/felix/org.apache.felix.framework/4.2.1/org.apache.felix.framework-4.2.1.jar (0 B at 0.0 KB/sec)
Downloaded: https://repo.eclipse.org/content/repositories/maven_central/org/osgi/org.osgi.core/4.2.0/org.osgi.core-4.2.0.jar (0 B at 0.0 KB/sec)
[INFO] 
[INFO] --- maven-clean-plugin:2.6:clean (default-clean) @ org.eclipse.sisu.inject.tests ---
[INFO] Deleting /jobs/genie.sisu/sisu-sonar/workspace/org.eclipse.sisu.inject.tests/target
[INFO] 
[INFO] --- maven-enforcer-plugin:1.2:enforce (enforce-maven) @ org.eclipse.sisu.inject.tests ---
Downloading: https://repo.eclipse.org/content/repositories/maven_central/org/slf4j/slf4j-api/1.6.6/slf4j-api-1.6.6.jar
Downloaded: https://repo.eclipse.org/content/repositories/maven_central/org/slf4j/slf4j-api/1.6.6/slf4j-api-1.6.6.jar (0 B at 0.0 KB/sec)
[INFO] 
[INFO] --- jacoco-maven-plugin:0.7.2.201409121644:prepare-agent (default) @ org.eclipse.sisu.inject.tests ---
Downloading: https://repo.eclipse.org/content/repositories/maven_central/junit/junit/4.8.2/junit-4.8.2.pom
Downloaded: https://repo.eclipse.org/content/repositories/maven_central/junit/junit/4.8.2/junit-4.8.2.pom (0 B at 0.0 KB/sec)
Downloading: https://repo.eclipse.org/content/repositories/maven_central/org/apache/maven/shared/file-management/1.2.1/file-management-1.2.1.pom
Downloaded: https://repo.eclipse.org/content/repositories/maven_central/org/apache/maven/shared/file-management/1.2.1/file-management-1.2.1.pom (0 B at 0.0 KB/sec)
Downloading: https://repo.eclipse.org/content/repositories/maven_central/org/apache/maven/shared/maven-shared-components/10/maven-shared-components-10.pom
Downloaded: https://repo.eclipse.org/content/repositories/maven_central/org/apache/maven/shared/maven-shared-components/10/maven-shared-components-10.pom (0 B at 0.0 KB/sec)
Downloading: https://repo.eclipse.org/content/repositories/maven_central/org/apache/maven/maven-parent/9/maven-parent-9.pom
Downloaded: https://repo.eclipse.org/content/repositories/maven_central/org/apache/maven/maven-parent/9/maven-parent-9.pom (0 B at 0.0 KB/sec)
Downloading: https://repo.eclipse.org/content/repositories/maven_central/org/apache/maven/shared/maven-shared-io/1.1/maven-shared-io-1.1.pom
Downloaded: https://repo.eclipse.org/content/repositories/maven_central/org/apache/maven/shared/maven-shared-io/1.1/maven-shared-io-1.1.pom (0 B at 0.0 KB/sec)
Downloading: https://repo.eclipse.org/content/repositories/maven_central/org/apache/maven/shared/maven-shared-components/8/maven-shared-components-8.pom
Downloaded: https://repo.eclipse.org/content/repositories/maven_central/org/apache/maven/shared/maven-shared-components/8/maven-shared-components-8.pom (0 B at 0.0 KB/sec)
Downloading: https://repo.eclipse.org/content/repositories/maven_central/org/apache/maven/maven-parent/7/maven-parent-7.pom
Downloaded: https://repo.eclipse.org/content/repositories/maven_central/org/apache/maven/maven-parent/7/maven-parent-7.pom (0 B at 0.0 KB/sec)
Downloading: https://repo.eclipse.org/content/repositories/maven_central/org/apache/maven/maven-artifact/2.0.2/maven-artifact-2.0.2.pom
Downloaded: https://repo.eclipse.org/content/repositories/maven_central/org/apache/maven/maven-artifact/2.0.2/maven-artifact-2.0.2.pom (0 B at 0.0 KB/sec)
Downloading: https://repo.eclipse.org/content/repositories/maven_central/org/apache/maven/maven/2.0.2/maven-2.0.2.pom
Downloaded: https://repo.eclipse.org/content/repositories/maven_central/org/apache/maven/maven/2.0.2/maven-2.0.2.pom (0 B at 0.0 KB/sec)
Downloading: https://repo.eclipse.org/content/repositories/maven_central/org/codehaus/plexus/plexus-utils/1.1/plexus-utils-1.1.pom
Downloaded: https://repo.eclipse.org/content/repositories/maven_central/org/codehaus/plexus/plexus-utils/1.1/plexus-utils-1.1.pom (0 B at 0.0 KB/sec)
Downloading: https://repo.eclipse.org/content/repositories/maven_central/org/apache/maven/maven-artifact-manager/2.0.2/maven-artifact-manager-2.0.2.pom
Downloaded: https://repo.eclipse.org/content/repositories/maven_central/org/apache/maven/maven-artifact-manager/2.0.2/maven-artifact-manager-2.0.2.pom (0 B at 0.0 KB/sec)
Downloading: https://repo.eclipse.org/content/repositories/maven_central/org/apache/maven/maven-repository-metadata/2.0.2/maven-repository-metadata-2.0.2.pom
Downloaded: https://repo.eclipse.org/content/repositories/maven_central/org/apache/maven/maven-repository-metadata/2.0.2/maven-repository-metadata-2.0.2.pom (0 B at 0.0 KB/sec)
Downloading: https://repo.eclipse.org/content/repositories/maven_central/org/apache/maven/wagon/wagon-provider-api/1.0-alpha-6/wagon-provider-api-1.0-alpha-6.pom
Downloaded: https://repo.eclipse.org/content/repositories/maven_central/org/apache/maven/wagon/wagon-provider-api/1.0-alpha-6/wagon-provider-api-1.0-alpha-6.pom (0 B at 0.0 KB/sec)
Downloading: https://repo.eclipse.org/content/repositories/maven_central/org/apache/maven/wagon/wagon/1.0-alpha-6/wagon-1.0-alpha-6.pom
Downloaded: https://repo.eclipse.org/content/repositories/maven_central/org/apache/maven/wagon/wagon/1.0-alpha-6/wagon-1.0-alpha-6.pom (0 B at 0.0 KB/sec)
Downloading: https://repo.eclipse.org/content/repositories/maven_central/org/apache/maven/reporting/maven-reporting-impl/2.1/maven-reporting-impl-2.1.pom
Downloaded: https://repo.eclipse.org/content/repositories/maven_central/org/apache/maven/reporting/maven-reporting-impl/2.1/maven-reporting-impl-2.1.pom (0 B at 0.0 KB/sec)
Downloading: https://repo.eclipse.org/content/repositories/maven_central/org/apache/maven/shared/maven-shared-components/15/maven-shared-components-15.pom
Downloaded: https://repo.eclipse.org/content/repositories/maven_central/org/apache/maven/shared/maven-shared-components/15/maven-shared-components-15.pom (0 B at 0.0 KB/sec)
Downloading: https://repo.eclipse.org/content/repositories/maven_central/org/apache/maven/maven-parent/16/maven-parent-16.pom
Downloaded: https://repo.eclipse.org/content/repositories/maven_central/org/apache/maven/maven-parent/16/maven-parent-16.pom (0 B at 0.0 KB/sec)
Downloading: https://repo.eclipse.org/content/repositories/maven_central/org/apache/apache/7/apache-7.pom
Downloaded: https://repo.eclipse.org/content/repositories/maven_central/org/apache/apache/7/apache-7.pom (0 B at 0.0 KB/sec)
Downloading: https://repo.eclipse.org/content/repositories/maven_central/org/apache/maven/reporting/maven-reporting-api/3.0/maven-reporting-api-3.0.pom
Downloaded: https://repo.eclipse.org/content/repositories/maven_central/org/apache/maven/reporting/maven-reporting-api/3.0/maven-reporting-api-3.0.pom (0 B at 0.0 KB/sec)
Downloading: https://repo.eclipse.org/content/repositories/maven_central/org/apache/maven/doxia/doxia-sink-api/1.0/doxia-sink-api-1.0.pom
Downloaded: https://repo.eclipse.org/content/repositories/maven_central/org/apache/maven/doxia/doxia-sink-api/1.0/doxia-sink-api-1.0.pom (0 B at 0.0 KB/sec)
Downloading: https://repo.eclipse.org/content/repositories/maven_central/org/apache/maven/doxia/doxia/1.0/doxia-1.0.pom
Downloaded: https://repo.eclipse.org/content/repositories/maven_central/org/apache/maven/doxia/doxia/1.0/doxia-1.0.pom (0 B at 0.0 KB/sec)
Downloading: https://repo.eclipse.org/content/repositories/maven_central/org/apache/maven/maven-parent/10/maven-parent-10.pom
Downloaded: https://repo.eclipse.org/content/repositories/maven_central/org/apache/maven/maven-parent/10/maven-parent-10.pom (0 B at 0.0 KB/sec)
Downloading: https://repo.eclipse.org/content/repositories/maven_central/org/apache/maven/maven-project/2.0.10/maven-project-2.0.10.pom
Downloaded: https://repo.eclipse.org/content/repositories/maven_central/org/apache/maven/maven-project/2.0.10/maven-project-2.0.10.pom (0 B at 0.0 KB/sec)
Downloading: https://repo.eclipse.org/content/repositories/maven_central/org/apache/maven/maven/2.0.10/maven-2.0.10.pom
Downloaded: https://repo.eclipse.org/content/repositories/maven_central/org/apache/maven/maven/2.0.10/maven-2.0.10.pom (0 B at 0.0 KB/sec)
Downloading: https://repo.eclipse.org/content/repositories/maven_central/org/apache/maven/maven-settings/2.0.10/maven-settings-2.0.10.pom
Downloaded: https://repo.eclipse.org/content/repositories/maven_central/org/apache/maven/maven-settings/2.0.10/maven-settings-2.0.10.pom (0 B at 0.0 KB/sec)
Downloading: https://repo.eclipse.org/content/repositories/maven_central/org/apache/maven/maven-model/2.0.10/maven-model-2.0.10.pom
Downloaded: https://repo.eclipse.org/content/repositories/maven_central/org/apache/maven/maven-model/2.0.10/maven-model-2.0.10.pom (0 B at 0.0 KB/sec)
Downloading: https://repo.eclipse.org/content/repositories/maven_central/org/codehaus/plexus/plexus-interpolation/1.1/plexus-interpolation-1.1.pom
Downloaded: https://repo.eclipse.org/content/repositories/maven_central/org/codehaus/plexus/plexus-interpolation/1.1/plexus-interpolation-1.1.pom (0 B at 0.0 KB/sec)
Downloading: https://repo.eclipse.org/content/repositories/maven_central/org/apache/maven/maven-profile/2.0.10/maven-profile-2.0.10.pom
Downloaded: https://repo.eclipse.org/content/repositories/maven_central/org/apache/maven/maven-profile/2.0.10/maven-profile-2.0.10.pom (0 B at 0.0 KB/sec)
Downloading: https://repo.eclipse.org/content/repositories/maven_central/org/apache/maven/maven-artifact-manager/2.0.10/maven-artifact-manager-2.0.10.pom
Downloaded: https://repo.eclipse.org/content/repositories/maven_central/org/apache/maven/maven-artifact-manager/2.0.10/maven-artifact-manager-2.0.10.pom (0 B at 0.0 KB/sec)
Downloading: https://repo.eclipse.org/content/repositories/maven_central/org/apache/maven/maven-repository-metadata/2.0.10/maven-repository-metadata-2.0.10.pom
Downloaded: https://repo.eclipse.org/content/repositories/maven_central/org/apache/maven/maven-repository-metadata/2.0.10/maven-repository-metadata-2.0.10.pom (0 B at 0.0 KB/sec)
Downloading: https://repo.eclipse.org/content/repositories/maven_central/org/apache/maven/maven-artifact/2.0.10/maven-artifact-2.0.10.pom
Downloaded: https://repo.eclipse.org/content/repositories/maven_central/org/apache/maven/maven-artifact/2.0.10/maven-artifact-2.0.10.pom (0 B at 0.0 KB/sec)
Downloading: https://repo.eclipse.org/content/repositories/maven_central/org/apache/maven/maven-plugin-registry/2.0.10/maven-plugin-registry-2.0.10.pom
Downloaded: https://repo.eclipse.org/content/repositories/maven_central/org/apache/maven/maven-plugin-registry/2.0.10/maven-plugin-registry-2.0.10.pom (0 B at 0.0 KB/sec)
Downloading: https://repo.eclipse.org/content/repositories/maven_central/org/apache/maven/maven-plugin-api/2.0.10/maven-plugin-api-2.0.10.pom
Downloaded: https://repo.eclipse.org/content/repositories/maven_central/org/apache/maven/maven-plugin-api/2.0.10/maven-plugin-api-2.0.10.pom (0 B at 0.0 KB/sec)
Downloading: https://repo.eclipse.org/content/repositories/maven_central/org/apache/maven/doxia/doxia-sink-api/1.1.2/doxia-sink-api-1.1.2.pom
Downloaded: https://repo.eclipse.org/content/repositories/maven_central/org/apache/maven/doxia/doxia-sink-api/1.1.2/doxia-sink-api-1.1.2.pom (0 B at 0.0 KB/sec)
Downloading: https://repo.eclipse.org/content/repositories/maven_central/org/apache/maven/doxia/doxia/1.1.2/doxia-1.1.2.pom
Downloaded: https://repo.eclipse.org/content/repositories/maven_central/org/apache/maven/doxia/doxia/1.1.2/doxia-1.1.2.pom (0 B at 0.0 KB/sec)
Downloading: https://repo.eclipse.org/content/repositories/maven_central/org/apache/maven/doxia/doxia-logging-api/1.1.2/doxia-logging-api-1.1.2.pom
Downloaded: https://repo.eclipse.org/content/repositories/maven_central/org/apache/maven/doxia/doxia-logging-api/1.1.2/doxia-logging-api-1.1.2.pom (0 B at 0.0 KB/sec)
Downloading: https://repo.eclipse.org/content/repositories/maven_central/org/apache/maven/doxia/doxia-core/1.1.2/doxia-core-1.1.2.pom
Downloaded: https://repo.eclipse.org/content/repositories/maven_central/org/apache/maven/doxia/doxia-core/1.1.2/doxia-core-1.1.2.pom (0 B at 0.0 KB/sec)
Downloading: https://repo.eclipse.org/content/repositories/maven_central/org/codehaus/plexus/plexus-utils/1.5.12/plexus-utils-1.5.12.pom
Downloaded: https://repo.eclipse.org/content/repositories/maven_central/org/codehaus/plexus/plexus-utils/1.5.12/plexus-utils-1.5.12.pom (0 B at 0.0 KB/sec)
Downloading: https://repo.eclipse.org/content/repositories/maven_central/xerces/xercesImpl/2.8.1/xercesImpl-2.8.1.pom
Downloaded: https://repo.eclipse.org/content/repositories/maven_central/xerces/xercesImpl/2.8.1/xercesImpl-2.8.1.pom (0 B at 0.0 KB/sec)
Downloading: https://repo.eclipse.org/content/repositories/maven_central/xml-apis/xml-apis/1.3.03/xml-apis-1.3.03.pom
Downloaded: https://repo.eclipse.org/content/repositories/maven_central/xml-apis/xml-apis/1.3.03/xml-apis-1.3.03.pom (0 B at 0.0 KB/sec)
Downloading: https://repo.eclipse.org/content/repositories/maven_central/org/apache/apache/1/apache-1.pom
Downloaded: https://repo.eclipse.org/content/repositories/maven_central/org/apache/apache/1/apache-1.pom (0 B at 0.0 KB/sec)
Downloading: https://repo.eclipse.org/content/repositories/maven_central/commons-lang/commons-lang/2.4/commons-lang-2.4.pom
Downloaded: https://repo.eclipse.org/content/repositories/maven_central/commons-lang/commons-lang/2.4/commons-lang-2.4.pom (0 B at 0.0 KB/sec)
Downloading: https://repo.eclipse.org/content/repositories/maven_central/org/apache/commons/commons-parent/9/commons-parent-9.pom
Downloaded: https://repo.eclipse.org/content/repositories/maven_central/org/apache/commons/commons-parent/9/commons-parent-9.pom (0 B at 0.0 KB/sec)
Downloading: https://repo.eclipse.org/content/repositories/maven_central/commons-httpclient/commons-httpclient/3.1/commons-httpclient-3.1.pom
Downloaded: https://repo.eclipse.org/content/repositories/maven_central/commons-httpclient/commons-httpclient/3.1/commons-httpclient-3.1.pom (0 B at 0.0 KB/sec)
Downloading: https://repo.eclipse.org/content/repositories/maven_central/commons-logging/commons-logging/1.0.4/commons-logging-1.0.4.pom
Downloaded: https://repo.eclipse.org/content/repositories/maven_central/commons-logging/commons-logging/1.0.4/commons-logging-1.0.4.pom (0 B at 0.0 KB/sec)
Downloading: https://repo.eclipse.org/content/repositories/maven_central/commons-codec/commons-codec/1.2/commons-codec-1.2.pom
Downloaded: https://repo.eclipse.org/content/repositories/maven_central/commons-codec/commons-codec/1.2/commons-codec-1.2.pom (0 B at 0.0 KB/sec)
Downloading: https://repo.eclipse.org/content/repositories/maven_central/org/apache/maven/doxia/doxia-site-renderer/1.1.2/doxia-site-renderer-1.1.2.pom
Downloaded: https://repo.eclipse.org/content/repositories/maven_central/org/apache/maven/doxia/doxia-site-renderer/1.1.2/doxia-site-renderer-1.1.2.pom (0 B at 0.0 KB/sec)
Downloading: https://repo.eclipse.org/content/repositories/maven_central/org/apache/maven/doxia/doxia-sitetools/1.1.2/doxia-sitetools-1.1.2.pom
Downloaded: https://repo.eclipse.org/content/repositories/maven_central/org/apache/maven/doxia/doxia-sitetools/1.1.2/doxia-sitetools-1.1.2.pom (0 B at 0.0 KB/sec)
Downloading: https://repo.eclipse.org/content/repositories/maven_central/org/apache/maven/doxia/doxia-decoration-model/1.1.2/doxia-decoration-model-1.1.2.pom
Downloaded: https://repo.eclipse.org/content/repositories/maven_central/org/apache/maven/doxia/doxia-decoration-model/1.1.2/doxia-decoration-model-1.1.2.pom (0 B at 0.0 KB/sec)
Downloading: https://repo.eclipse.org/content/repositories/maven_central/org/apache/maven/doxia/doxia-module-xhtml/1.1.2/doxia-module-xhtml-1.1.2.pom
Downloaded: https://repo.eclipse.org/content/repositories/maven_central/org/apache/maven/doxia/doxia-module-xhtml/1.1.2/doxia-module-xhtml-1.1.2.pom (0 B at 0.0 KB/sec)
Downloading: https://repo.eclipse.org/content/repositories/maven_central/org/apache/maven/doxia/doxia-modules/1.1.2/doxia-modules-1.1.2.pom
Downloaded: https://repo.eclipse.org/content/repositories/maven_central/org/apache/maven/doxia/doxia-modules/1.1.2/doxia-modules-1.1.2.pom (0 B at 0.0 KB/sec)
Downloading: https://repo.eclipse.org/content/repositories/maven_central/org/apache/maven/doxia/doxia-module-fml/1.1.2/doxia-module-fml-1.1.2.pom
Downloaded: https://repo.eclipse.org/content/repositories/maven_central/org/apache/maven/doxia/doxia-module-fml/1.1.2/doxia-module-fml-1.1.2.pom (0 B at 0.0 KB/sec)
Downloading: https://repo.eclipse.org/content/repositories/maven_central/org/codehaus/plexus/plexus-i18n/1.0-beta-7/plexus-i18n-1.0-beta-7.pom
Downloaded: https://repo.eclipse.org/content/repositories/maven_central/org/codehaus/plexus/plexus-i18n/1.0-beta-7/plexus-i18n-1.0-beta-7.pom (0 B at 0.0 KB/sec)
Downloading: https://repo.eclipse.org/content/repositories/maven_central/org/codehaus/plexus/plexus-components/1.1.12/plexus-components-1.1.12.pom
Downloaded: https://repo.eclipse.org/content/repositories/maven_central/org/codehaus/plexus/plexus-components/1.1.12/plexus-components-1.1.12.pom (0 B at 0.0 KB/sec)
Downloading: https://repo.eclipse.org/content/repositories/maven_central/org/codehaus/plexus/plexus-velocity/1.1.7/plexus-velocity-1.1.7.pom
Downloaded: https://repo.eclipse.org/content/repositories/maven_central/org/codehaus/plexus/plexus-velocity/1.1.7/plexus-velocity-1.1.7.pom (0 B at 0.0 KB/sec)
Downloading: https://repo.eclipse.org/content/repositories/maven_central/org/codehaus/plexus/plexus-container-default/1.0-alpha-20/plexus-container-default-1.0-alpha-20.pom
Downloaded: https://repo.eclipse.org/content/repositories/maven_central/org/codehaus/plexus/plexus-container-default/1.0-alpha-20/plexus-container-default-1.0-alpha-20.pom (0 B at 0.0 KB/sec)
Downloading: https://repo.eclipse.org/content/repositories/maven_central/org/codehaus/plexus/plexus-containers/1.0-alpha-20/plexus-containers-1.0-alpha-20.pom
Downloaded: https://repo.eclipse.org/content/repositories/maven_central/org/codehaus/plexus/plexus-containers/1.0-alpha-20/plexus-containers-1.0-alpha-20.pom (0 B at 0.0 KB/sec)
Downloading: https://repo.eclipse.org/content/repositories/maven_central/org/codehaus/plexus/plexus-utils/1.3/plexus-utils-1.3.pom
Downloaded: https://repo.eclipse.org/content/repositories/maven_central/org/codehaus/plexus/plexus-utils/1.3/plexus-utils-1.3.pom (0 B at 0.0 KB/sec)
Downloading: https://repo.eclipse.org/content/repositories/maven_central/org/codehaus/plexus/plexus-classworlds/1.2-alpha-7/plexus-classworlds-1.2-alpha-7.pom
Downloaded: https://repo.eclipse.org/content/repositories/maven_central/org/codehaus/plexus/plexus-classworlds/1.2-alpha-7/plexus-classworlds-1.2-alpha-7.pom (0 B at 0.0 KB/sec)
Downloading: https://repo.eclipse.org/content/repositories/maven_central/org/codehaus/plexus/plexus/1.0.9/plexus-1.0.9.pom
Downloaded: https://repo.eclipse.org/content/repositories/maven_central/org/codehaus/plexus/plexus/1.0.9/plexus-1.0.9.pom (0 B at 0.0 KB/sec)
Downloading: https://repo.eclipse.org/content/repositories/maven_central/org/apache/velocity/velocity/1.5/velocity-1.5.pom
Downloaded: https://repo.eclipse.org/content/repositories/maven_central/org/apache/velocity/velocity/1.5/velocity-1.5.pom (0 B at 0.0 KB/sec)
Downloading: https://repo.eclipse.org/content/repositories/maven_central/commons-collections/commons-collections/3.1/commons-collections-3.1.pom
Downloaded: https://repo.eclipse.org/content/repositories/maven_central/commons-collections/commons-collections/3.1/commons-collections-3.1.pom (0 B at 0.0 KB/sec)
Downloading: https://repo.eclipse.org/content/repositories/maven_central/commons-lang/commons-lang/2.1/commons-lang-2.1.pom
Downloaded: https://repo.eclipse.org/content/repositories/maven_central/commons-lang/commons-lang/2.1/commons-lang-2.1.pom (0 B at 0.0 KB/sec)
Downloading: https://repo.eclipse.org/content/repositories/maven_central/oro/oro/2.0.8/oro-2.0.8.pom
Downloaded: https://repo.eclipse.org/content/repositories/maven_central/oro/oro/2.0.8/oro-2.0.8.pom (0 B at 0.0 KB/sec)
Downloading: https://repo.eclipse.org/content/repositories/maven_central/commons-collections/commons-collections/3.2/commons-collections-3.2.pom
Downloaded: https://repo.eclipse.org/content/repositories/maven_central/commons-collections/commons-collections/3.2/commons-collections-3.2.pom (0 B at 0.0 KB/sec)
Downloading: https://repo.eclipse.org/content/repositories/maven_central/commons-validator/commons-validator/1.2.0/commons-validator-1.2.0.pom
Downloaded: https://repo.eclipse.org/content/repositories/maven_central/commons-validator/commons-validator/1.2.0/commons-validator-1.2.0.pom (0 B at 0.0 KB/sec)
Downloading: https://repo.eclipse.org/content/repositories/maven_central/commons-beanutils/commons-beanutils/1.7.0/commons-beanutils-1.7.0.pom
Downloaded: https://repo.eclipse.org/content/repositories/maven_central/commons-beanutils/commons-beanutils/1.7.0/commons-beanutils-1.7.0.pom (0 B at 0.0 KB/sec)
Downloading: https://repo.eclipse.org/content/repositories/maven_central/commons-logging/commons-logging/1.0.3/commons-logging-1.0.3.pom
Downloaded: https://repo.eclipse.org/content/repositories/maven_central/commons-logging/commons-logging/1.0.3/commons-logging-1.0.3.pom (0 B at 0.0 KB/sec)
Downloading: https://repo.eclipse.org/content/repositories/maven_central/commons-digester/commons-digester/1.6/commons-digester-1.6.pom
Downloaded: https://repo.eclipse.org/content/repositories/maven_central/commons-digester/commons-digester/1.6/commons-digester-1.6.pom (0 B at 0.0 KB/sec)
Downloading: https://repo.eclipse.org/content/repositories/maven_central/commons-beanutils/commons-beanutils/1.6/commons-beanutils-1.6.pom
Downloaded: https://repo.eclipse.org/content/repositories/maven_central/commons-beanutils/commons-beanutils/1.6/commons-beanutils-1.6.pom (0 B at 0.0 KB/sec)
Downloading: https://repo.eclipse.org/content/repositories/maven_central/commons-logging/commons-logging/1.0/commons-logging-1.0.pom
Downloaded: https://repo.eclipse.org/content/repositories/maven_central/commons-logging/commons-logging/1.0/commons-logging-1.0.pom (0 B at 0.0 KB/sec)
Downloading: https://repo.eclipse.org/content/repositories/maven_central/commons-collections/commons-collections/2.0/commons-collections-2.0.pom
Downloaded: https://repo.eclipse.org/content/repositories/maven_central/commons-collections/commons-collections/2.0/commons-collections-2.0.pom (0 B at 0.0 KB/sec)
Downloading: https://repo.eclipse.org/content/repositories/maven_central/commons-collections/commons-collections/2.1/commons-collections-2.1.pom
Downloaded: https://repo.eclipse.org/content/repositories/maven_central/commons-collections/commons-collections/2.1/commons-collections-2.1.pom (0 B at 0.0 KB/sec)
Downloading: https://repo.eclipse.org/content/repositories/maven_central/xml-apis/xml-apis/1.0.b2/xml-apis-1.0.b2.pom
Downloaded: https://repo.eclipse.org/content/repositories/maven_central/xml-apis/xml-apis/1.0.b2/xml-apis-1.0.b2.pom (0 B at 0.0 KB/sec)
Downloading: https://repo.eclipse.org/content/repositories/maven_central/xml-apis/xml-apis/2.0.2/xml-apis-2.0.2.pom
Downloaded: https://repo.eclipse.org/content/repositories/maven_central/xml-apis/xml-apis/2.0.2/xml-apis-2.0.2.pom (0 B at 0.0 KB/sec)
Downloading: https://repo.eclipse.org/content/repositories/maven_central/org/jacoco/org.jacoco.agent/0.7.2.201409121644/org.jacoco.agent-0.7.2.201409121644.pom
Downloaded: https://repo.eclipse.org/content/repositories/maven_central/org/jacoco/org.jacoco.agent/0.7.2.201409121644/org.jacoco.agent-0.7.2.201409121644.pom (0 B at 0.0 KB/sec)
Downloading: https://repo.eclipse.org/content/repositories/maven_central/org/jacoco/org.jacoco.core/0.7.2.201409121644/org.jacoco.core-0.7.2.201409121644.pom
Downloaded: https://repo.eclipse.org/content/repositories/maven_central/org/jacoco/org.jacoco.core/0.7.2.201409121644/org.jacoco.core-0.7.2.201409121644.pom (0 B at 0.0 KB/sec)
Downloading: https://repo.eclipse.org/content/repositories/maven_central/org/ow2/asm/asm-debug-all/5.0.1/asm-debug-all-5.0.1.pom
Downloaded: https://repo.eclipse.org/content/repositories/maven_central/org/ow2/asm/asm-debug-all/5.0.1/asm-debug-all-5.0.1.pom (0 B at 0.0 KB/sec)
Downloading: https://repo.eclipse.org/content/repositories/maven_central/org/ow2/asm/asm-parent/5.0.1/asm-parent-5.0.1.pom
Downloaded: https://repo.eclipse.org/content/repositories/maven_central/org/ow2/asm/asm-parent/5.0.1/asm-parent-5.0.1.pom (0 B at 0.0 KB/sec)
Downloading: https://repo.eclipse.org/content/repositories/maven_central/org/jacoco/org.jacoco.report/0.7.2.201409121644/org.jacoco.report-0.7.2.201409121644.pom
Downloaded: https://repo.eclipse.org/content/repositories/maven_central/org/jacoco/org.jacoco.report/0.7.2.201409121644/org.jacoco.report-0.7.2.201409121644.pom (0 B at 0.0 KB/sec)
Downloading: https://repo.eclipse.org/content/repositories/maven_central/junit/junit/4.8.2/junit-4.8.2.jar
Downloading: https://repo.eclipse.org/content/repositories/maven_central/org/apache/maven/shared/file-management/1.2.1/file-management-1.2.1.jar
Downloading: https://repo.eclipse.org/content/repositories/maven_central/org/apache/maven/shared/maven-shared-io/1.1/maven-shared-io-1.1.jar
Downloading: https://repo.eclipse.org/content/repositories/maven_central/org/apache/maven/reporting/maven-reporting-impl/2.1/maven-reporting-impl-2.1.jar
Downloading: https://repo.eclipse.org/content/repositories/maven_central/org/apache/maven/doxia/doxia-core/1.1.2/doxia-core-1.1.2.jar
Downloaded: https://repo.eclipse.org/content/repositories/maven_central/org/apache/maven/shared/file-management/1.2.1/file-management-1.2.1.jar (0 B at 0.0 KB/sec)
Downloading: https://repo.eclipse.org/content/repositories/maven_central/xerces/xercesImpl/2.8.1/xercesImpl-2.8.1.jar
Downloaded: https://repo.eclipse.org/content/repositories/maven_central/junit/junit/4.8.2/junit-4.8.2.jar (0 B at 0.0 KB/sec)
Downloading: https://repo.eclipse.org/content/repositories/maven_central/commons-lang/commons-lang/2.4/commons-lang-2.4.jar
Downloaded: https://repo.eclipse.org/content/repositories/maven_central/org/apache/maven/shared/maven-shared-io/1.1/maven-shared-io-1.1.jar (0 B at 0.0 KB/sec)
Downloading: https://repo.eclipse.org/content/repositories/maven_central/commons-httpclient/commons-httpclient/3.1/commons-httpclient-3.1.jar
Downloaded: https://repo.eclipse.org/content/repositories/maven_central/commons-lang/commons-lang/2.4/commons-lang-2.4.jar (0 B at 0.0 KB/sec)
Downloading: https://repo.eclipse.org/content/repositories/maven_central/commons-codec/commons-codec/1.2/commons-codec-1.2.jar
Downloaded: https://repo.eclipse.org/content/repositories/maven_central/org/apache/maven/doxia/doxia-core/1.1.2/doxia-core-1.1.2.jar (0 B at 0.0 KB/sec)
Downloading: https://repo.eclipse.org/content/repositories/maven_central/org/apache/maven/doxia/doxia-site-renderer/1.1.2/doxia-site-renderer-1.1.2.jar
Downloaded: https://repo.eclipse.org/content/repositories/maven_central/org/apache/maven/reporting/maven-reporting-impl/2.1/maven-reporting-impl-2.1.jar (0 B at 0.0 KB/sec)
Downloading: https://repo.eclipse.org/content/repositories/maven_central/org/apache/maven/doxia/doxia-decoration-model/1.1.2/doxia-decoration-model-1.1.2.jar
Downloaded: https://repo.eclipse.org/content/repositories/maven_central/xerces/xercesImpl/2.8.1/xercesImpl-2.8.1.jar (0 B at 0.0 KB/sec)
Downloading: https://repo.eclipse.org/content/repositories/maven_central/org/apache/maven/doxia/doxia-module-xhtml/1.1.2/doxia-module-xhtml-1.1.2.jar
Downloaded: https://repo.eclipse.org/content/repositories/maven_central/commons-httpclient/commons-httpclient/3.1/commons-httpclient-3.1.jar (0 B at 0.0 KB/sec)
Downloading: https://repo.eclipse.org/content/repositories/maven_central/org/apache/maven/doxia/doxia-module-fml/1.1.2/doxia-module-fml-1.1.2.jar
Downloaded: https://repo.eclipse.org/content/repositories/maven_central/org/apache/maven/doxia/doxia-decoration-model/1.1.2/doxia-decoration-model-1.1.2.jar (0 B at 0.0 KB/sec)
Downloaded: https://repo.eclipse.org/content/repositories/maven_central/commons-codec/commons-codec/1.2/commons-codec-1.2.jar (0 B at 0.0 KB/sec)
Downloading: https://repo.eclipse.org/content/repositories/maven_central/org/codehaus/plexus/plexus-i18n/1.0-beta-7/plexus-i18n-1.0-beta-7.jar
Downloading: https://repo.eclipse.org/content/repositories/maven_central/org/codehaus/plexus/plexus-velocity/1.1.7/plexus-velocity-1.1.7.jar
Downloaded: https://repo.eclipse.org/content/repositories/maven_central/org/codehaus/plexus/plexus-i18n/1.0-beta-7/plexus-i18n-1.0-beta-7.jar (0 B at 0.0 KB/sec)
Downloading: https://repo.eclipse.org/content/repositories/maven_central/org/apache/velocity/velocity/1.5/velocity-1.5.jar
Downloaded: https://repo.eclipse.org/content/repositories/maven_central/org/apache/maven/doxia/doxia-module-fml/1.1.2/doxia-module-fml-1.1.2.jar (0 B at 0.0 KB/sec)
Downloading: https://repo.eclipse.org/content/repositories/maven_central/commons-collections/commons-collections/3.2/commons-collections-3.2.jar
Downloaded: https://repo.eclipse.org/content/repositories/maven_central/org/apache/maven/doxia/doxia-module-xhtml/1.1.2/doxia-module-xhtml-1.1.2.jar (0 B at 0.0 KB/sec)
Downloading: https://repo.eclipse.org/content/repositories/maven_central/commons-validator/commons-validator/1.2.0/commons-validator-1.2.0.jar
Downloaded: https://repo.eclipse.org/content/repositories/maven_central/org/codehaus/plexus/plexus-velocity/1.1.7/plexus-velocity-1.1.7.jar (0 B at 0.0 KB/sec)
Downloading: https://repo.eclipse.org/content/repositories/maven_central/commons-beanutils/commons-beanutils/1.7.0/commons-beanutils-1.7.0.jar
Downloaded: https://repo.eclipse.org/content/repositories/maven_central/org/apache/maven/doxia/doxia-site-renderer/1.1.2/doxia-site-renderer-1.1.2.jar (0 B at 0.0 KB/sec)
Downloading: https://repo.eclipse.org/content/repositories/maven_central/commons-digester/commons-digester/1.6/commons-digester-1.6.jar
Downloaded: https://repo.eclipse.org/content/repositories/maven_central/commons-collections/commons-collections/3.2/commons-collections-3.2.jar (0 B at 0.0 KB/sec)
Downloading: https://repo.eclipse.org/content/repositories/maven_central/commons-logging/commons-logging/1.0.4/commons-logging-1.0.4.jar
Downloaded: https://repo.eclipse.org/content/repositories/maven_central/commons-validator/commons-validator/1.2.0/commons-validator-1.2.0.jar (0 B at 0.0 KB/sec)
Downloading: https://repo.eclipse.org/content/repositories/maven_central/oro/oro/2.0.8/oro-2.0.8.jar
Downloaded: https://repo.eclipse.org/content/repositories/maven_central/org/apache/velocity/velocity/1.5/velocity-1.5.jar (0 B at 0.0 KB/sec)
Downloading: https://repo.eclipse.org/content/repositories/maven_central/xml-apis/xml-apis/1.0.b2/xml-apis-1.0.b2.jar
Downloaded: https://repo.eclipse.org/content/repositories/maven_central/commons-logging/commons-logging/1.0.4/commons-logging-1.0.4.jar (0 B at 0.0 KB/sec)
Downloading: https://repo.eclipse.org/content/repositories/maven_central/org/jacoco/org.jacoco.agent/0.7.2.201409121644/org.jacoco.agent-0.7.2.201409121644-runtime.jar
Downloaded: https://repo.eclipse.org/content/repositories/maven_central/commons-digester/commons-digester/1.6/commons-digester-1.6.jar (0 B at 0.0 KB/sec)
Downloading: https://repo.eclipse.org/content/repositories/maven_central/org/jacoco/org.jacoco.core/0.7.2.201409121644/org.jacoco.core-0.7.2.201409121644.jar
Downloaded: https://repo.eclipse.org/content/repositories/maven_central/oro/oro/2.0.8/oro-2.0.8.jar (0 B at 0.0 KB/sec)
Downloading: https://repo.eclipse.org/content/repositories/maven_central/org/ow2/asm/asm-debug-all/5.0.1/asm-debug-all-5.0.1.jar
Downloaded: https://repo.eclipse.org/content/repositories/maven_central/commons-beanutils/commons-beanutils/1.7.0/commons-beanutils-1.7.0.jar (0 B at 0.0 KB/sec)
Downloading: https://repo.eclipse.org/content/repositories/maven_central/org/jacoco/org.jacoco.report/0.7.2.201409121644/org.jacoco.report-0.7.2.201409121644.jar
Downloaded: https://repo.eclipse.org/content/repositories/maven_central/xml-apis/xml-apis/1.0.b2/xml-apis-1.0.b2.jar (0 B at 0.0 KB/sec)
Downloaded: https://repo.eclipse.org/content/repositories/maven_central/org/ow2/asm/asm-debug-all/5.0.1/asm-debug-all-5.0.1.jar (0 B at 0.0 KB/sec)
Downloaded: https://repo.eclipse.org/content/repositories/maven_central/org/jacoco/org.jacoco.agent/0.7.2.201409121644/org.jacoco.agent-0.7.2.201409121644-runtime.jar (0 B at 0.0 KB/sec)
Downloaded: https://repo.eclipse.org/content/repositories/maven_central/org/jacoco/org.jacoco.core/0.7.2.201409121644/org.jacoco.core-0.7.2.201409121644.jar (0 B at 0.0 KB/sec)
Downloaded: https://repo.eclipse.org/content/repositories/maven_central/org/jacoco/org.jacoco.report/0.7.2.201409121644/org.jacoco.report-0.7.2.201409121644.jar (0 B at 0.0 KB/sec)
[INFO] jacoco.argLine set to -javaagent:/home/hudson/genie.sisu/.hudson/jobs/sisu-sonar/workspace/.maven/repo/org/jacoco/org.jacoco.agent/0.7.2.201409121644/org.jacoco.agent-0.7.2.201409121644-runtime.jar=destfile=/jobs/genie.sisu/sisu-sonar/workspace/org.eclipse.sisu.inject.tests/target/jacoco.exec
[INFO] 
[INFO] --- maven-resources-plugin:2.7:resources (default-resources) @ org.eclipse.sisu.inject.tests ---
[INFO] Using 'UTF-8' encoding to copy filtered resources.
[INFO] skip non existing resourceDirectory /jobs/genie.sisu/sisu-sonar/workspace/org.eclipse.sisu.inject.tests/src/main/resources
[INFO] 
[INFO] --- maven-compiler-plugin:3.1:compile (default-compile) @ org.eclipse.sisu.inject.tests ---
Downloading: https://repo.eclipse.org/content/repositories/maven_central/org/codehaus/plexus/plexus-utils/1.5.1/plexus-utils-1.5.1.pom
Downloaded: https://repo.eclipse.org/content/repositories/maven_central/org/codehaus/plexus/plexus-utils/1.5.1/plexus-utils-1.5.1.pom (0 B at 0.0 KB/sec)
Downloading: https://repo.eclipse.org/content/repositories/maven_central/org/apache/maven/maven-toolchain/1.0/maven-toolchain-1.0.pom
Downloaded: https://repo.eclipse.org/content/repositories/maven_central/org/apache/maven/maven-toolchain/1.0/maven-toolchain-1.0.pom (0 B at 0.0 KB/sec)
Downloading: https://repo.eclipse.org/content/repositories/maven_central/org/apache/maven/shared/maven-shared-utils/0.1/maven-shared-utils-0.1.pom
Downloaded: https://repo.eclipse.org/content/repositories/maven_central/org/apache/maven/shared/maven-shared-utils/0.1/maven-shared-utils-0.1.pom (0 B at 0.0 KB/sec)
Downloading: https://repo.eclipse.org/content/repositories/maven_central/org/apache/maven/shared/maven-shared-incremental/1.1/maven-shared-incremental-1.1.pom
Downloaded: https://repo.eclipse.org/content/repositories/maven_central/org/apache/maven/shared/maven-shared-incremental/1.1/maven-shared-incremental-1.1.pom (0 B at 0.0 KB/sec)
Downloading: https://repo.eclipse.org/content/repositories/maven_central/org/codehaus/plexus/plexus-utils/3.0.8/plexus-utils-3.0.8.pom
Downloaded: https://repo.eclipse.org/content/repositories/maven_central/org/codehaus/plexus/plexus-utils/3.0.8/plexus-utils-3.0.8.pom (0 B at 0.0 KB/sec)
Downloading: https://repo.eclipse.org/content/repositories/maven_central/org/codehaus/plexus/plexus-compiler-javac/2.2/plexus-compiler-javac-2.2.pom
Downloaded: https://repo.eclipse.org/content/repositories/maven_central/org/codehaus/plexus/plexus-compiler-javac/2.2/plexus-compiler-javac-2.2.pom (0 B at 0.0 KB/sec)
Downloading: https://repo.eclipse.org/content/repositories/maven_central/org/codehaus/plexus/plexus-compilers/2.2/plexus-compilers-2.2.pom
Downloaded: https://repo.eclipse.org/content/repositories/maven_central/org/codehaus/plexus/plexus-compilers/2.2/plexus-compilers-2.2.pom (0 B at 0.0 KB/sec)
Downloading: https://repo.eclipse.org/content/repositories/maven_central/org/codehaus/plexus/plexus-container-default/1.5.5/plexus-container-default-1.5.5.pom
Downloaded: https://repo.eclipse.org/content/repositories/maven_central/org/codehaus/plexus/plexus-container-default/1.5.5/plexus-container-default-1.5.5.pom (0 B at 0.0 KB/sec)
Downloading: https://repo.eclipse.org/content/repositories/maven_central/org/codehaus/plexus/plexus-classworlds/2.2.2/plexus-classworlds-2.2.2.pom
Downloaded: https://repo.eclipse.org/content/repositories/maven_central/org/codehaus/plexus/plexus-classworlds/2.2.2/plexus-classworlds-2.2.2.pom (0 B at 0.0 KB/sec)
Downloading: https://repo.eclipse.org/content/repositories/maven_central/org/codehaus/plexus/plexus/2.0.3/plexus-2.0.3.pom
Downloaded: https://repo.eclipse.org/content/repositories/maven_central/org/codehaus/plexus/plexus/2.0.3/plexus-2.0.3.pom (0 B at 0.0 KB/sec)
Downloading: https://repo.eclipse.org/content/repositories/maven_central/org/apache/xbean/xbean-reflect/3.4/xbean-reflect-3.4.pom
Downloaded: https://repo.eclipse.org/content/repositories/maven_central/org/apache/xbean/xbean-reflect/3.4/xbean-reflect-3.4.pom (0 B at 0.0 KB/sec)
Downloading: https://repo.eclipse.org/content/repositories/maven_central/org/apache/xbean/xbean/3.4/xbean-3.4.pom
Downloaded: https://repo.eclipse.org/content/repositories/maven_central/org/apache/xbean/xbean/3.4/xbean-3.4.pom (0 B at 0.0 KB/sec)
Downloading: https://repo.eclipse.org/content/repositories/maven_central/log4j/log4j/1.2.12/log4j-1.2.12.pom
Downloaded: https://repo.eclipse.org/content/repositories/maven_central/log4j/log4j/1.2.12/log4j-1.2.12.pom (0 B at 0.0 KB/sec)
Downloading: https://repo.eclipse.org/content/repositories/maven_central/commons-logging/commons-logging-api/1.1/commons-logging-api-1.1.pom
Downloaded: https://repo.eclipse.org/content/repositories/maven_central/commons-logging/commons-logging-api/1.1/commons-logging-api-1.1.pom (0 B at 0.0 KB/sec)
Downloading: https://repo.eclipse.org/content/repositories/maven_central/com/google/collections/google-collections/1.0/google-collections-1.0.pom
Downloaded: https://repo.eclipse.org/content/repositories/maven_central/com/google/collections/google-collections/1.0/google-collections-1.0.pom (0 B at 0.0 KB/sec)
Downloading: https://repo.eclipse.org/content/repositories/maven_central/com/google/google/1/google-1.pom
Downloaded: https://repo.eclipse.org/content/repositories/maven_central/com/google/google/1/google-1.pom (0 B at 0.0 KB/sec)
Downloading: https://repo.eclipse.org/content/repositories/maven_central/org/codehaus/plexus/plexus-utils/1.5.1/plexus-utils-1.5.1.jar
Downloading: https://repo.eclipse.org/content/repositories/maven_central/org/apache/maven/shared/maven-shared-utils/0.1/maven-shared-utils-0.1.jar
Downloading: https://repo.eclipse.org/content/repositories/maven_central/org/apache/maven/shared/maven-shared-incremental/1.1/maven-shared-incremental-1.1.jar
Downloading: https://repo.eclipse.org/content/repositories/maven_central/org/codehaus/plexus/plexus-compiler-javac/2.2/plexus-compiler-javac-2.2.jar
Downloading: https://repo.eclipse.org/content/repositories/maven_central/org/apache/xbean/xbean-reflect/3.4/xbean-reflect-3.4.jar
Downloaded: https://repo.eclipse.org/content/repositories/maven_central/org/codehaus/plexus/plexus-compiler-javac/2.2/plexus-compiler-javac-2.2.jar (0 B at 0.0 KB/sec)
Downloading: https://repo.eclipse.org/content/repositories/maven_central/log4j/log4j/1.2.12/log4j-1.2.12.jar
Downloaded: https://repo.eclipse.org/content/repositories/maven_central/org/apache/maven/shared/maven-shared-utils/0.1/maven-shared-utils-0.1.jar (0 B at 0.0 KB/sec)
Downloading: https://repo.eclipse.org/content/repositories/maven_central/commons-logging/commons-logging-api/1.1/commons-logging-api-1.1.jar
Downloaded: https://repo.eclipse.org/content/repositories/maven_central/org/apache/xbean/xbean-reflect/3.4/xbean-reflect-3.4.jar (0 B at 0.0 KB/sec)
Downloading: https://repo.eclipse.org/content/repositories/maven_central/com/google/collections/google-collections/1.0/google-collections-1.0.jar
Downloaded: https://repo.eclipse.org/content/repositories/maven_central/org/apache/maven/shared/maven-shared-incremental/1.1/maven-shared-incremental-1.1.jar (0 B at 0.0 KB/sec)
Downloading: https://repo.eclipse.org/content/repositories/maven_central/junit/junit/3.8.2/junit-3.8.2.jar
Downloaded: https://repo.eclipse.org/content/repositories/maven_central/org/codehaus/plexus/plexus-utils/1.5.1/plexus-utils-1.5.1.jar (0 B at 0.0 KB/sec)
Downloaded: https://repo.eclipse.org/content/repositories/maven_central/commons-logging/commons-logging-api/1.1/commons-logging-api-1.1.jar (0 B at 0.0 KB/sec)
Downloaded: https://repo.eclipse.org/content/repositories/maven_central/log4j/log4j/1.2.12/log4j-1.2.12.jar (0 B at 0.0 KB/sec)
Downloaded: https://repo.eclipse.org/content/repositories/maven_central/com/google/collections/google-collections/1.0/google-collections-1.0.jar (0 B at 0.0 KB/sec)
Downloaded: https://repo.eclipse.org/content/repositories/maven_central/junit/junit/3.8.2/junit-3.8.2.jar (0 B at 0.0 KB/sec)
[INFO] Changes detected - recompiling the module!
[INFO] Compiling 69 source files to /jobs/genie.sisu/sisu-sonar/workspace/org.eclipse.sisu.inject.tests/target/classes
[INFO] 
[INFO] --- maven-resources-plugin:2.7:testResources (default-testResources) @ org.eclipse.sisu.inject.tests ---
[INFO] Using 'UTF-8' encoding to copy filtered resources.
[INFO] skip non existing resourceDirectory /jobs/genie.sisu/sisu-sonar/workspace/org.eclipse.sisu.inject.tests/src/test/resources
[INFO] 
[INFO] --- maven-compiler-plugin:3.1:testCompile (default-testCompile) @ org.eclipse.sisu.inject.tests ---
[INFO] No sources to compile
[INFO] 
[INFO] --- maven-surefire-plugin:2.17:test (default-test) @ org.eclipse.sisu.inject.tests ---
Downloading: https://repo.eclipse.org/content/repositories/maven_central/org/apache/maven/surefire/maven-surefire-common/2.17/maven-surefire-common-2.17.pom
Downloaded: https://repo.eclipse.org/content/repositories/maven_central/org/apache/maven/surefire/maven-surefire-common/2.17/maven-surefire-common-2.17.pom (0 B at 0.0 KB/sec)
Downloading: https://repo.eclipse.org/content/repositories/maven_central/org/apache/maven/plugin-tools/maven-plugin-annotations/3.2/maven-plugin-annotations-3.2.pom
Downloaded: https://repo.eclipse.org/content/repositories/maven_central/org/apache/maven/plugin-tools/maven-plugin-annotations/3.2/maven-plugin-annotations-3.2.pom (0 B at 0.0 KB/sec)
Downloading: https://repo.eclipse.org/content/repositories/maven_central/org/apache/maven/plugin-tools/maven-plugin-tools/3.2/maven-plugin-tools-3.2.pom
Downloaded: https://repo.eclipse.org/content/repositories/maven_central/org/apache/maven/plugin-tools/maven-plugin-tools/3.2/maven-plugin-tools-3.2.pom (0 B at 0.0 KB/sec)
Downloading: https://repo.eclipse.org/content/repositories/maven_central/org/apache/maven/surefire/surefire-api/2.17/surefire-api-2.17.pom
Downloaded: https://repo.eclipse.org/content/repositories/maven_central/org/apache/maven/surefire/surefire-api/2.17/surefire-api-2.17.pom (0 B at 0.0 KB/sec)
Downloading: https://repo.eclipse.org/content/repositories/maven_central/org/apache/maven/surefire/surefire-booter/2.17/surefire-booter-2.17.pom
Downloaded: https://repo.eclipse.org/content/repositories/maven_central/org/apache/maven/surefire/surefire-booter/2.17/surefire-booter-2.17.pom (0 B at 0.0 KB/sec)
Downloading: https://repo.eclipse.org/content/repositories/maven_central/org/apache/maven/maven-toolchain/2.0.9/maven-toolchain-2.0.9.pom
Downloaded: https://repo.eclipse.org/content/repositories/maven_central/org/apache/maven/maven-toolchain/2.0.9/maven-toolchain-2.0.9.pom (0 B at 0.0 KB/sec)
Downloading: https://repo.eclipse.org/content/repositories/maven_central/org/apache/maven/surefire/maven-surefire-common/2.17/maven-surefire-common-2.17.jar
Downloading: https://repo.eclipse.org/content/repositories/maven_central/org/apache/maven/surefire/surefire-booter/2.17/surefire-booter-2.17.jar
Downloading: https://repo.eclipse.org/content/repositories/maven_central/org/apache/maven/surefire/surefire-api/2.17/surefire-api-2.17.jar
Downloading: https://repo.eclipse.org/content/repositories/maven_central/org/apache/maven/plugin-tools/maven-plugin-annotations/3.2/maven-plugin-annotations-3.2.jar
Downloaded: https://repo.eclipse.org/content/repositories/maven_central/org/apache/maven/surefire/maven-surefire-common/2.17/maven-surefire-common-2.17.jar (0 B at 0.0 KB/sec)
Downloaded: https://repo.eclipse.org/content/repositories/maven_central/org/apache/maven/surefire/surefire-booter/2.17/surefire-booter-2.17.jar (0 B at 0.0 KB/sec)
Downloaded: https://repo.eclipse.org/content/repositories/maven_central/org/apache/maven/surefire/surefire-api/2.17/surefire-api-2.17.jar (0 B at 0.0 KB/sec)
Downloaded: https://repo.eclipse.org/content/repositories/maven_central/org/apache/maven/plugin-tools/maven-plugin-annotations/3.2/maven-plugin-annotations-3.2.jar (0 B at 0.0 KB/sec)
[INFO] Surefire report directory: /jobs/genie.sisu/sisu-sonar/workspace/org.eclipse.sisu.inject.tests/target/surefire-reports
Downloading: https://repo.eclipse.org/content/repositories/maven_central/org/apache/maven/surefire/surefire-junit4/2.17/surefire-junit4-2.17.pom
Downloaded: https://repo.eclipse.org/content/repositories/maven_central/org/apache/maven/surefire/surefire-junit4/2.17/surefire-junit4-2.17.pom (0 B at 0.0 KB/sec)
Downloading: https://repo.eclipse.org/content/repositories/maven_central/org/apache/maven/surefire/surefire-providers/2.17/surefire-providers-2.17.pom
Downloaded: https://repo.eclipse.org/content/repositories/maven_central/org/apache/maven/surefire/surefire-providers/2.17/surefire-providers-2.17.pom (0 B at 0.0 KB/sec)
Downloading: https://repo.eclipse.org/content/repositories/maven_central/org/apache/maven/surefire/surefire-junit4/2.17/surefire-junit4-2.17.jar
Downloaded: https://repo.eclipse.org/content/repositories/maven_central/org/apache/maven/surefire/surefire-junit4/2.17/surefire-junit4-2.17.jar (0 B at 0.0 KB/sec)

-------------------------------------------------------
 T E S T S
-------------------------------------------------------
Running org.eclipse.sisu.bean.DeclaredMembersTest
Tests run: 5, Failures: 0, Errors: 0, Skipped: 0, Time elapsed: 0.083 sec - in org.eclipse.sisu.bean.DeclaredMembersTest
Running org.eclipse.sisu.bean.BeanPropertiesTest
Tests run: 16, Failures: 0, Errors: 0, Skipped: 0, Time elapsed: 0.243 sec - in org.eclipse.sisu.bean.BeanPropertiesTest
Running org.eclipse.sisu.bean.PropertyListenerTest
Tests run: 6, Failures: 0, Errors: 0, Skipped: 0, Time elapsed: 0.429 sec - in org.eclipse.sisu.bean.PropertyListenerTest
Running org.eclipse.sisu.bean.LifecycleTest
Tests run: 5, Failures: 0, Errors: 0, Skipped: 0, Time elapsed: 0.753 sec - in org.eclipse.sisu.bean.LifecycleTest
Running org.eclipse.sisu.space.BundleClassSpaceTest
Tests run: 1, Failures: 0, Errors: 0, Skipped: 1, Time elapsed: 0.001 sec - in org.eclipse.sisu.space.BundleClassSpaceTest
Running org.eclipse.sisu.space.CachingModuleTest
Tests run: 1, Failures: 0, Errors: 0, Skipped: 1, Time elapsed: 0 sec - in org.eclipse.sisu.space.CachingModuleTest
Running org.eclipse.sisu.space.FileEntryIteratorTest
Tests run: 1, Failures: 0, Errors: 0, Skipped: 1, Time elapsed: 0 sec - in org.eclipse.sisu.space.FileEntryIteratorTest
Running org.eclipse.sisu.space.BeanWatcherTest
Tests run: 1, Failures: 0, Errors: 0, Skipped: 0, Time elapsed: 0.394 sec - in org.eclipse.sisu.space.BeanWatcherTest
Running org.eclipse.sisu.space.ResourceEnumerationTest
Tests run: 1, Failures: 0, Errors: 0, Skipped: 1, Time elapsed: 0 sec - in org.eclipse.sisu.space.ResourceEnumerationTest
Running org.eclipse.sisu.space.QualifiedModuleTest
Tests run: 1, Failures: 0, Errors: 0, Skipped: 0, Time elapsed: 0.041 sec - in org.eclipse.sisu.space.QualifiedModuleTest
Running org.eclipse.sisu.space.QualifiedProviderTest
Tests run: 1, Failures: 0, Errors: 0, Skipped: 0, Time elapsed: 0.041 sec - in org.eclipse.sisu.space.QualifiedProviderTest
Running org.eclipse.sisu.space.QualifiedTypesTest
Tests run: 2, Failures: 0, Errors: 0, Skipped: 0, Time elapsed: 0.096 sec - in org.eclipse.sisu.space.QualifiedTypesTest
Running org.eclipse.sisu.space.ZipEntryIteratorTest
Tests run: 1, Failures: 0, Errors: 0, Skipped: 1, Time elapsed: 0 sec - in org.eclipse.sisu.space.ZipEntryIteratorTest
Running org.eclipse.sisu.space.QualifiedScanningTest
Tests run: 7, Failures: 0, Errors: 0, Skipped: 0, Time elapsed: 0.239 sec - in org.eclipse.sisu.space.QualifiedScanningTest
Running org.eclipse.sisu.space.DeferredClassTest
Tests run: 3, Failures: 0, Errors: 0, Skipped: 0, Time elapsed: 0.008 sec - in org.eclipse.sisu.space.DeferredClassTest
Running org.eclipse.sisu.space.URLClassSpaceTest
Tests run: 1, Failures: 0, Errors: 0, Skipped: 1, Time elapsed: 0 sec - in org.eclipse.sisu.space.URLClassSpaceTest
Running org.eclipse.sisu.space.DeferredProviderTest
Tests run: 4, Failures: 0, Errors: 0, Skipped: 0, Time elapsed: 0.043 sec - in org.eclipse.sisu.space.DeferredProviderTest
Running org.eclipse.sisu.wire.URLTypeConverterTest
Tests run: 2, Failures: 0, Errors: 0, Skipped: 0, Time elapsed: 0.006 sec - in org.eclipse.sisu.wire.URLTypeConverterTest
Running org.eclipse.sisu.wire.NamedIterableAdapterTest
Tests run: 2, Failures: 0, Errors: 0, Skipped: 0, Time elapsed: 0.007 sec - in org.eclipse.sisu.wire.NamedIterableAdapterTest
Running org.eclipse.sisu.wire.FileTypeConverterTest
Tests run: 1, Failures: 0, Errors: 0, Skipped: 0, Time elapsed: 0.005 sec - in org.eclipse.sisu.wire.FileTypeConverterTest
Running org.eclipse.sisu.wire.EntryMapAdapterTest
Tests run: 2, Failures: 0, Errors: 0, Skipped: 0, Time elapsed: 0.001 sec - in org.eclipse.sisu.wire.EntryMapAdapterTest
Running org.eclipse.sisu.wire.BeanImportTest
Tests run: 12, Failures: 0, Errors: 0, Skipped: 0, Time elapsed: 1.306 sec - in org.eclipse.sisu.wire.BeanImportTest
Running org.eclipse.sisu.wire.ParametersTest
Tests run: 2, Failures: 0, Errors: 0, Skipped: 0, Time elapsed: 0.028 sec - in org.eclipse.sisu.wire.ParametersTest
Running org.eclipse.sisu.wire.EntryListAdapterTest
Tests run: 7, Failures: 0, Errors: 0, Skipped: 0, Time elapsed: 0.003 sec - in org.eclipse.sisu.wire.EntryListAdapterTest
Running org.eclipse.sisu.launch.Custom3TestCase
Tests run: 1, Failures: 0, Errors: 0, Skipped: 1, Time elapsed: 0 sec - in org.eclipse.sisu.launch.Custom3TestCase
Running org.eclipse.sisu.launch.AssistedTestCase
Tests run: 1, Failures: 0, Errors: 0, Skipped: 1, Time elapsed: 0 sec - in org.eclipse.sisu.launch.AssistedTestCase
Running org.eclipse.sisu.launch.ExampleTestCase
Tests run: 1, Failures: 0, Errors: 0, Skipped: 1, Time elapsed: 0 sec - in org.eclipse.sisu.launch.ExampleTestCase
Running org.eclipse.sisu.launch.RequireBindingsTestCase
Tests run: 1, Failures: 0, Errors: 0, Skipped: 0, Time elapsed: 0.708 sec - in org.eclipse.sisu.launch.RequireBindingsTestCase
Running org.eclipse.sisu.launch.Custom1TestCase
Tests run: 1, Failures: 0, Errors: 0, Skipped: 0, Time elapsed: 0.023 sec - in org.eclipse.sisu.launch.Custom1TestCase
Running org.eclipse.sisu.launch.PrivateModuleTestCase
Tests run: 1, Failures: 0, Errors: 0, Skipped: 0, Time elapsed: 0.047 sec - in org.eclipse.sisu.launch.PrivateModuleTestCase
Running org.eclipse.sisu.launch.Custom2Test
Tests run: 1, Failures: 0, Errors: 0, Skipped: 0, Time elapsed: 0.085 sec - in org.eclipse.sisu.launch.Custom2Test
Running org.eclipse.sisu.inject.PriorityTest
Tests run: 1, Failures: 0, Errors: 0, Skipped: 0, Time elapsed: 0.01 sec - in org.eclipse.sisu.inject.PriorityTest
Running org.eclipse.sisu.inject.RankedBindingsTest
Tests run: 3, Failures: 0, Errors: 0, Skipped: 0, Time elapsed: 0.007 sec - in org.eclipse.sisu.inject.RankedBindingsTest
Running org.eclipse.sisu.inject.LocatedBeansTest
Tests run: 6, Failures: 0, Errors: 0, Skipped: 0, Time elapsed: 0.02 sec - in org.eclipse.sisu.inject.LocatedBeansTest
Running org.eclipse.sisu.inject.TypeArgumentsTest
Tests run: 6, Failures: 0, Errors: 0, Skipped: 0, Time elapsed: 0.031 sec - in org.eclipse.sisu.inject.TypeArgumentsTest
Running org.eclipse.sisu.inject.WatchedBeansTest
Tests run: 2, Failures: 0, Errors: 0, Skipped: 0, Time elapsed: 0.147 sec - in org.eclipse.sisu.inject.WatchedBeansTest
Running org.eclipse.sisu.inject.RankedSequenceTest
Tests run: 3, Failures: 0, Errors: 0, Skipped: 0, Time elapsed: 20.768 sec - in org.eclipse.sisu.inject.RankedSequenceTest
Running org.eclipse.sisu.inject.MildKeysTest
Tests run: 2, Failures: 0, Errors: 0, Skipped: 0, Time elapsed: 1.694 sec - in org.eclipse.sisu.inject.MildKeysTest
Running org.eclipse.sisu.inject.DefaultBeanLocatorTest
Tests run: 4, Failures: 0, Errors: 0, Skipped: 0, Time elapsed: 0.182 sec - in org.eclipse.sisu.inject.DefaultBeanLocatorTest
Running org.eclipse.sisu.inject.ImplementationsTest
Tests run: 1, Failures: 0, Errors: 0, Skipped: 0, Time elapsed: 0.002 sec - in org.eclipse.sisu.inject.ImplementationsTest
Running org.eclipse.sisu.inject.MildValuesTest
Tests run: 2, Failures: 0, Errors: 0, Skipped: 0, Time elapsed: 1.016 sec - in org.eclipse.sisu.inject.MildValuesTest
Running org.eclipse.sisu.inject.MildElementsTest
Tests run: 2, Failures: 0, Errors: 0, Skipped: 0, Time elapsed: 0.752 sec - in org.eclipse.sisu.inject.MildElementsTest
Running org.eclipse.sisu.inject.LazyBeanEntryTest
Tests run: 4, Failures: 0, Errors: 0, Skipped: 0, Time elapsed: 0.017 sec - in org.eclipse.sisu.inject.LazyBeanEntryTest
Running org.eclipse.sisu.inject.LogsTest
Tests run: 4, Failures: 0, Errors: 0, Skipped: 0, Time elapsed: 0.805 sec - in org.eclipse.sisu.inject.LogsTest

Results :

Tests run: 132, Failures: 0, Errors: 0, Skipped: 9

[INFO] 
[INFO] --- maven-jar-plugin:2.5:jar (default-jar) @ org.eclipse.sisu.inject.tests ---
Downloading: https://repo.eclipse.org/content/repositories/maven_central/org/codehaus/plexus/plexus-archiver/2.1/plexus-archiver-2.1.pom
Downloaded: https://repo.eclipse.org/content/repositories/maven_central/org/codehaus/plexus/plexus-archiver/2.1/plexus-archiver-2.1.pom (0 B at 0.0 KB/sec)
Downloading: https://repo.eclipse.org/content/repositories/maven_central/org/codehaus/plexus/plexus-utils/3.0/plexus-utils-3.0.pom
Downloaded: https://repo.eclipse.org/content/repositories/maven_central/org/codehaus/plexus/plexus-utils/3.0/plexus-utils-3.0.pom (0 B at 0.0 KB/sec)
Downloading: https://repo.eclipse.org/content/repositories/maven_central/org/sonatype/spice/spice-parent/16/spice-parent-16.pom
Downloaded: https://repo.eclipse.org/content/repositories/maven_central/org/sonatype/spice/spice-parent/16/spice-parent-16.pom (0 B at 0.0 KB/sec)
Downloading: https://repo.eclipse.org/content/repositories/maven_central/org/codehaus/plexus/plexus-io/2.0.2/plexus-io-2.0.2.pom
Downloaded: https://repo.eclipse.org/content/repositories/maven_central/org/codehaus/plexus/plexus-io/2.0.2/plexus-io-2.0.2.pom (0 B at 0.0 KB/sec)
Downloading: https://repo.eclipse.org/content/repositories/maven_central/org/codehaus/plexus/plexus-components/1.1.19/plexus-components-1.1.19.pom
Downloaded: https://repo.eclipse.org/content/repositories/maven_central/org/codehaus/plexus/plexus-components/1.1.19/plexus-components-1.1.19.pom (0 B at 0.0 KB/sec)
Downloading: https://repo.eclipse.org/content/repositories/maven_central/org/codehaus/plexus/plexus-archiver/2.4.4/plexus-archiver-2.4.4.pom
Downloaded: https://repo.eclipse.org/content/repositories/maven_central/org/codehaus/plexus/plexus-archiver/2.4.4/plexus-archiver-2.4.4.pom (0 B at 0.0 KB/sec)
Downloading: https://repo.eclipse.org/content/repositories/maven_central/org/codehaus/plexus/plexus-io/2.0.10/plexus-io-2.0.10.pom
Downloaded: https://repo.eclipse.org/content/repositories/maven_central/org/codehaus/plexus/plexus-io/2.0.10/plexus-io-2.0.10.pom (0 B at 0.0 KB/sec)
Downloading: https://repo.eclipse.org/content/repositories/maven_central/org/apache/commons/commons-compress/1.5/commons-compress-1.5.pom
Downloaded: https://repo.eclipse.org/content/repositories/maven_central/org/apache/commons/commons-compress/1.5/commons-compress-1.5.pom (0 B at 0.0 KB/sec)
Downloading: https://repo.eclipse.org/content/repositories/maven_central/org/apache/commons/commons-parent/28/commons-parent-28.pom
Downloaded: https://repo.eclipse.org/content/repositories/maven_central/org/apache/commons/commons-parent/28/commons-parent-28.pom (0 B at 0.0 KB/sec)
Downloading: https://repo.eclipse.org/content/repositories/maven_central/org/tukaani/xz/1.2/xz-1.2.pom
Downloaded: https://repo.eclipse.org/content/repositories/maven_central/org/tukaani/xz/1.2/xz-1.2.pom (0 B at 0.0 KB/sec)
Downloading: https://repo.eclipse.org/content/repositories/maven_central/org/apache/maven/reporting/maven-reporting-api/2.0.6/maven-reporting-api-2.0.6.jar
Downloading: https://repo.eclipse.org/content/repositories/maven_central/org/apache/maven/doxia/doxia-sink-api/1.0-alpha-7/doxia-sink-api-1.0-alpha-7.jar
Downloading: https://repo.eclipse.org/content/repositories/maven_central/org/codehaus/plexus/plexus-interpolation/1.15/plexus-interpolation-1.15.jar
Downloading: https://repo.eclipse.org/content/repositories/maven_central/org/codehaus/plexus/plexus-archiver/2.4.4/plexus-archiver-2.4.4.jar
Downloading: https://repo.eclipse.org/content/repositories/maven_central/org/codehaus/plexus/plexus-io/2.0.10/plexus-io-2.0.10.jar
Downloaded: https://repo.eclipse.org/content/repositories/maven_central/org/apache/maven/reporting/maven-reporting-api/2.0.6/maven-reporting-api-2.0.6.jar (0 B at 0.0 KB/sec)
Downloading: https://repo.eclipse.org/content/repositories/maven_central/org/apache/commons/commons-compress/1.5/commons-compress-1.5.jar
Downloaded: https://repo.eclipse.org/content/repositories/maven_central/org/codehaus/plexus/plexus-io/2.0.10/plexus-io-2.0.10.jar (0 B at 0.0 KB/sec)
Downloaded: https://repo.eclipse.org/content/repositories/maven_central/org/apache/maven/doxia/doxia-sink-api/1.0-alpha-7/doxia-sink-api-1.0-alpha-7.jar (0 B at 0.0 KB/sec)
Downloaded: https://repo.eclipse.org/content/repositories/maven_central/org/codehaus/plexus/plexus-interpolation/1.15/plexus-interpolation-1.15.jar (0 B at 0.0 KB/sec)
Downloading: https://repo.eclipse.org/content/repositories/maven_central/org/tukaani/xz/1.2/xz-1.2.jar
Downloaded: https://repo.eclipse.org/content/repositories/maven_central/org/codehaus/plexus/plexus-archiver/2.4.4/plexus-archiver-2.4.4.jar (0 B at 0.0 KB/sec)
Downloaded: https://repo.eclipse.org/content/repositories/maven_central/org/apache/commons/commons-compress/1.5/commons-compress-1.5.jar (0 B at 0.0 KB/sec)
Downloaded: https://repo.eclipse.org/content/repositories/maven_central/org/tukaani/xz/1.2/xz-1.2.jar (0 B at 0.0 KB/sec)
[INFO] Building jar: /jobs/genie.sisu/sisu-sonar/workspace/org.eclipse.sisu.inject.tests/target/org.eclipse.sisu.inject.tests-0.9.0-SNAPSHOT.jar
[INFO]                                                                         
[INFO] ------------------------------------------------------------------------
[INFO] Building org.eclipse.sisu.inject.site 0.9.0-SNAPSHOT
[INFO] ------------------------------------------------------------------------
[INFO] 
[INFO] --- maven-clean-plugin:2.6:clean (default-clean) @ org.eclipse.sisu.inject.site ---
[INFO] Deleting /jobs/genie.sisu/sisu-sonar/workspace/org.eclipse.sisu.inject.site/target
[INFO] 
[INFO] --- tycho-packaging-plugin:0.24.0:build-qualifier-aggregator (default-build-qualifier-aggregator) @ org.eclipse.sisu.inject.site ---
[INFO] The project's OSGi version is 0.9.0.201707280401
[INFO] 
[INFO] --- maven-enforcer-plugin:1.2:enforce (enforce-maven) @ org.eclipse.sisu.inject.site ---
[INFO] 
[INFO] --- maven-clean-plugin:2.6:clean (default-clean-1) @ org.eclipse.sisu.inject.site ---
[INFO] 
[INFO] --- maven-resources-plugin:2.7:resources (default-resources) @ org.eclipse.sisu.inject.site ---
[INFO] Using 'UTF-8' encoding to copy filtered resources.
[INFO] skip non existing resourceDirectory /jobs/genie.sisu/sisu-sonar/workspace/org.eclipse.sisu.inject.site/src/main/resources
[INFO] 
[INFO] --- target-platform-configuration:0.24.0:target-platform (default-target-platform) @ org.eclipse.sisu.inject.site ---
[INFO] 
[INFO] --- tycho-p2-publisher-plugin:0.24.0:publish-products (default-publish-products) @ org.eclipse.sisu.inject.site ---
[INFO] 
[INFO] --- tycho-p2-publisher-plugin:0.24.0:publish-categories (default-publish-categories) @ org.eclipse.sisu.inject.site ---
[INFO] 
[INFO] --- tycho-p2-publisher-plugin:0.24.0:attach-artifacts (default-attach-artifacts) @ org.eclipse.sisu.inject.site ---
[INFO] 
[INFO] --- tycho-p2-repository-plugin:0.24.0:assemble-repository (default-assemble-repository) @ org.eclipse.sisu.inject.site ---
[INFO] 
[INFO] --- tycho-p2-repository-plugin:0.24.0:archive-repository (default-archive-repository) @ org.eclipse.sisu.inject.site ---
[INFO] Building zip: /jobs/genie.sisu/sisu-sonar/workspace/org.eclipse.sisu.inject.site/target/org.eclipse.sisu.inject.site-0.9.0-SNAPSHOT.zip
[INFO] 
[INFO] --- maven-antrun-plugin:1.7:run (add-notices) @ org.eclipse.sisu.inject.site ---
Downloading: https://repo.eclipse.org/content/repositories/maven_central/org/apache/maven/maven-plugin-api/2.0.11/maven-plugin-api-2.0.11.pom
Downloaded: https://repo.eclipse.org/content/repositories/maven_central/org/apache/maven/maven-plugin-api/2.0.11/maven-plugin-api-2.0.11.pom (0 B at 0.0 KB/sec)
Downloading: https://repo.eclipse.org/content/repositories/maven_central/org/apache/maven/maven/2.0.11/maven-2.0.11.pom
Downloaded: https://repo.eclipse.org/content/repositories/maven_central/org/apache/maven/maven/2.0.11/maven-2.0.11.pom (0 B at 0.0 KB/sec)
Downloading: https://repo.eclipse.org/content/repositories/maven_central/org/apache/maven/maven-parent/12/maven-parent-12.pom
Downloaded: https://repo.eclipse.org/content/repositories/maven_central/org/apache/maven/maven-parent/12/maven-parent-12.pom (0 B at 0.0 KB/sec)
Downloading: https://repo.eclipse.org/content/repositories/maven_central/org/apache/maven/maven-project/2.0.11/maven-project-2.0.11.pom
Downloaded: https://repo.eclipse.org/content/repositories/maven_central/org/apache/maven/maven-project/2.0.11/maven-project-2.0.11.pom (0 B at 0.0 KB/sec)
Downloading: https://repo.eclipse.org/content/repositories/maven_central/org/apache/maven/maven-settings/2.0.11/maven-settings-2.0.11.pom
Downloaded: https://repo.eclipse.org/content/repositories/maven_central/org/apache/maven/maven-settings/2.0.11/maven-settings-2.0.11.pom (0 B at 0.0 KB/sec)
Downloading: https://repo.eclipse.org/content/repositories/maven_central/org/apache/maven/maven-model/2.0.11/maven-model-2.0.11.pom
Downloaded: https://repo.eclipse.org/content/repositories/maven_central/org/apache/maven/maven-model/2.0.11/maven-model-2.0.11.pom (0 B at 0.0 KB/sec)
Downloading: https://repo.eclipse.org/content/repositories/maven_central/org/apache/maven/maven-profile/2.0.11/maven-profile-2.0.11.pom
Downloaded: https://repo.eclipse.org/content/repositories/maven_central/org/apache/maven/maven-profile/2.0.11/maven-profile-2.0.11.pom (0 B at 0.0 KB/sec)
Downloading: https://repo.eclipse.org/content/repositories/maven_central/org/apache/maven/maven-artifact-manager/2.0.11/maven-artifact-manager-2.0.11.pom
Downloaded: https://repo.eclipse.org/content/repositories/maven_central/org/apache/maven/maven-artifact-manager/2.0.11/maven-artifact-manager-2.0.11.pom (0 B at 0.0 KB/sec)
Downloading: https://repo.eclipse.org/content/repositories/maven_central/org/apache/maven/maven-repository-metadata/2.0.11/maven-repository-metadata-2.0.11.pom
Downloaded: https://repo.eclipse.org/content/repositories/maven_central/org/apache/maven/maven-repository-metadata/2.0.11/maven-repository-metadata-2.0.11.pom (0 B at 0.0 KB/sec)
Downloading: https://repo.eclipse.org/content/repositories/maven_central/org/apache/maven/maven-artifact/2.0.11/maven-artifact-2.0.11.pom
Downloaded: https://repo.eclipse.org/content/repositories/maven_central/org/apache/maven/maven-artifact/2.0.11/maven-artifact-2.0.11.pom (0 B at 0.0 KB/sec)
Downloading: https://repo.eclipse.org/content/repositories/maven_central/org/apache/maven/maven-plugin-registry/2.0.11/maven-plugin-registry-2.0.11.pom
Downloaded: https://repo.eclipse.org/content/repositories/maven_central/org/apache/maven/maven-plugin-registry/2.0.11/maven-plugin-registry-2.0.11.pom (0 B at 0.0 KB/sec)
Downloading: https://repo.eclipse.org/content/repositories/maven_central/org/codehaus/plexus/plexus-utils/2.0.5/plexus-utils-2.0.5.pom
Downloaded: https://repo.eclipse.org/content/repositories/maven_central/org/codehaus/plexus/plexus-utils/2.0.5/plexus-utils-2.0.5.pom (0 B at 0.0 KB/sec)
Downloading: https://repo.eclipse.org/content/repositories/maven_central/org/apache/ant/ant/1.8.2/ant-1.8.2.pom
Downloaded: https://repo.eclipse.org/content/repositories/maven_central/org/apache/ant/ant/1.8.2/ant-1.8.2.pom (0 B at 0.0 KB/sec)
Downloading: https://repo.eclipse.org/content/repositories/maven_central/org/apache/ant/ant-parent/1.8.2/ant-parent-1.8.2.pom
Downloaded: https://repo.eclipse.org/content/repositories/maven_central/org/apache/ant/ant-parent/1.8.2/ant-parent-1.8.2.pom (0 B at 0.0 KB/sec)
Downloading: https://repo.eclipse.org/content/repositories/maven_central/org/apache/ant/ant-launcher/1.8.2/ant-launcher-1.8.2.pom
Downloaded: https://repo.eclipse.org/content/repositories/maven_central/org/apache/ant/ant-launcher/1.8.2/ant-launcher-1.8.2.pom (0 B at 0.0 KB/sec)
Downloading: https://repo.eclipse.org/content/repositories/maven_central/org/codehaus/plexus/plexus-interpolation/1.1/plexus-interpolation-1.1.jar
Downloading: https://repo.eclipse.org/content/repositories/maven_central/org/codehaus/plexus/plexus-utils/2.0.5/plexus-utils-2.0.5.jar
Downloading: https://repo.eclipse.org/content/repositories/maven_central/org/apache/ant/ant/1.8.2/ant-1.8.2.jar
Downloading: https://repo.eclipse.org/content/repositories/maven_central/org/apache/ant/ant-launcher/1.8.2/ant-launcher-1.8.2.jar
Downloaded: https://repo.eclipse.org/content/repositories/maven_central/org/codehaus/plexus/plexus-utils/2.0.5/plexus-utils-2.0.5.jar (0 B at 0.0 KB/sec)
Downloaded: https://repo.eclipse.org/content/repositories/maven_central/org/apache/ant/ant/1.8.2/ant-1.8.2.jar (0 B at 0.0 KB/sec)
Downloaded: https://repo.eclipse.org/content/repositories/maven_central/org/apache/ant/ant-launcher/1.8.2/ant-launcher-1.8.2.jar (0 B at 0.0 KB/sec)
Downloaded: https://repo.eclipse.org/content/repositories/maven_central/org/codehaus/plexus/plexus-interpolation/1.1/plexus-interpolation-1.1.jar (0 B at 0.0 KB/sec)
[INFO] Executing tasks

main:
      [zip] Updating zip: /jobs/genie.sisu/sisu-sonar/workspace/org.eclipse.sisu.inject.site/target/org.eclipse.sisu.inject.site-0.9.0-SNAPSHOT.zip
[INFO] Executed tasks
[INFO] ------------------------------------------------------------------------
[INFO] Reactor Summary:
[INFO] 
[INFO] Sisu Inject ....................................... SUCCESS [11.398s]
[INFO] org.eclipse.sisu.inject ........................... SUCCESS [1:16.019s]
[INFO] org.eclipse.sisu.inject.extender .................. SUCCESS [1.228s]
[INFO] org.eclipse.sisu.inject.tests ..................... SUCCESS [43.284s]
[INFO] org.eclipse.sisu.inject.site ...................... SUCCESS [2.000s]
[INFO] ------------------------------------------------------------------------
[INFO] BUILD SUCCESS
[INFO] ------------------------------------------------------------------------
[INFO] Total time: 2:32.621s
[INFO] Finished at: Fri Jul 28 00:03:27 EDT 2017
[INFO] Final Memory: 49M/1911M
[INFO] ------------------------------------------------------------------------
[DEBUG] Closing connection to remote
[DEBUG] Waiting for process to finish
[DEBUG] Result: 0
[workspace] $ /shared/common/apache-maven-3.0.5/bin/mvn -f /home/hudson/genie.sisu/.hudson/jobs/sisu-sonar/workspace/pom.xml -e -B sonar:sonar -Dmaven.repo.local=/home/hudson/genie.sisu/.hudson/jobs/sisu-sonar/workspace/.maven/repo "-Dsonar.profile=Sonar way with Findbugs" -Dsonar.dynamicAnalysis=reuseReports -Dsonar.surefire.reportsPath=/home/hudson/genie.sisu/.hudson/jobs/sisu-sonar/workspace/org.eclipse.sisu.inject.tests/target/surefire-reports -Dsonar.jacoco.reportPath=/home/hudson/genie.sisu/.hudson/jobs/sisu-sonar/workspace/org.eclipse.sisu.inject.tests/target/jacoco.exec -Dsonar.skippedModules=org.eclipse.sisu.inject.tests -Dsonar.exclusions=**/asm/** -Dhttp.proxyHost=proxy.eclipse.org -Dhttp.proxyPort=9898 -Dhttps.proxyHost=proxy.eclipse.org -Dhttps.proxyPort=9898 -Dhttp.nonProxyHosts=*.eclipse.org -Dhttps.nonProxyHosts=*.eclipse.org -Dsonar.jdbc.driver=com.mysql.jdbc.Driver -Dsonar.jdbc.url=jdbc:mysql://dbmaster:3306/sonar?autoReconnect=true&useUnicode=true&characterEncoding=utf8 ******** ******** -Dsonar.host.url=https://sonar.eclipse.org
[INFO] Error stacktraces are turned on.
[INFO] Scanning for projects...
[INFO] Computing target platform for MavenProject: org.eclipse.sisu:org.eclipse.sisu.inject:0.9.0-SNAPSHOT @ /home/hudson/genie.sisu/.hudson/jobs/sisu-sonar/workspace/org.eclipse.sisu.inject/pom.xml
[INFO] Adding repository http://download.eclipse.org/tools/orbit/downloads/drops/R20150821153341/repository
[INFO] Adding repository http://git.eclipse.org/c/sisu/org.eclipse.sisu.inject.git/plain/org.eclipse.sisu.inject/build.extra?id=dca8ce63403cf1491e12e624890310240ccffb96
[INFO] Fetching content.xml from http://git.eclipse.org/c/sisu/org.eclipse.sisu.inject.git/plain/org.eclipse.sisu.inject/build.extra/content.xml?id=dca8ce63403cf1491e12e624890310240ccffb96 (0B at 0B/s)
[INFO] Fetching p2.index from http://download.eclipse.org/eclipse/updates/4.5/ (0B at 0B/s)
[INFO] Adding repository http://download.eclipse.org/eclipse/updates/4.5
[INFO] Fetching p2.index from http://download.eclipse.org/eclipse/updates/4.5/R-4.5-201506032000/ (0B at 0B/s)
[INFO] Fetching p2.index from http://download.eclipse.org/eclipse/updates/4.5/R-4.5.1-201509040015/ (0B at 0B/s)
[INFO] Fetching p2.index from http://download.eclipse.org/eclipse/updates/4.5/R-4.5.2-201602121500/ (0B at 0B/s)
[INFO] Resolving dependencies of MavenProject: org.eclipse.sisu:org.eclipse.sisu.inject:0.9.0-SNAPSHOT @ /home/hudson/genie.sisu/.hudson/jobs/sisu-sonar/workspace/org.eclipse.sisu.inject/pom.xml
[INFO] Resolving class path of MavenProject: org.eclipse.sisu:org.eclipse.sisu.inject:0.9.0-SNAPSHOT @ /home/hudson/genie.sisu/.hudson/jobs/sisu-sonar/workspace/org.eclipse.sisu.inject/pom.xml
[INFO] Computing target platform for MavenProject: org.eclipse.sisu:org.eclipse.sisu.inject.extender:0.9.0-SNAPSHOT @ /home/hudson/genie.sisu/.hudson/jobs/sisu-sonar/workspace/org.eclipse.sisu.inject.extender/pom.xml
[INFO] Resolving dependencies of MavenProject: org.eclipse.sisu:org.eclipse.sisu.inject.extender:0.9.0-SNAPSHOT @ /home/hudson/genie.sisu/.hudson/jobs/sisu-sonar/workspace/org.eclipse.sisu.inject.extender/pom.xml
[INFO] Resolving class path of MavenProject: org.eclipse.sisu:org.eclipse.sisu.inject.extender:0.9.0-SNAPSHOT @ /home/hudson/genie.sisu/.hudson/jobs/sisu-sonar/workspace/org.eclipse.sisu.inject.extender/pom.xml
[INFO] Computing target platform for MavenProject: org.eclipse.sisu:org.eclipse.sisu.inject.site:0.9.0-SNAPSHOT @ /home/hudson/genie.sisu/.hudson/jobs/sisu-sonar/workspace/org.eclipse.sisu.inject.site/pom.xml
[INFO] Resolving dependencies of MavenProject: org.eclipse.sisu:org.eclipse.sisu.inject.site:0.9.0-SNAPSHOT @ /home/hudson/genie.sisu/.hudson/jobs/sisu-sonar/workspace/org.eclipse.sisu.inject.site/pom.xml
[INFO] Resolving class path of MavenProject: org.eclipse.sisu:org.eclipse.sisu.inject.site:0.9.0-SNAPSHOT @ /home/hudson/genie.sisu/.hudson/jobs/sisu-sonar/workspace/org.eclipse.sisu.inject.site/pom.xml
[INFO] ------------------------------------------------------------------------
[INFO] Reactor Build Order:
[INFO] 
[INFO] Sisu Inject
[INFO] org.eclipse.sisu.inject
[INFO] org.eclipse.sisu.inject.extender
[INFO] org.eclipse.sisu.inject.tests
[INFO] org.eclipse.sisu.inject.site
Downloading: https://repo.eclipse.org/content/repositories/maven_central/org/apache/maven/plugins/maven-antrun-plugin/1.3/maven-antrun-plugin-1.3.pom
Downloaded: https://repo.eclipse.org/content/repositories/maven_central/org/apache/maven/plugins/maven-antrun-plugin/1.3/maven-antrun-plugin-1.3.pom (0 B at 0.0 KB/sec)
Downloading: https://repo.eclipse.org/content/repositories/maven_central/org/apache/maven/plugins/maven-plugins/12/maven-plugins-12.pom
Downloaded: https://repo.eclipse.org/content/repositories/maven_central/org/apache/maven/plugins/maven-plugins/12/maven-plugins-12.pom (0 B at 0.0 KB/sec)
Downloading: https://repo.eclipse.org/content/repositories/maven_central/org/apache/maven/plugins/maven-antrun-plugin/1.3/maven-antrun-plugin-1.3.jar
Downloaded: https://repo.eclipse.org/content/repositories/maven_central/org/apache/maven/plugins/maven-antrun-plugin/1.3/maven-antrun-plugin-1.3.jar (0 B at 0.0 KB/sec)
Downloading: https://repo.eclipse.org/content/repositories/maven_central/org/apache/maven/plugins/maven-assembly-plugin/2.2-beta-5/maven-assembly-plugin-2.2-beta-5.pom
Downloaded: https://repo.eclipse.org/content/repositories/maven_central/org/apache/maven/plugins/maven-assembly-plugin/2.2-beta-5/maven-assembly-plugin-2.2-beta-5.pom (0 B at 0.0 KB/sec)
Downloading: https://repo.eclipse.org/content/repositories/maven_central/org/apache/maven/plugins/maven-plugins/16/maven-plugins-16.pom
Downloaded: https://repo.eclipse.org/content/repositories/maven_central/org/apache/maven/plugins/maven-plugins/16/maven-plugins-16.pom (0 B at 0.0 KB/sec)
Downloading: https://repo.eclipse.org/content/repositories/maven_central/org/apache/maven/plugins/maven-assembly-plugin/2.2-beta-5/maven-assembly-plugin-2.2-beta-5.jar
Downloaded: https://repo.eclipse.org/content/repositories/maven_central/org/apache/maven/plugins/maven-assembly-plugin/2.2-beta-5/maven-assembly-plugin-2.2-beta-5.jar (0 B at 0.0 KB/sec)
Downloading: https://repo.eclipse.org/content/repositories/maven_central/org/apache/maven/plugins/maven-dependency-plugin/2.1/maven-dependency-plugin-2.1.pom
Downloaded: https://repo.eclipse.org/content/repositories/maven_central/org/apache/maven/plugins/maven-dependency-plugin/2.1/maven-dependency-plugin-2.1.pom (0 B at 0.0 KB/sec)
Downloading: https://repo.eclipse.org/content/repositories/maven_central/org/apache/maven/plugins/maven-dependency-plugin/2.1/maven-dependency-plugin-2.1.jar
Downloaded: https://repo.eclipse.org/content/repositories/maven_central/org/apache/maven/plugins/maven-dependency-plugin/2.1/maven-dependency-plugin-2.1.jar (0 B at 0.0 KB/sec)
Downloading: https://repo.eclipse.org/content/repositories/maven_central/org/apache/maven/plugins/maven-enforcer-plugin/1.3.1/maven-enforcer-plugin-1.3.1.pom
Downloaded: https://repo.eclipse.org/content/repositories/maven_central/org/apache/maven/plugins/maven-enforcer-plugin/1.3.1/maven-enforcer-plugin-1.3.1.pom (0 B at 0.0 KB/sec)
Downloading: https://repo.eclipse.org/content/repositories/maven_central/org/apache/maven/enforcer/enforcer/1.3.1/enforcer-1.3.1.pom
Downloaded: https://repo.eclipse.org/content/repositories/maven_central/org/apache/maven/enforcer/enforcer/1.3.1/enforcer-1.3.1.pom (0 B at 0.0 KB/sec)
Downloading: https://repo.eclipse.org/content/repositories/maven_central/org/apache/maven/plugins/maven-enforcer-plugin/1.3.1/maven-enforcer-plugin-1.3.1.jar
Downloaded: https://repo.eclipse.org/content/repositories/maven_central/org/apache/maven/plugins/maven-enforcer-plugin/1.3.1/maven-enforcer-plugin-1.3.1.jar (0 B at 0.0 KB/sec)
Downloading: https://repo.eclipse.org/content/repositories/maven_central/org/sonatype/plugins/nexus-staging-maven-plugin/1.6.4/nexus-staging-maven-plugin-1.6.4.pom
Downloaded: https://repo.eclipse.org/content/repositories/maven_central/org/sonatype/plugins/nexus-staging-maven-plugin/1.6.4/nexus-staging-maven-plugin-1.6.4.pom (0 B at 0.0 KB/sec)
Downloading: https://repo.eclipse.org/content/repositories/maven_central/org/sonatype/nexus/maven/nexus-staging/1.6.4/nexus-staging-1.6.4.pom
Downloaded: https://repo.eclipse.org/content/repositories/maven_central/org/sonatype/nexus/maven/nexus-staging/1.6.4/nexus-staging-1.6.4.pom (0 B at 0.0 KB/sec)
Downloading: https://repo.eclipse.org/content/repositories/maven_central/org/sonatype/nexus/maven/nexus-maven-plugins/1.6.4/nexus-maven-plugins-1.6.4.pom
Downloaded: https://repo.eclipse.org/content/repositories/maven_central/org/sonatype/nexus/maven/nexus-maven-plugins/1.6.4/nexus-maven-plugins-1.6.4.pom (0 B at 0.0 KB/sec)
Downloading: https://repo.eclipse.org/content/repositories/maven_central/org/sonatype/buildsupport/public-parent/6/public-parent-6.pom
Downloaded: https://repo.eclipse.org/content/repositories/maven_central/org/sonatype/buildsupport/public-parent/6/public-parent-6.pom (0 B at 0.0 KB/sec)
Downloading: https://repo.eclipse.org/content/repositories/maven_central/org/sonatype/buildsupport/buildsupport/6/buildsupport-6.pom
Downloaded: https://repo.eclipse.org/content/repositories/maven_central/org/sonatype/buildsupport/buildsupport/6/buildsupport-6.pom (0 B at 0.0 KB/sec)
Downloading: https://repo.eclipse.org/content/repositories/maven_central/org/sonatype/plugins/nexus-staging-maven-plugin/1.6.4/nexus-staging-maven-plugin-1.6.4.jar
Downloaded: https://repo.eclipse.org/content/repositories/maven_central/org/sonatype/plugins/nexus-staging-maven-plugin/1.6.4/nexus-staging-maven-plugin-1.6.4.jar (0 B at 0.0 KB/sec)
Downloading: https://repo.eclipse.org/content/repositories/maven_central/org/apache/maven/plugins/maven-release-plugin/2.5.1/maven-release-plugin-2.5.1.pom
Downloaded: https://repo.eclipse.org/content/repositories/maven_central/org/apache/maven/plugins/maven-release-plugin/2.5.1/maven-release-plugin-2.5.1.pom (0 B at 0.0 KB/sec)
Downloading: https://repo.eclipse.org/content/repositories/maven_central/org/apache/maven/release/maven-release/2.5.1/maven-release-2.5.1.pom
Downloaded: https://repo.eclipse.org/content/repositories/maven_central/org/apache/maven/release/maven-release/2.5.1/maven-release-2.5.1.pom (0 B at 0.0 KB/sec)
Downloading: https://repo.eclipse.org/content/repositories/maven_central/org/apache/maven/plugins/maven-release-plugin/2.5.1/maven-release-plugin-2.5.1.jar
Downloaded: https://repo.eclipse.org/content/repositories/maven_central/org/apache/maven/plugins/maven-release-plugin/2.5.1/maven-release-plugin-2.5.1.jar (0 B at 0.0 KB/sec)
Downloading: https://repo.eclipse.org/content/repositories/maven_central/org/apache/maven/plugins/maven-metadata.xml
Downloading: https://repo.eclipse.org/content/repositories/maven_central/org/codehaus/mojo/maven-metadata.xml
Downloaded: https://repo.eclipse.org/content/repositories/maven_central/org/apache/maven/plugins/maven-metadata.xml (13 KB at 197.3 KB/sec)
Downloaded: https://repo.eclipse.org/content/repositories/maven_central/org/codehaus/mojo/maven-metadata.xml (20 KB at 188.6 KB/sec)
Downloading: https://repo.eclipse.org/content/repositories/maven_central/org/codehaus/mojo/sonar-maven-plugin/maven-metadata.xml
Downloaded: https://repo.eclipse.org/content/repositories/maven_central/org/codehaus/mojo/sonar-maven-plugin/maven-metadata.xml (941 B at 20.4 KB/sec)
Downloading: https://repo.eclipse.org/content/repositories/maven_central/org/codehaus/mojo/sonar-maven-plugin/3.3.0.603/sonar-maven-plugin-3.3.0.603.pom
Downloaded: https://repo.eclipse.org/content/repositories/maven_central/org/codehaus/mojo/sonar-maven-plugin/3.3.0.603/sonar-maven-plugin-3.3.0.603.pom (2 KB at 34.6 KB/sec)
Downloading: https://repo.eclipse.org/content/repositories/maven_central/org/codehaus/mojo/mojo-parent/40/mojo-parent-40.pom
Downloaded: https://repo.eclipse.org/content/repositories/maven_central/org/codehaus/mojo/mojo-parent/40/mojo-parent-40.pom (33 KB at 656.7 KB/sec)
Downloading: https://repo.eclipse.org/content/repositories/maven_central/org/sonarsource/scanner/maven/sonar-maven-plugin/3.3.0.603/sonar-maven-plugin-3.3.0.603.pom
Downloaded: https://repo.eclipse.org/content/repositories/maven_central/org/sonarsource/scanner/maven/sonar-maven-plugin/3.3.0.603/sonar-maven-plugin-3.3.0.603.pom (9 KB at 170.7 KB/sec)
Downloading: https://repo.eclipse.org/content/repositories/maven_central/org/sonarsource/parent/parent/40/parent-40.pom
Downloaded: https://repo.eclipse.org/content/repositories/maven_central/org/sonarsource/parent/parent/40/parent-40.pom (30 KB at 748.1 KB/sec)
Downloading: https://repo.eclipse.org/content/repositories/maven_central/org/sonarsource/scanner/maven/sonar-maven-plugin/3.3.0.603/sonar-maven-plugin-3.3.0.603.jar
Downloaded: https://repo.eclipse.org/content/repositories/maven_central/org/sonarsource/scanner/maven/sonar-maven-plugin/3.3.0.603/sonar-maven-plugin-3.3.0.603.jar (54 KB at 1576.7 KB/sec)
[INFO]                                                                         
[INFO] ------------------------------------------------------------------------
[INFO] Building Sisu Inject 0.9.0-SNAPSHOT
[INFO] ------------------------------------------------------------------------
Downloading: https://oss.sonatype.org/content/repositories/snapshots/org/eclipse/sisu/org.eclipse.sisu.inject/0.9.0-SNAPSHOT/maven-metadata.xml
Downloaded: https://oss.sonatype.org/content/repositories/snapshots/org/eclipse/sisu/org.eclipse.sisu.inject/0.9.0-SNAPSHOT/maven-metadata.xml (2 KB at 5.3 KB/sec)
Downloading: https://oss.sonatype.org/content/repositories/snapshots/org/eclipse/sisu/org.eclipse.sisu.inject/0.9.0-SNAPSHOT/org.eclipse.sisu.inject-0.9.0-20161215.012627-9.pom
Downloaded: https://oss.sonatype.org/content/repositories/snapshots/org/eclipse/sisu/org.eclipse.sisu.inject/0.9.0-SNAPSHOT/org.eclipse.sisu.inject-0.9.0-20161215.012627-9.pom (4 KB at 32.1 KB/sec)
Downloading: https://oss.sonatype.org/content/repositories/snapshots/org/eclipse/sisu/org.eclipse.sisu.inject/0.9.0-SNAPSHOT/org.eclipse.sisu.inject-0.9.0-20161215.012627-9.jar
Downloaded: https://oss.sonatype.org/content/repositories/snapshots/org/eclipse/sisu/org.eclipse.sisu.inject/0.9.0-SNAPSHOT/org.eclipse.sisu.inject-0.9.0-20161215.012627-9.jar (381 KB at 1136.1 KB/sec)
Downloading: https://oss.sonatype.org/content/repositories/snapshots/org/eclipse/sisu/org.eclipse.sisu.inject.extender/0.9.0-SNAPSHOT/maven-metadata.xml
Downloaded: https://oss.sonatype.org/content/repositories/snapshots/org/eclipse/sisu/org.eclipse.sisu.inject.extender/0.9.0-SNAPSHOT/maven-metadata.xml (2 KB at 12.6 KB/sec)
Downloading: https://oss.sonatype.org/content/repositories/snapshots/org/eclipse/sisu/org.eclipse.sisu.inject.extender/0.9.0-SNAPSHOT/org.eclipse.sisu.inject.extender-0.9.0-20161215.012640-9.pom
Downloaded: https://oss.sonatype.org/content/repositories/snapshots/org/eclipse/sisu/org.eclipse.sisu.inject.extender/0.9.0-SNAPSHOT/org.eclipse.sisu.inject.extender-0.9.0-20161215.012640-9.pom (2 KB at 13.6 KB/sec)
Downloading: https://oss.sonatype.org/content/repositories/snapshots/org/eclipse/sisu/org.eclipse.sisu.inject.extender/0.9.0-SNAPSHOT/org.eclipse.sisu.inject.extender-0.9.0-20161215.012640-9.jar
Downloaded: https://oss.sonatype.org/content/repositories/snapshots/org/eclipse/sisu/org.eclipse.sisu.inject.extender/0.9.0-SNAPSHOT/org.eclipse.sisu.inject.extender-0.9.0-20161215.012640-9.jar (2 KB at 14.3 KB/sec)
[INFO] 
[INFO] --- sonar-maven-plugin:3.3.0.603:sonar (default-cli) @ sisu-inject ---
Downloading: https://repo.eclipse.org/content/repositories/maven_central/org/apache/maven/shared/maven-dependency-tree/2.2/maven-dependency-tree-2.2.pom
Downloaded: https://repo.eclipse.org/content/repositories/maven_central/org/apache/maven/shared/maven-dependency-tree/2.2/maven-dependency-tree-2.2.pom (8 KB at 295.5 KB/sec)
Downloading: https://repo.eclipse.org/content/repositories/maven_central/org/apache/maven/shared/maven-shared-components/20/maven-shared-components-20.pom
Downloaded: https://repo.eclipse.org/content/repositories/maven_central/org/apache/maven/shared/maven-shared-components/20/maven-shared-components-20.pom (5 KB at 138.5 KB/sec)
Downloading: https://repo.eclipse.org/content/repositories/maven_central/org/sonatype/plexus/plexus-sec-dispatcher/1.4/plexus-sec-dispatcher-1.4.pom
Downloaded: https://repo.eclipse.org/content/repositories/maven_central/org/sonatype/plexus/plexus-sec-dispatcher/1.4/plexus-sec-dispatcher-1.4.pom (0 B at 0.0 KB/sec)
Downloading: https://repo.eclipse.org/content/repositories/maven_central/org/codehaus/plexus/plexus-utils/3.0.22/plexus-utils-3.0.22.pom
Downloaded: https://repo.eclipse.org/content/repositories/maven_central/org/codehaus/plexus/plexus-utils/3.0.22/plexus-utils-3.0.22.pom (4 KB at 4.1 KB/sec)
Downloading: https://repo.eclipse.org/content/repositories/maven_central/org/sonarsource/scanner/api/sonar-scanner-api/2.9.0.887/sonar-scanner-api-2.9.0.887.pom
Downloaded: https://repo.eclipse.org/content/repositories/maven_central/org/sonarsource/scanner/api/sonar-scanner-api/2.9.0.887/sonar-scanner-api-2.9.0.887.pom (5 KB at 105.2 KB/sec)
Downloading: https://repo.eclipse.org/content/repositories/maven_central/org/sonarsource/scanner/api/sonar-scanner-api-parent/2.9.0.887/sonar-scanner-api-parent-2.9.0.887.pom
Downloaded: https://repo.eclipse.org/content/repositories/maven_central/org/sonarsource/scanner/api/sonar-scanner-api-parent/2.9.0.887/sonar-scanner-api-parent-2.9.0.887.pom (5 KB at 133.8 KB/sec)
Downloading: https://repo.eclipse.org/content/repositories/maven_central/commons-lang/commons-lang/2.6/commons-lang-2.6.pom
Downloaded: https://repo.eclipse.org/content/repositories/maven_central/commons-lang/commons-lang/2.6/commons-lang-2.6.pom (0 B at 0.0 KB/sec)
Downloading: https://repo.eclipse.org/content/repositories/maven_central/org/apache/commons/commons-parent/17/commons-parent-17.pom
Downloaded: https://repo.eclipse.org/content/repositories/maven_central/org/apache/commons/commons-parent/17/commons-parent-17.pom (0 B at 0.0 KB/sec)
Downloading: https://repo.eclipse.org/content/repositories/maven_central/com/google/code/findbugs/jsr305/2.0.3/jsr305-2.0.3.pom
Downloaded: https://repo.eclipse.org/content/repositories/maven_central/com/google/code/findbugs/jsr305/2.0.3/jsr305-2.0.3.pom (0 B at 0.0 KB/sec)
Downloading: https://repo.eclipse.org/content/repositories/maven_central/org/apache/maven/shared/maven-dependency-tree/2.2/maven-dependency-tree-2.2.jar
Downloading: https://repo.eclipse.org/content/repositories/maven_central/org/sonatype/plexus/plexus-sec-dispatcher/1.4/plexus-sec-dispatcher-1.4.jar
Downloading: https://repo.eclipse.org/content/repositories/maven_central/org/codehaus/plexus/plexus-utils/3.0.22/plexus-utils-3.0.22.jar
Downloading: https://repo.eclipse.org/content/repositories/maven_central/org/sonarsource/scanner/api/sonar-scanner-api/2.9.0.887/sonar-scanner-api-2.9.0.887.jar
Downloading: https://repo.eclipse.org/content/repositories/maven_central/commons-lang/commons-lang/2.6/commons-lang-2.6.jar
Downloaded: https://repo.eclipse.org/content/repositories/maven_central/commons-lang/commons-lang/2.6/commons-lang-2.6.jar (0 B at 0.0 KB/sec)
Downloading: https://repo.eclipse.org/content/repositories/maven_central/com/google/code/findbugs/jsr305/2.0.3/jsr305-2.0.3.jar
Downloaded: https://repo.eclipse.org/content/repositories/maven_central/org/sonatype/plexus/plexus-sec-dispatcher/1.4/plexus-sec-dispatcher-1.4.jar (0 B at 0.0 KB/sec)
Downloaded: https://repo.eclipse.org/content/repositories/maven_central/org/apache/maven/shared/maven-dependency-tree/2.2/maven-dependency-tree-2.2.jar (63 KB at 1089.1 KB/sec)
Downloaded: https://repo.eclipse.org/content/repositories/maven_central/com/google/code/findbugs/jsr305/2.0.3/jsr305-2.0.3.jar (0 B at 0.0 KB/sec)
Downloaded: https://repo.eclipse.org/content/repositories/maven_central/org/codehaus/plexus/plexus-utils/3.0.22/plexus-utils-3.0.22.jar (240 KB at 2657.3 KB/sec)
Downloaded: https://repo.eclipse.org/content/repositories/maven_central/org/sonarsource/scanner/api/sonar-scanner-api/2.9.0.887/sonar-scanner-api-2.9.0.887.jar (520 KB at 4723.3 KB/sec)
Jul 28, 2017 12:03:48 AM org.sonatype.guice.bean.reflect.Logs$JULSink warn
WARNING: Error injecting: org.sonarsource.scanner.maven.SonarQubeMojo
java.lang.TypeNotPresentException: Type org.sonarsource.scanner.maven.SonarQubeMojo not present
	at org.sonatype.guice.bean.reflect.URLClassSpace.loadClass(URLClassSpace.java:109)
	at org.sonatype.guice.bean.reflect.NamedClass.load(NamedClass.java:45)
	at org.sonatype.guice.bean.reflect.AbstractDeferredClass.get(AbstractDeferredClass.java:45)
	at com.google.inject.internal.ProviderInternalFactory.provision(ProviderInternalFactory.java:84)
	at com.google.inject.internal.InternalFactoryToInitializableAdapter.provision(InternalFactoryToInitializableAdapter.java:52)
	at com.google.inject.internal.ProviderInternalFactory$1.call(ProviderInternalFactory.java:70)
	at com.google.inject.internal.ProvisionListenerStackCallback$Provision.provision(ProvisionListenerStackCallback.java:100)
	at org.sonatype.guice.plexus.lifecycles.PlexusLifecycleManager.onProvision(PlexusLifecycleManager.java:138)
	at com.google.inject.internal.ProvisionListenerStackCallback$Provision.provision(ProvisionListenerStackCallback.java:108)
	at com.google.inject.internal.ProvisionListenerStackCallback.provision(ProvisionListenerStackCallback.java:55)
	at com.google.inject.internal.ProviderInternalFactory.circularGet(ProviderInternalFactory.java:68)
	at com.google.inject.internal.InternalFactoryToInitializableAdapter.get(InternalFactoryToInitializableAdapter.java:45)
	at com.google.inject.internal.InjectorImpl$3$1.call(InjectorImpl.java:965)
	at com.google.inject.internal.InjectorImpl.callInContext(InjectorImpl.java:1011)
	at com.google.inject.internal.InjectorImpl$3.get(InjectorImpl.java:961)
	at com.google.inject.Scopes$1$1.get(Scopes.java:59)
	at org.sonatype.guice.bean.locators.LazyBeanEntry.getValue(LazyBeanEntry.java:83)
	at org.sonatype.guice.plexus.locators.LazyPlexusBean.getValue(LazyPlexusBean.java:49)
	at org.codehaus.plexus.DefaultPlexusContainer.lookup(DefaultPlexusContainer.java:253)
	at org.codehaus.plexus.DefaultPlexusContainer.lookup(DefaultPlexusContainer.java:245)
	at org.apache.maven.plugin.internal.DefaultMavenPluginManager.getConfiguredMojo(DefaultMavenPluginManager.java:455)
	at org.apache.maven.plugin.DefaultBuildPluginManager.executeMojo(DefaultBuildPluginManager.java:92)
	at org.apache.maven.lifecycle.internal.MojoExecutor.execute(MojoExecutor.java:209)
	at org.apache.maven.lifecycle.internal.MojoExecutor.execute(MojoExecutor.java:153)
	at org.apache.maven.lifecycle.internal.MojoExecutor.execute(MojoExecutor.java:145)
	at org.apache.maven.lifecycle.internal.LifecycleModuleBuilder.buildProject(LifecycleModuleBuilder.java:84)
	at org.apache.maven.lifecycle.internal.LifecycleModuleBuilder.buildProject(LifecycleModuleBuilder.java:59)
	at org.apache.maven.lifecycle.internal.LifecycleStarter.singleThreadedBuild(LifecycleStarter.java:183)
	at org.apache.maven.lifecycle.internal.LifecycleStarter.execute(LifecycleStarter.java:161)
	at org.apache.maven.DefaultMaven.doExecute(DefaultMaven.java:320)
	at org.apache.maven.DefaultMaven.execute(DefaultMaven.java:156)
	at org.apache.maven.cli.MavenCli.execute(MavenCli.java:537)
	at org.apache.maven.cli.MavenCli.doMain(MavenCli.java:196)
	at org.apache.maven.cli.MavenCli.main(MavenCli.java:141)
	at sun.reflect.NativeMethodAccessorImpl.invoke0(Native Method)
	at sun.reflect.NativeMethodAccessorImpl.invoke(NativeMethodAccessorImpl.java:57)
	at sun.reflect.DelegatingMethodAccessorImpl.invoke(DelegatingMethodAccessorImpl.java:43)
	at java.lang.reflect.Method.invoke(Method.java:606)
	at org.codehaus.plexus.classworlds.launcher.Launcher.launchEnhanced(Launcher.java:290)
	at org.codehaus.plexus.classworlds.launcher.Launcher.launch(Launcher.java:230)
	at org.codehaus.plexus.classworlds.launcher.Launcher.mainWithExitCode(Launcher.java:409)
	at org.codehaus.plexus.classworlds.launcher.Launcher.main(Launcher.java:352)
Caused by: java.lang.UnsupportedClassVersionError: org/sonarsource/scanner/maven/SonarQubeMojo : Unsupported major.minor version 52.0
	at java.lang.ClassLoader.defineClass1(Native Method)
	at java.lang.ClassLoader.defineClass(ClassLoader.java:800)
	at java.security.SecureClassLoader.defineClass(SecureClassLoader.java:142)
	at java.net.URLClassLoader.defineClass(URLClassLoader.java:449)
	at java.net.URLClassLoader.access$100(URLClassLoader.java:71)
	at java.net.URLClassLoader$1.run(URLClassLoader.java:361)
	at java.net.URLClassLoader$1.run(URLClassLoader.java:355)
	at java.security.AccessController.doPrivileged(Native Method)
	at java.net.URLClassLoader.findClass(URLClassLoader.java:354)
	at org.codehaus.plexus.classworlds.realm.ClassRealm.loadClassFromSelf(ClassRealm.java:386)
	at org.codehaus.plexus.classworlds.strategy.SelfFirstStrategy.loadClass(SelfFirstStrategy.java:42)
	at org.codehaus.plexus.classworlds.realm.ClassRealm.loadClass(ClassRealm.java:244)
	at org.codehaus.plexus.classworlds.realm.ClassRealm.loadClass(ClassRealm.java:230)
	at org.sonatype.guice.bean.reflect.URLClassSpace.loadClass(URLClassSpace.java:101)
	... 41 more

[INFO] ------------------------------------------------------------------------
[INFO] Reactor Summary:
[INFO] 
[INFO] Sisu Inject ....................................... FAILURE [4.514s]
[INFO] org.eclipse.sisu.inject ........................... SKIPPED
[INFO] org.eclipse.sisu.inject.extender .................. SKIPPED
[INFO] org.eclipse.sisu.inject.tests ..................... SKIPPED
[INFO] org.eclipse.sisu.inject.site ...................... SKIPPED
[INFO] ------------------------------------------------------------------------
[INFO] BUILD FAILURE
[INFO] ------------------------------------------------------------------------
[INFO] Total time: 18.034s
[INFO] Finished at: Fri Jul 28 00:03:48 EDT 2017
[INFO] Final Memory: 41M/1931M
[INFO] ------------------------------------------------------------------------
[ERROR] Failed to execute goal org.sonarsource.scanner.maven:sonar-maven-plugin:3.3.0.603:sonar (default-cli) on project sisu-inject: Execution default-cli of goal org.sonarsource.scanner.maven:sonar-maven-plugin:3.3.0.603:sonar failed: Unable to load the mojo 'sonar' in the plugin 'org.sonarsource.scanner.maven:sonar-maven-plugin:3.3.0.603' due to an API incompatibility: org.codehaus.plexus.component.repository.exception.ComponentLookupException: org/sonarsource/scanner/maven/SonarQubeMojo : Unsupported major.minor version 52.0
[ERROR] -----------------------------------------------------
[ERROR] realm =    plugin>org.codehaus.mojo:sonar-maven-plugin:3.3.0.603
[ERROR] strategy = org.codehaus.plexus.classworlds.strategy.SelfFirstStrategy
[ERROR] urls[0] = file:/home/hudson/genie.sisu/.hudson/jobs/sisu-sonar/workspace/.maven/repo/org/sonarsource/scanner/maven/sonar-maven-plugin/3.3.0.603/sonar-maven-plugin-3.3.0.603.jar
[ERROR] urls[1] = file:/home/hudson/genie.sisu/.hudson/jobs/sisu-sonar/workspace/.maven/repo/org/apache/maven/shared/maven-dependency-tree/2.2/maven-dependency-tree-2.2.jar
[ERROR] urls[2] = file:/home/hudson/genie.sisu/.hudson/jobs/sisu-sonar/workspace/.maven/repo/org/codehaus/plexus/plexus-component-annotations/1.5.5/plexus-component-annotations-1.5.5.jar
[ERROR] urls[3] = file:/home/hudson/genie.sisu/.hudson/jobs/sisu-sonar/workspace/.maven/repo/org/eclipse/aether/aether-util/0.9.0.M2/aether-util-0.9.0.M2.jar
[ERROR] urls[4] = file:/home/hudson/genie.sisu/.hudson/jobs/sisu-sonar/workspace/.maven/repo/org/sonatype/plexus/plexus-sec-dispatcher/1.4/plexus-sec-dispatcher-1.4.jar
[ERROR] urls[5] = file:/home/hudson/genie.sisu/.hudson/jobs/sisu-sonar/workspace/.maven/repo/org/sonatype/plexus/plexus-cipher/1.4/plexus-cipher-1.4.jar
[ERROR] urls[6] = file:/home/hudson/genie.sisu/.hudson/jobs/sisu-sonar/workspace/.maven/repo/org/codehaus/plexus/plexus-utils/3.0.22/plexus-utils-3.0.22.jar
[ERROR] urls[7] = file:/home/hudson/genie.sisu/.hudson/jobs/sisu-sonar/workspace/.maven/repo/org/sonarsource/scanner/api/sonar-scanner-api/2.9.0.887/sonar-scanner-api-2.9.0.887.jar
[ERROR] urls[8] = file:/home/hudson/genie.sisu/.hudson/jobs/sisu-sonar/workspace/.maven/repo/commons-lang/commons-lang/2.6/commons-lang-2.6.jar
[ERROR] urls[9] = file:/home/hudson/genie.sisu/.hudson/jobs/sisu-sonar/workspace/.maven/repo/com/google/code/findbugs/jsr305/2.0.3/jsr305-2.0.3.jar
[ERROR] Number of foreign imports: 1
[ERROR] import: Entry[import  from realm ClassRealm[maven.api, parent: null]]
[ERROR] 
[ERROR] -----------------------------------------------------
[ERROR] -> [Help 1]
org.apache.maven.lifecycle.LifecycleExecutionException: Failed to execute goal org.sonarsource.scanner.maven:sonar-maven-plugin:3.3.0.603:sonar (default-cli) on project sisu-inject: Execution default-cli of goal org.sonarsource.scanner.maven:sonar-maven-plugin:3.3.0.603:sonar failed: Unable to load the mojo 'sonar' in the plugin 'org.sonarsource.scanner.maven:sonar-maven-plugin:3.3.0.603' due to an API incompatibility: org.codehaus.plexus.component.repository.exception.ComponentLookupException: org/sonarsource/scanner/maven/SonarQubeMojo : Unsupported major.minor version 52.0
-----------------------------------------------------
realm =    plugin>org.codehaus.mojo:sonar-maven-plugin:3.3.0.603
strategy = org.codehaus.plexus.classworlds.strategy.SelfFirstStrategy
urls[0] = file:/home/hudson/genie.sisu/.hudson/jobs/sisu-sonar/workspace/.maven/repo/org/sonarsource/scanner/maven/sonar-maven-plugin/3.3.0.603/sonar-maven-plugin-3.3.0.603.jar
urls[1] = file:/home/hudson/genie.sisu/.hudson/jobs/sisu-sonar/workspace/.maven/repo/org/apache/maven/shared/maven-dependency-tree/2.2/maven-dependency-tree-2.2.jar
urls[2] = file:/home/hudson/genie.sisu/.hudson/jobs/sisu-sonar/workspace/.maven/repo/org/codehaus/plexus/plexus-component-annotations/1.5.5/plexus-component-annotations-1.5.5.jar
urls[3] = file:/home/hudson/genie.sisu/.hudson/jobs/sisu-sonar/workspace/.maven/repo/org/eclipse/aether/aether-util/0.9.0.M2/aether-util-0.9.0.M2.jar
urls[4] = file:/home/hudson/genie.sisu/.hudson/jobs/sisu-sonar/workspace/.maven/repo/org/sonatype/plexus/plexus-sec-dispatcher/1.4/plexus-sec-dispatcher-1.4.jar
urls[5] = file:/home/hudson/genie.sisu/.hudson/jobs/sisu-sonar/workspace/.maven/repo/org/sonatype/plexus/plexus-cipher/1.4/plexus-cipher-1.4.jar
urls[6] = file:/home/hudson/genie.sisu/.hudson/jobs/sisu-sonar/workspace/.maven/repo/org/codehaus/plexus/plexus-utils/3.0.22/plexus-utils-3.0.22.jar
urls[7] = file:/home/hudson/genie.sisu/.hudson/jobs/sisu-sonar/workspace/.maven/repo/org/sonarsource/scanner/api/sonar-scanner-api/2.9.0.887/sonar-scanner-api-2.9.0.887.jar
urls[8] = file:/home/hudson/genie.sisu/.hudson/jobs/sisu-sonar/workspace/.maven/repo/commons-lang/commons-lang/2.6/commons-lang-2.6.jar
urls[9] = file:/home/hudson/genie.sisu/.hudson/jobs/sisu-sonar/workspace/.maven/repo/com/google/code/findbugs/jsr305/2.0.3/jsr305-2.0.3.jar
Number of foreign imports: 1
import: Entry[import  from realm ClassRealm[maven.api, parent: null]]

-----------------------------------------------------

	at org.apache.maven.lifecycle.internal.MojoExecutor.execute(MojoExecutor.java:225)
	at org.apache.maven.lifecycle.internal.MojoExecutor.execute(MojoExecutor.java:153)
	at org.apache.maven.lifecycle.internal.MojoExecutor.execute(MojoExecutor.java:145)
	at org.apache.maven.lifecycle.internal.LifecycleModuleBuilder.buildProject(LifecycleModuleBuilder.java:84)
	at org.apache.maven.lifecycle.internal.LifecycleModuleBuilder.buildProject(LifecycleModuleBuilder.java:59)
	at org.apache.maven.lifecycle.internal.LifecycleStarter.singleThreadedBuild(LifecycleStarter.java:183)
	at org.apache.maven.lifecycle.internal.LifecycleStarter.execute(LifecycleStarter.java:161)
	at org.apache.maven.DefaultMaven.doExecute(DefaultMaven.java:320)
	at org.apache.maven.DefaultMaven.execute(DefaultMaven.java:156)
	at org.apache.maven.cli.MavenCli.execute(MavenCli.java:537)
	at org.apache.maven.cli.MavenCli.doMain(MavenCli.java:196)
	at org.apache.maven.cli.MavenCli.main(MavenCli.java:141)
	at sun.reflect.NativeMethodAccessorImpl.invoke0(Native Method)
	at sun.reflect.NativeMethodAccessorImpl.invoke(NativeMethodAccessorImpl.java:57)
	at sun.reflect.DelegatingMethodAccessorImpl.invoke(DelegatingMethodAccessorImpl.java:43)
	at java.lang.reflect.Method.invoke(Method.java:606)
	at org.codehaus.plexus.classworlds.launcher.Launcher.launchEnhanced(Launcher.java:290)
	at org.codehaus.plexus.classworlds.launcher.Launcher.launch(Launcher.java:230)
	at org.codehaus.plexus.classworlds.launcher.Launcher.mainWithExitCode(Launcher.java:409)
	at org.codehaus.plexus.classworlds.launcher.Launcher.main(Launcher.java:352)
Caused by: org.apache.maven.plugin.PluginExecutionException: Execution default-cli of goal org.sonarsource.scanner.maven:sonar-maven-plugin:3.3.0.603:sonar failed: Unable to load the mojo 'sonar' in the plugin 'org.sonarsource.scanner.maven:sonar-maven-plugin:3.3.0.603' due to an API incompatibility: org.codehaus.plexus.component.repository.exception.ComponentLookupException: org/sonarsource/scanner/maven/SonarQubeMojo : Unsupported major.minor version 52.0
-----------------------------------------------------
realm =    plugin>org.codehaus.mojo:sonar-maven-plugin:3.3.0.603
strategy = org.codehaus.plexus.classworlds.strategy.SelfFirstStrategy
urls[0] = file:/home/hudson/genie.sisu/.hudson/jobs/sisu-sonar/workspace/.maven/repo/org/sonarsource/scanner/maven/sonar-maven-plugin/3.3.0.603/sonar-maven-plugin-3.3.0.603.jar
urls[1] = file:/home/hudson/genie.sisu/.hudson/jobs/sisu-sonar/workspace/.maven/repo/org/apache/maven/shared/maven-dependency-tree/2.2/maven-dependency-tree-2.2.jar
urls[2] = file:/home/hudson/genie.sisu/.hudson/jobs/sisu-sonar/workspace/.maven/repo/org/codehaus/plexus/plexus-component-annotations/1.5.5/plexus-component-annotations-1.5.5.jar
urls[3] = file:/home/hudson/genie.sisu/.hudson/jobs/sisu-sonar/workspace/.maven/repo/org/eclipse/aether/aether-util/0.9.0.M2/aether-util-0.9.0.M2.jar
urls[4] = file:/home/hudson/genie.sisu/.hudson/jobs/sisu-sonar/workspace/.maven/repo/org/sonatype/plexus/plexus-sec-dispatcher/1.4/plexus-sec-dispatcher-1.4.jar
urls[5] = file:/home/hudson/genie.sisu/.hudson/jobs/sisu-sonar/workspace/.maven/repo/org/sonatype/plexus/plexus-cipher/1.4/plexus-cipher-1.4.jar
urls[6] = file:/home/hudson/genie.sisu/.hudson/jobs/sisu-sonar/workspace/.maven/repo/org/codehaus/plexus/plexus-utils/3.0.22/plexus-utils-3.0.22.jar
urls[7] = file:/home/hudson/genie.sisu/.hudson/jobs/sisu-sonar/workspace/.maven/repo/org/sonarsource/scanner/api/sonar-scanner-api/2.9.0.887/sonar-scanner-api-2.9.0.887.jar
urls[8] = file:/home/hudson/genie.sisu/.hudson/jobs/sisu-sonar/workspace/.maven/repo/commons-lang/commons-lang/2.6/commons-lang-2.6.jar
urls[9] = file:/home/hudson/genie.sisu/.hudson/jobs/sisu-sonar/workspace/.maven/repo/com/google/code/findbugs/jsr305/2.0.3/jsr305-2.0.3.jar
Number of foreign imports: 1
import: Entry[import  from realm ClassRealm[maven.api, parent: null]]

-----------------------------------------------------

	at org.apache.maven.plugin.DefaultBuildPluginManager.executeMojo(DefaultBuildPluginManager.java:115)
	at org.apache.maven.lifecycle.internal.MojoExecutor.execute(MojoExecutor.java:209)
	... 19 more
Caused by: org.apache.maven.plugin.PluginContainerException: Unable to load the mojo 'sonar' in the plugin 'org.sonarsource.scanner.maven:sonar-maven-plugin:3.3.0.603' due to an API incompatibility: org.codehaus.plexus.component.repository.exception.ComponentLookupException: org/sonarsource/scanner/maven/SonarQubeMojo : Unsupported major.minor version 52.0
-----------------------------------------------------
realm =    plugin>org.codehaus.mojo:sonar-maven-plugin:3.3.0.603
strategy = org.codehaus.plexus.classworlds.strategy.SelfFirstStrategy
urls[0] = file:/home/hudson/genie.sisu/.hudson/jobs/sisu-sonar/workspace/.maven/repo/org/sonarsource/scanner/maven/sonar-maven-plugin/3.3.0.603/sonar-maven-plugin-3.3.0.603.jar
urls[1] = file:/home/hudson/genie.sisu/.hudson/jobs/sisu-sonar/workspace/.maven/repo/org/apache/maven/shared/maven-dependency-tree/2.2/maven-dependency-tree-2.2.jar
urls[2] = file:/home/hudson/genie.sisu/.hudson/jobs/sisu-sonar/workspace/.maven/repo/org/codehaus/plexus/plexus-component-annotations/1.5.5/plexus-component-annotations-1.5.5.jar
urls[3] = file:/home/hudson/genie.sisu/.hudson/jobs/sisu-sonar/workspace/.maven/repo/org/eclipse/aether/aether-util/0.9.0.M2/aether-util-0.9.0.M2.jar
urls[4] = file:/home/hudson/genie.sisu/.hudson/jobs/sisu-sonar/workspace/.maven/repo/org/sonatype/plexus/plexus-sec-dispatcher/1.4/plexus-sec-dispatcher-1.4.jar
urls[5] = file:/home/hudson/genie.sisu/.hudson/jobs/sisu-sonar/workspace/.maven/repo/org/sonatype/plexus/plexus-cipher/1.4/plexus-cipher-1.4.jar
urls[6] = file:/home/hudson/genie.sisu/.hudson/jobs/sisu-sonar/workspace/.maven/repo/org/codehaus/plexus/plexus-utils/3.0.22/plexus-utils-3.0.22.jar
urls[7] = file:/home/hudson/genie.sisu/.hudson/jobs/sisu-sonar/workspace/.maven/repo/org/sonarsource/scanner/api/sonar-scanner-api/2.9.0.887/sonar-scanner-api-2.9.0.887.jar
urls[8] = file:/home/hudson/genie.sisu/.hudson/jobs/sisu-sonar/workspace/.maven/repo/commons-lang/commons-lang/2.6/commons-lang-2.6.jar
urls[9] = file:/home/hudson/genie.sisu/.hudson/jobs/sisu-sonar/workspace/.maven/repo/com/google/code/findbugs/jsr305/2.0.3/jsr305-2.0.3.jar
Number of foreign imports: 1
import: Entry[import  from realm ClassRealm[maven.api, parent: null]]

-----------------------------------------------------

	at org.apache.maven.plugin.internal.DefaultMavenPluginManager.getConfiguredMojo(DefaultMavenPluginManager.java:485)
	at org.apache.maven.plugin.DefaultBuildPluginManager.executeMojo(DefaultBuildPluginManager.java:92)
	... 20 more
Caused by: java.lang.UnsupportedClassVersionError: org/sonarsource/scanner/maven/SonarQubeMojo : Unsupported major.minor version 52.0
	at java.lang.ClassLoader.defineClass1(Native Method)
	at java.lang.ClassLoader.defineClass(ClassLoader.java:800)
	at java.security.SecureClassLoader.defineClass(SecureClassLoader.java:142)
	at java.net.URLClassLoader.defineClass(URLClassLoader.java:449)
	at java.net.URLClassLoader.access$100(URLClassLoader.java:71)
	at java.net.URLClassLoader$1.run(URLClassLoader.java:361)
	at java.net.URLClassLoader$1.run(URLClassLoader.java:355)
	at java.security.AccessController.doPrivileged(Native Method)
	at java.net.URLClassLoader.findClass(URLClassLoader.java:354)
	at org.codehaus.plexus.classworlds.realm.ClassRealm.loadClassFromSelf(ClassRealm.java:386)
	at org.codehaus.plexus.classworlds.strategy.SelfFirstStrategy.loadClass(SelfFirstStrategy.java:42)
	at org.codehaus.plexus.classworlds.realm.ClassRealm.loadClass(ClassRealm.java:244)
	at org.codehaus.plexus.classworlds.realm.ClassRealm.loadClass(ClassRealm.java:230)
	at org.sonatype.guice.bean.reflect.URLClassSpace.loadClass(URLClassSpace.java:101)
	at org.sonatype.guice.bean.reflect.NamedClass.load(NamedClass.java:45)
	at org.sonatype.guice.bean.reflect.AbstractDeferredClass.get(AbstractDeferredClass.java:45)
	at com.google.inject.internal.ProviderInternalFactory.provision(ProviderInternalFactory.java:84)
	at com.google.inject.internal.InternalFactoryToInitializableAdapter.provision(InternalFactoryToInitializableAdapter.java:52)
	at com.google.inject.internal.ProviderInternalFactory$1.call(ProviderInternalFactory.java:70)
	at com.google.inject.internal.ProvisionListenerStackCallback$Provision.provision(ProvisionListenerStackCallback.java:100)
	at org.sonatype.guice.plexus.lifecycles.PlexusLifecycleManager.onProvision(PlexusLifecycleManager.java:138)
	at com.google.inject.internal.ProvisionListenerStackCallback$Provision.provision(ProvisionListenerStackCallback.java:108)
	at com.google.inject.internal.ProvisionListenerStackCallback.provision(ProvisionListenerStackCallback.java:55)
	at com.google.inject.internal.ProviderInternalFactory.circularGet(ProviderInternalFactory.java:68)
	at com.google.inject.internal.InternalFactoryToInitializableAdapter.get(InternalFactoryToInitializableAdapter.java:45)
	at com.google.inject.internal.InjectorImpl$3$1.call(InjectorImpl.java:965)
	at com.google.inject.internal.InjectorImpl.callInContext(InjectorImpl.java:1011)
	at com.google.inject.internal.InjectorImpl$3.get(InjectorImpl.java:961)
	at com.google.inject.Scopes$1$1.get(Scopes.java:59)
	at org.sonatype.guice.bean.locators.LazyBeanEntry.getValue(LazyBeanEntry.java:83)
	at org.sonatype.guice.plexus.locators.LazyPlexusBean.getValue(LazyPlexusBean.java:49)
	at org.codehaus.plexus.DefaultPlexusContainer.lookup(DefaultPlexusContainer.java:253)
	at org.codehaus.plexus.DefaultPlexusContainer.lookup(DefaultPlexusContainer.java:245)
	at org.apache.maven.plugin.internal.DefaultMavenPluginManager.getConfiguredMojo(DefaultMavenPluginManager.java:455)
	... 21 more
[ERROR] 
[ERROR] Re-run Maven using the -X switch to enable full debug logging.
[ERROR] 
[ERROR] For more information about the errors and possible solutions, please read the following articles:
[ERROR] [Help 1] http://cwiki.apache.org/confluence/display/MAVEN/PluginContainerException
Sonar analysis completed: FAILURE
Finished: FAILURE

Powered by Hudson Open Source Continuous Integration Server from the Eclipse Foundation