Hudson logo

FailedConsole Output

Started by an SCM change
Checkout:workspace / /home/hudson/genie.sisu/.hudson/jobs/sisu-sonar/workspace - hudson.remoting.LocalChannel@5ca0afb8
Using strategy: Default
Last Built Revision: Revision 5ad3c872932ea34cbd4399536f943a8e4715f2d6 (origin/master)
Checkout:workspace / /home/hudson/genie.sisu/.hudson/jobs/sisu-sonar/workspace - hudson.remoting.LocalChannel@5ca0afb8
Fetching changes from the remote Git repository
Fetching upstream changes from git://git.eclipse.org/gitroot/sisu/org.eclipse.sisu.inject.git
Commencing build of Revision b6562ab8f64f9e9c3d697ddce03c56447c7d52f6 (origin/master)
Checking out Revision b6562ab8f64f9e9c3d697ddce03c56447c7d52f6 (origin/master)
[INFO] Using Maven 3 installation: Maven 3.0.5
[INFO] Checking Maven 3 installation environment
[workspace] $ /shared/common/apache-maven-3.0.5/bin/mvn --help
[INFO] Checking Maven 3 installation version
[INFO] Detected Maven 3 installation version: 3.0.5
[workspace] $ /shared/common/apache-maven-3.0.5/bin/mvn clean verify -V -B -Dmaven.ext.class.path=/home/hudson/genie.sisu/.hudson/maven/slavebundle/resources:/home/hudson/genie.sisu/.hudson/maven/slavebundle/lib/maven3-eventspy-3.0.jar:/home/hudson/genie.sisu/.hudson/war/webapp/WEB-INF/lib/hudson-remoting-3.0.3.jar -Dhudson.eventspy.port=33893 -Dmaven.repo.local=/home/hudson/genie.sisu/.hudson/jobs/sisu-sonar/workspace/.maven/repo -f pom.xml
[DEBUG] Waiting for connection on port: 33893
Apache Maven 3.0.5 (r01de14724cdef164cd33c7c8c2fe155faf9602da; 2013-02-19 08:51:28-0500)
Maven home: /shared/common/apache-maven-3.0.5
Java version: 1.7.0_80, vendor: Oracle Corporation
Java home: /opt/public/common/jdk1.7.0_80/jre
Default locale: en_US, platform encoding: UTF-8
OS name: "linux", version: "3.0.101-0.47.71-default", arch: "amd64", family: "unix"
[DEBUG] Connected to remote
[INFO] Scanning for projects...
[WARNING] Error initializing: org.eclipse.tycho.p2.resolver.P2DependencyResolver@4233cd6
java.lang.RuntimeException: java.io.IOException: Could not create temp dir /tmp/tycho3214740884401234414equinox
	at org.eclipse.sisu.equinox.embedder.internal.DefaultEquinoxEmbedder.checkStarted(DefaultEquinoxEmbedder.java:312)
	at org.eclipse.sisu.equinox.embedder.internal.DefaultEquinoxEmbedder.getService(DefaultEquinoxEmbedder.java:286)
	at org.eclipse.sisu.equinox.embedder.internal.DefaultEquinoxEmbedder.getService(DefaultEquinoxEmbedder.java:280)
	at org.eclipse.tycho.p2.resolver.P2DependencyResolver.initialize(P2DependencyResolver.java:428)
	at org.sonatype.guice.plexus.lifecycles.PlexusLifecycleManager.initialize(PlexusLifecycleManager.java:338)
	at org.sonatype.guice.plexus.lifecycles.PlexusLifecycleManager.manageLifecycle(PlexusLifecycleManager.java:296)
	at org.sonatype.guice.plexus.lifecycles.PlexusLifecycleManager.onProvision(PlexusLifecycleManager.java:148)
	at com.google.inject.internal.ProvisionListenerStackCallback$Provision.provision(ProvisionListenerStackCallback.java:108)
	at com.google.inject.internal.ProvisionListenerStackCallback.provision(ProvisionListenerStackCallback.java:55)
	at com.google.inject.internal.ProviderInternalFactory.circularGet(ProviderInternalFactory.java:68)
	at com.google.inject.internal.InternalFactoryToInitializableAdapter.get(InternalFactoryToInitializableAdapter.java:45)
	at com.google.inject.internal.InjectorImpl$3$1.call(InjectorImpl.java:965)
	at com.google.inject.internal.InjectorImpl.callInContext(InjectorImpl.java:1011)
	at com.google.inject.internal.InjectorImpl$3.get(InjectorImpl.java:961)
	at com.google.inject.Scopes$1$1.get(Scopes.java:59)
	at org.sonatype.guice.bean.locators.LazyBeanEntry.getValue(LazyBeanEntry.java:83)
	at org.sonatype.guice.plexus.locators.LazyPlexusBean.getValue(LazyPlexusBean.java:49)
	at org.codehaus.plexus.DefaultPlexusContainer.lookup(DefaultPlexusContainer.java:253)
	at org.codehaus.plexus.DefaultPlexusContainer.lookup(DefaultPlexusContainer.java:245)
	at org.eclipse.tycho.core.resolver.DefaultDependencyResolverFactory.lookupDependencyResolver(DefaultDependencyResolverFactory.java:74)
	at org.eclipse.tycho.core.resolver.DefaultTychoResolver.setupProject(DefaultTychoResolver.java:95)
	at org.eclipse.tycho.core.maven.TychoMavenLifecycleParticipant.afterProjectsRead(TychoMavenLifecycleParticipant.java:90)
	at org.apache.maven.DefaultMaven.doExecute(DefaultMaven.java:274)
	at org.apache.maven.DefaultMaven.execute(DefaultMaven.java:156)
	at org.apache.maven.cli.MavenCli.execute(MavenCli.java:537)
	at org.apache.maven.cli.MavenCli.doMain(MavenCli.java:196)
	at org.apache.maven.cli.MavenCli.main(MavenCli.java:141)
	at sun.reflect.NativeMethodAccessorImpl.invoke0(Native Method)
	at sun.reflect.NativeMethodAccessorImpl.invoke(NativeMethodAccessorImpl.java:57)
	at sun.reflect.DelegatingMethodAccessorImpl.invoke(DelegatingMethodAccessorImpl.java:43)
	at java.lang.reflect.Method.invoke(Method.java:606)
	at org.codehaus.plexus.classworlds.launcher.Launcher.launchEnhanced(Launcher.java:290)
	at org.codehaus.plexus.classworlds.launcher.Launcher.launch(Launcher.java:230)
	at org.codehaus.plexus.classworlds.launcher.Launcher.mainWithExitCode(Launcher.java:409)
	at org.codehaus.plexus.classworlds.launcher.Launcher.main(Launcher.java:352)
Caused by: java.io.IOException: Could not create temp dir /tmp/tycho3214740884401234414equinox
	at org.eclipse.sisu.equinox.embedder.internal.DefaultEquinoxEmbedder.copyToTempFolder(DefaultEquinoxEmbedder.java:192)
	at org.eclipse.sisu.equinox.embedder.internal.DefaultEquinoxEmbedder.doStart(DefaultEquinoxEmbedder.java:138)
	at org.eclipse.sisu.equinox.embedder.internal.DefaultEquinoxEmbedder.start(DefaultEquinoxEmbedder.java:67)
	at org.eclipse.sisu.equinox.embedder.internal.DefaultEquinoxEmbedder.checkStarted(DefaultEquinoxEmbedder.java:310)
	... 34 more
[INFO] o.h.m.e.h.MavenExecutionResultHandler - Build failed with exception(s)
[INFO] o.h.m.e.h.MavenExecutionResultHandler - [1] org.apache.maven.InternalErrorException: Internal error: java.lang.RuntimeException: Could not instantiate required component
[DEBUG] Closing connection to remote
[ERROR] Internal error: java.lang.RuntimeException: Could not instantiate required component: com.google.inject.ProvisionException: Guice provision errors:
[ERROR] 
[ERROR] 1) Error notifying ProvisionListener org.sonatype.guice.plexus.lifecycles.PlexusLifecycleManager of org.eclipse.tycho.core.DependencyResolver annotated with @com.google.inject.name.Named(value=p2).
[ERROR] Reason: java.lang.RuntimeException: java.io.IOException: Could not create temp dir /tmp/tycho3214740884401234414equinox
[ERROR] while locating org.eclipse.tycho.core.DependencyResolver annotated with @com.google.inject.name.Named(value=p2)
[ERROR] 
[ERROR] 1 error
[ERROR] role: org.eclipse.tycho.core.DependencyResolver
[ERROR] roleHint: p2
[ERROR] -> [Help 1]
org.apache.maven.InternalErrorException: Internal error: java.lang.RuntimeException: Could not instantiate required component
	at org.apache.maven.DefaultMaven.execute(DefaultMaven.java:168)
	at org.apache.maven.cli.MavenCli.execute(MavenCli.java:537)
	at org.apache.maven.cli.MavenCli.doMain(MavenCli.java:196)
	at org.apache.maven.cli.MavenCli.main(MavenCli.java:141)
	at sun.reflect.NativeMethodAccessorImpl.invoke0(Native Method)
	at sun.reflect.NativeMethodAccessorImpl.invoke(NativeMethodAccessorImpl.java:57)
	at sun.reflect.DelegatingMethodAccessorImpl.invoke(DelegatingMethodAccessorImpl.java:43)
	at java.lang.reflect.Method.invoke(Method.java:606)
	at org.codehaus.plexus.classworlds.launcher.Launcher.launchEnhanced(Launcher.java:290)
	at org.codehaus.plexus.classworlds.launcher.Launcher.launch(Launcher.java:230)
	at org.codehaus.plexus.classworlds.launcher.Launcher.mainWithExitCode(Launcher.java:409)
	at org.codehaus.plexus.classworlds.launcher.Launcher.main(Launcher.java:352)
Caused by: java.lang.RuntimeException: Could not instantiate required component
	at org.eclipse.tycho.core.resolver.DefaultDependencyResolverFactory.lookupDependencyResolver(DefaultDependencyResolverFactory.java:76)
	at org.eclipse.tycho.core.resolver.DefaultTychoResolver.setupProject(DefaultTychoResolver.java:95)
	at org.eclipse.tycho.core.maven.TychoMavenLifecycleParticipant.afterProjectsRead(TychoMavenLifecycleParticipant.java:90)
	at org.apache.maven.DefaultMaven.doExecute(DefaultMaven.java:274)
	at org.apache.maven.DefaultMaven.execute(DefaultMaven.java:156)
	... 11 more
Caused by: org.codehaus.plexus.component.repository.exception.ComponentLookupException: com.google.inject.ProvisionException: Guice provision errors:

1) Error notifying ProvisionListener org.sonatype.guice.plexus.lifecycles.PlexusLifecycleManager of org.eclipse.tycho.core.DependencyResolver annotated with @com.google.inject.name.Named(value=p2).
 Reason: java.lang.RuntimeException: java.io.IOException: Could not create temp dir /tmp/tycho3214740884401234414equinox
  while locating org.eclipse.tycho.core.DependencyResolver annotated with @com.google.inject.name.Named(value=p2)

1 error
      role: org.eclipse.tycho.core.DependencyResolver
  roleHint: p2
	at org.codehaus.plexus.DefaultPlexusContainer.lookup(DefaultPlexusContainer.java:257)
	at org.codehaus.plexus.DefaultPlexusContainer.lookup(DefaultPlexusContainer.java:245)
	at org.eclipse.tycho.core.resolver.DefaultDependencyResolverFactory.lookupDependencyResolver(DefaultDependencyResolverFactory.java:74)
	... 15 more
Caused by: com.google.inject.ProvisionException: Guice provision errors:

1) Error notifying ProvisionListener org.sonatype.guice.plexus.lifecycles.PlexusLifecycleManager of org.eclipse.tycho.core.DependencyResolver annotated with @com.google.inject.name.Named(value=p2).
 Reason: java.lang.RuntimeException: java.io.IOException: Could not create temp dir /tmp/tycho3214740884401234414equinox
  while locating org.eclipse.tycho.core.DependencyResolver annotated with @com.google.inject.name.Named(value=p2)

1 error
	at com.google.inject.internal.InjectorImpl$3.get(InjectorImpl.java:974)
	at com.google.inject.Scopes$1$1.get(Scopes.java:59)
	at org.sonatype.guice.bean.locators.LazyBeanEntry.getValue(LazyBeanEntry.java:83)
	at org.sonatype.guice.plexus.locators.LazyPlexusBean.getValue(LazyPlexusBean.java:49)
	at org.codehaus.plexus.DefaultPlexusContainer.lookup(DefaultPlexusContainer.java:253)
	... 17 more
Caused by: java.lang.RuntimeException: java.io.IOException: Could not create temp dir /tmp/tycho3214740884401234414equinox
	at org.eclipse.sisu.equinox.embedder.internal.DefaultEquinoxEmbedder.checkStarted(DefaultEquinoxEmbedder.java:312)
	at org.eclipse.sisu.equinox.embedder.internal.DefaultEquinoxEmbedder.getService(DefaultEquinoxEmbedder.java:286)
	at org.eclipse.sisu.equinox.embedder.internal.DefaultEquinoxEmbedder.getService(DefaultEquinoxEmbedder.java:280)
	at org.eclipse.tycho.p2.resolver.P2DependencyResolver.initialize(P2DependencyResolver.java:428)
	at org.sonatype.guice.plexus.lifecycles.PlexusLifecycleManager.initialize(PlexusLifecycleManager.java:338)
	at org.sonatype.guice.plexus.lifecycles.PlexusLifecycleManager.manageLifecycle(PlexusLifecycleManager.java:296)
	at org.sonatype.guice.plexus.lifecycles.PlexusLifecycleManager.onProvision(PlexusLifecycleManager.java:148)
	at com.google.inject.internal.ProvisionListenerStackCallback$Provision.provision(ProvisionListenerStackCallback.java:108)
	at com.google.inject.internal.ProvisionListenerStackCallback.provision(ProvisionListenerStackCallback.java:55)
	at com.google.inject.internal.ProviderInternalFactory.circularGet(ProviderInternalFactory.java:68)
	at com.google.inject.internal.InternalFactoryToInitializableAdapter.get(InternalFactoryToInitializableAdapter.java:45)
	at com.google.inject.internal.InjectorImpl$3$1.call(InjectorImpl.java:965)
	at com.google.inject.internal.InjectorImpl.callInContext(InjectorImpl.java:1011)
	at com.google.inject.internal.InjectorImpl$3.get(InjectorImpl.java:961)
	... 21 more
Caused by: java.io.IOException: Could not create temp dir /tmp/tycho3214740884401234414equinox
	at org.eclipse.sisu.equinox.embedder.internal.DefaultEquinoxEmbedder.copyToTempFolder(DefaultEquinoxEmbedder.java:192)
	at org.eclipse.sisu.equinox.embedder.internal.DefaultEquinoxEmbedder.doStart(DefaultEquinoxEmbedder.java:138)
	at org.eclipse.sisu.equinox.embedder.internal.DefaultEquinoxEmbedder.start(DefaultEquinoxEmbedder.java:67)
	at org.eclipse.sisu.equinox.embedder.internal.DefaultEquinoxEmbedder.checkStarted(DefaultEquinoxEmbedder.java:310)
	... 34 more
[ERROR] 
[ERROR] To see the full stack trace of the errors, re-run Maven with the -e switch.
[ERROR] Re-run Maven using the -X switch to enable full debug logging.
[ERROR] 
[ERROR] For more information about the errors and possible solutions, please read the following articles:
[ERROR] [Help 1] http://cwiki.apache.org/confluence/display/MAVEN/InternalErrorException
[DEBUG] Waiting for process to finish
[DEBUG] Result: 1
Skipping sonar analysis due to bad build status FAILURE
Finished: FAILURE

Powered by Hudson Open Source Continuous Integration Server from the Eclipse Foundation